You are viewing a plain text version of this content. The canonical link for it is here.
Posted to issues@flink.apache.org by "Matthias Pohl (Jira)" <ji...@apache.org> on 2023/01/19 13:53:00 UTC
[jira] [Updated] (FLINK-30756) StreamTableExplainTests.test_explain fails
[ https://issues.apache.org/jira/browse/FLINK-30756?page=com.atlassian.jira.plugin.system.issuetabpanels:all-tabpanel ]
Matthias Pohl updated FLINK-30756:
----------------------------------
Description:
We observed StreamTableExplainTests.test_explain failing on {{{}master{}}}. I'm marking this as a blocker because it, so far, only appeared for 1.17.
[https://dev.azure.com/apache-flink/apache-flink/_build/results?buildId=45055&view=logs&j=9cada3cb-c1d3-5621-16da-0f718fb86602&t=c67e71ed-6451-5d26-8920-5a8cf9651901&l=25533]
Also, other tests failed:
{code:java}
Jan 19 08:29:57 FAILED pyflink/table/tests/test_explain.py::StreamTableExplainTests::test_explain
Jan 19 08:29:57 FAILED pyflink/table/tests/test_sql.py::StreamSqlTests::test_sql_ddl - py4j.p...
Jan 19 08:29:57 FAILED pyflink/table/tests/test_table_environment_api.py::TableEnvironmentTest::test_explain
Jan 19 08:29:57 FAILED pyflink/table/tests/test_table_environment_api.py::TableEnvironmentTest::test_explain_with_extended
Jan 19 08:29:57 FAILED pyflink/table/tests/test_table_environment_api.py::TableEnvironmentTest::test_explain_with_multi_sinks
Jan 19 08:29:57 FAILED pyflink/table/tests/test_udaf.py::StreamTableAggregateTests::test_using_decorator {code}
was:
We observed StreamTableExplainTests.test_explain failing on {{{}master{}}}. I'm marking this as a blocker because it, so far, only appeared for 1.17.
https://dev.azure.com/apache-flink/apache-flink/_build/results?buildId=45055&view=logs&j=9cada3cb-c1d3-5621-16da-0f718fb86602&t=c67e71ed-6451-5d26-8920-5a8cf9651901&l=25533
> StreamTableExplainTests.test_explain fails
> ------------------------------------------
>
> Key: FLINK-30756
> URL: https://issues.apache.org/jira/browse/FLINK-30756
> Project: Flink
> Issue Type: Bug
> Components: API / Python
> Affects Versions: 1.17.0
> Reporter: Matthias Pohl
> Priority: Blocker
> Labels: test-stability
>
> We observed StreamTableExplainTests.test_explain failing on {{{}master{}}}. I'm marking this as a blocker because it, so far, only appeared for 1.17.
> [https://dev.azure.com/apache-flink/apache-flink/_build/results?buildId=45055&view=logs&j=9cada3cb-c1d3-5621-16da-0f718fb86602&t=c67e71ed-6451-5d26-8920-5a8cf9651901&l=25533]
> Also, other tests failed:
> {code:java}
> Jan 19 08:29:57 FAILED pyflink/table/tests/test_explain.py::StreamTableExplainTests::test_explain
> Jan 19 08:29:57 FAILED pyflink/table/tests/test_sql.py::StreamSqlTests::test_sql_ddl - py4j.p...
> Jan 19 08:29:57 FAILED pyflink/table/tests/test_table_environment_api.py::TableEnvironmentTest::test_explain
> Jan 19 08:29:57 FAILED pyflink/table/tests/test_table_environment_api.py::TableEnvironmentTest::test_explain_with_extended
> Jan 19 08:29:57 FAILED pyflink/table/tests/test_table_environment_api.py::TableEnvironmentTest::test_explain_with_multi_sinks
> Jan 19 08:29:57 FAILED pyflink/table/tests/test_udaf.py::StreamTableAggregateTests::test_using_decorator {code}
--
This message was sent by Atlassian Jira
(v8.20.10#820010)