You are viewing a plain text version of this content. The canonical link for it is here.
Posted to builds@lucene.apache.org by Apache Jenkins Server <je...@builds.apache.org> on 2025/01/08 14:28:02 UTC

[JENKINS] Lucene » Lucene-MMAPv2-Linux (s390x big endian) - Build # 759 - Unstable!

Build: https://ci-builds.apache.org/job/Lucene/job/Lucene-MMAPv2-Linux%20(s390x%20big%20endian)/759/

10 tests failed.
FAILED:  org.apache.lucene.backward_index.TestIndexUpgradeBackwardsCompatibility.testUpgradeWithNRTReader {Lucene-Version:11.0.0; Pattern: index.%1$s-nocfs.zip}

Error Message:
java.lang.AssertionError: too many neighbors: 11

Stack Trace:
java.lang.AssertionError: too many neighbors: 11
	at __randomizedtesting.SeedInfo.seed([9C147645265876CD:A0AD562255C71F10]:0)
	at org.apache.lucene.core@11.0.0-SNAPSHOT/org.apache.lucene.codecs.lucene99.Lucene99HnswVectorsReader$OffHeapHnswGraph.seek(Lucene99HnswVectorsReader.java:499)
	at org.apache.lucene.core@11.0.0-SNAPSHOT/org.apache.lucene.util.hnsw.HnswGraphSearcher.graphSeek(HnswGraphSearcher.java:266)
	at org.apache.lucene.core@11.0.0-SNAPSHOT/org.apache.lucene.util.hnsw.HnswGraphSearcher.searchLevel(HnswGraphSearcher.java:226)
	at org.apache.lucene.core@11.0.0-SNAPSHOT/org.apache.lucene.util.hnsw.HnswGraphSearcher.search(HnswGraphSearcher.java:105)
	at org.apache.lucene.core@11.0.0-SNAPSHOT/org.apache.lucene.util.hnsw.HnswGraphSearcher.search(HnswGraphSearcher.java:70)
	at org.apache.lucene.core@11.0.0-SNAPSHOT/org.apache.lucene.codecs.lucene99.Lucene99HnswVectorsReader.search(Lucene99HnswVectorsReader.java:321)
	at org.apache.lucene.core@11.0.0-SNAPSHOT/org.apache.lucene.codecs.lucene99.Lucene99HnswVectorsReader.search(Lucene99HnswVectorsReader.java:288)
	at org.apache.lucene.core@11.0.0-SNAPSHOT/org.apache.lucene.codecs.perfield.PerFieldKnnVectorsFormat$FieldsReader.search(PerFieldKnnVectorsFormat.java:313)
	at org.apache.lucene.core@11.0.0-SNAPSHOT/org.apache.lucene.index.CheckIndex.checkFloatVectorValues(CheckIndex.java:2772)
	at org.apache.lucene.core@11.0.0-SNAPSHOT/org.apache.lucene.index.CheckIndex.testVectors(CheckIndex.java:2710)
	at org.apache.lucene.core@11.0.0-SNAPSHOT/org.apache.lucene.index.CheckIndex.testSegment(CheckIndex.java:1086)
	at org.apache.lucene.core@11.0.0-SNAPSHOT/org.apache.lucene.index.CheckIndex.checkIndex(CheckIndex.java:786)
	at org.apache.lucene.core@11.0.0-SNAPSHOT/org.apache.lucene.index.CheckIndex.checkIndex(CheckIndex.java:556)
	at org.apache.lucene.test_framework@11.0.0-SNAPSHOT/org.apache.lucene.tests.util.TestUtil.checkIndex(TestUtil.java:338)
	at org.apache.lucene.test_framework@11.0.0-SNAPSHOT/org.apache.lucene.tests.store.MockDirectoryWrapper.close(MockDirectoryWrapper.java:921)
	at org.apache.lucene.core@11.0.0-SNAPSHOT/org.apache.lucene.util.IOUtils.close(IOUtils.java:85)
	at org.apache.lucene.core@11.0.0-SNAPSHOT/org.apache.lucene.util.IOUtils.close(IOUtils.java:72)
	at org.apache.lucene.backward_index.BackwardsCompatibilityTestBase.tearDown(BackwardsCompatibilityTestBase.java:156)
	at java.base/jdk.internal.reflect.DirectMethodHandleAccessor.invoke(DirectMethodHandleAccessor.java:103)
	at java.base/java.lang.reflect.Method.invoke(Method.java:580)
	at randomizedtesting.runner@2.8.1/com.carrotsearch.randomizedtesting.RandomizedRunner.invoke(RandomizedRunner.java:1758)
	at randomizedtesting.runner@2.8.1/com.carrotsearch.randomizedtesting.RandomizedRunner$10.evaluate(RandomizedRunner.java:1004)
	at org.apache.lucene.test_framework@11.0.0-SNAPSHOT/org.apache.lucene.tests.util.TestRuleSetupTeardownChained$1.evaluate(TestRuleSetupTeardownChained.java:48)
	at org.apache.lucene.test_framework@11.0.0-SNAPSHOT/org.apache.lucene.tests.util.AbstractBeforeAfterRule$1.evaluate(AbstractBeforeAfterRule.java:43)
	at org.apache.lucene.test_framework@11.0.0-SNAPSHOT/org.apache.lucene.tests.util.TestRuleThreadAndTestName$1.evaluate(TestRuleThreadAndTestName.java:45)
	at org.apache.lucene.test_framework@11.0.0-SNAPSHOT/org.apache.lucene.tests.util.TestRuleIgnoreAfterMaxFailures$1.evaluate(TestRuleIgnoreAfterMaxFailures.java:60)
	at org.apache.lucene.test_framework@11.0.0-SNAPSHOT/org.apache.lucene.tests.util.TestRuleMarkFailure$1.evaluate(TestRuleMarkFailure.java:44)
	at junit@4.13.1/org.junit.rules.RunRules.evaluate(RunRules.java:20)
	at randomizedtesting.runner@2.8.1/com.carrotsearch.randomizedtesting.rules.StatementAdapter.evaluate(StatementAdapter.java:36)
	at randomizedtesting.runner@2.8.1/com.carrotsearch.randomizedtesting.ThreadLeakControl$StatementRunner.run(ThreadLeakControl.java:390)
	at randomizedtesting.runner@2.8.1/com.carrotsearch.randomizedtesting.ThreadLeakControl.forkTimeoutingTask(ThreadLeakControl.java:843)
	at randomizedtesting.runner@2.8.1/com.carrotsearch.randomizedtesting.ThreadLeakControl$3.evaluate(ThreadLeakControl.java:490)
	at randomizedtesting.runner@2.8.1/com.carrotsearch.randomizedtesting.RandomizedRunner.runSingleTest(RandomizedRunner.java:955)
	at randomizedtesting.runner@2.8.1/com.carrotsearch.randomizedtesting.RandomizedRunner$5.evaluate(RandomizedRunner.java:840)
	at randomizedtesting.runner@2.8.1/com.carrotsearch.randomizedtesting.RandomizedRunner$6.evaluate(RandomizedRunner.java:891)
	at randomizedtesting.runner@2.8.1/com.carrotsearch.randomizedtesting.RandomizedRunner$7.evaluate(RandomizedRunner.java:902)
	at org.apache.lucene.test_framework@11.0.0-SNAPSHOT/org.apache.lucene.tests.util.AbstractBeforeAfterRule$1.evaluate(AbstractBeforeAfterRule.java:43)
	at randomizedtesting.runner@2.8.1/com.carrotsearch.randomizedtesting.rules.StatementAdapter.evaluate(StatementAdapter.java:36)
	at org.apache.lucene.test_framework@11.0.0-SNAPSHOT/org.apache.lucene.tests.util.TestRuleStoreClassName$1.evaluate(TestRuleStoreClassName.java:38)
	at randomizedtesting.runner@2.8.1/com.carrotsearch.randomizedtesting.rules.NoShadowingOrOverridesOnMethodsRule$1.evaluate(NoShadowingOrOverridesOnMethodsRule.java:40)
	at randomizedtesting.runner@2.8.1/com.carrotsearch.randomizedtesting.rules.NoShadowingOrOverridesOnMethodsRule$1.evaluate(NoShadowingOrOverridesOnMethodsRule.java:40)
	at randomizedtesting.runner@2.8.1/com.carrotsearch.randomizedtesting.rules.StatementAdapter.evaluate(StatementAdapter.java:36)
	at randomizedtesting.runner@2.8.1/com.carrotsearch.randomizedtesting.rules.StatementAdapter.evaluate(StatementAdapter.java:36)
	at org.apache.lucene.test_framework@11.0.0-SNAPSHOT/org.apache.lucene.tests.util.TestRuleAssertionsRequired$1.evaluate(TestRuleAssertionsRequired.java:53)
	at org.apache.lucene.test_framework@11.0.0-SNAPSHOT/org.apache.lucene.tests.util.AbstractBeforeAfterRule$1.evaluate(AbstractBeforeAfterRule.java:43)
	at org.apache.lucene.test_framework@11.0.0-SNAPSHOT/org.apache.lucene.tests.util.TestRuleMarkFailure$1.evaluate(TestRuleMarkFailure.java:44)
	at org.apache.lucene.test_framework@11.0.0-SNAPSHOT/org.apache.lucene.tests.util.TestRuleIgnoreAfterMaxFailures$1.evaluate(TestRuleIgnoreAfterMaxFailures.java:60)
	at org.apache.lucene.test_framework@11.0.0-SNAPSHOT/org.apache.lucene.tests.util.TestRuleIgnoreTestSuites$1.evaluate(TestRuleIgnoreTestSuites.java:47)
	at junit@4.13.1/org.junit.rules.RunRules.evaluate(RunRules.java:20)
	at randomizedtesting.runner@2.8.1/com.carrotsearch.randomizedtesting.rules.StatementAdapter.evaluate(StatementAdapter.java:36)
	at randomizedtesting.runner@2.8.1/com.carrotsearch.randomizedtesting.ThreadLeakControl$StatementRunner.run(ThreadLeakControl.java:390)
	at randomizedtesting.runner@2.8.1/com.carrotsearch.randomizedtesting.ThreadLeakControl.lambda$forkTimeoutingTask$0(ThreadLeakControl.java:850)
	at java.base/java.lang.Thread.run(Thread.java:1583)


FAILED:  org.apache.lucene.backward_index.TestIndexUpgradeBackwardsCompatibility.testIndexUpgraderCommandLineArgs {Lucene-Version:10.0.0; Pattern: index.%1$s-nocfs.zip}

Error Message:
java.lang.AssertionError: too many neighbors: 11

Stack Trace:
java.lang.AssertionError: too many neighbors: 11
	at __randomizedtesting.SeedInfo.seed([9C147645265876CD:5E046C20E9135753]:0)
	at org.apache.lucene.core@11.0.0-SNAPSHOT/org.apache.lucene.codecs.lucene99.Lucene99HnswVectorsReader$OffHeapHnswGraph.seek(Lucene99HnswVectorsReader.java:499)
	at org.apache.lucene.core@11.0.0-SNAPSHOT/org.apache.lucene.util.hnsw.HnswGraphSearcher.graphSeek(HnswGraphSearcher.java:266)
	at org.apache.lucene.core@11.0.0-SNAPSHOT/org.apache.lucene.util.hnsw.HnswGraphSearcher.searchLevel(HnswGraphSearcher.java:226)
	at org.apache.lucene.core@11.0.0-SNAPSHOT/org.apache.lucene.util.hnsw.HnswGraphSearcher.search(HnswGraphSearcher.java:105)
	at org.apache.lucene.core@11.0.0-SNAPSHOT/org.apache.lucene.util.hnsw.HnswGraphSearcher.search(HnswGraphSearcher.java:70)
	at org.apache.lucene.core@11.0.0-SNAPSHOT/org.apache.lucene.codecs.lucene99.Lucene99HnswVectorsReader.search(Lucene99HnswVectorsReader.java:321)
	at org.apache.lucene.core@11.0.0-SNAPSHOT/org.apache.lucene.codecs.lucene99.Lucene99HnswVectorsReader.search(Lucene99HnswVectorsReader.java:288)
	at org.apache.lucene.core@11.0.0-SNAPSHOT/org.apache.lucene.codecs.perfield.PerFieldKnnVectorsFormat$FieldsReader.search(PerFieldKnnVectorsFormat.java:313)
	at org.apache.lucene.core@11.0.0-SNAPSHOT/org.apache.lucene.index.CheckIndex.checkFloatVectorValues(CheckIndex.java:2772)
	at org.apache.lucene.core@11.0.0-SNAPSHOT/org.apache.lucene.index.CheckIndex.testVectors(CheckIndex.java:2710)
	at org.apache.lucene.core@11.0.0-SNAPSHOT/org.apache.lucene.index.CheckIndex.testSegment(CheckIndex.java:1086)
	at org.apache.lucene.core@11.0.0-SNAPSHOT/org.apache.lucene.index.CheckIndex.checkIndex(CheckIndex.java:786)
	at org.apache.lucene.core@11.0.0-SNAPSHOT/org.apache.lucene.index.CheckIndex.checkIndex(CheckIndex.java:556)
	at org.apache.lucene.test_framework@11.0.0-SNAPSHOT/org.apache.lucene.tests.util.TestUtil.checkIndex(TestUtil.java:338)
	at org.apache.lucene.test_framework@11.0.0-SNAPSHOT/org.apache.lucene.tests.store.MockDirectoryWrapper.close(MockDirectoryWrapper.java:921)
	at org.apache.lucene.backward_index.TestIndexUpgradeBackwardsCompatibility.testIndexUpgraderCommandLineArgs(TestIndexUpgradeBackwardsCompatibility.java:230)
	at java.base/jdk.internal.reflect.DirectMethodHandleAccessor.invoke(DirectMethodHandleAccessor.java:103)
	at java.base/java.lang.reflect.Method.invoke(Method.java:580)
	at randomizedtesting.runner@2.8.1/com.carrotsearch.randomizedtesting.RandomizedRunner.invoke(RandomizedRunner.java:1758)
	at randomizedtesting.runner@2.8.1/com.carrotsearch.randomizedtesting.RandomizedRunner$8.evaluate(RandomizedRunner.java:946)
	at randomizedtesting.runner@2.8.1/com.carrotsearch.randomizedtesting.RandomizedRunner$9.evaluate(RandomizedRunner.java:982)
	at randomizedtesting.runner@2.8.1/com.carrotsearch.randomizedtesting.RandomizedRunner$10.evaluate(RandomizedRunner.java:996)
	at org.apache.lucene.test_framework@11.0.0-SNAPSHOT/org.apache.lucene.tests.util.TestRuleSetupTeardownChained$1.evaluate(TestRuleSetupTeardownChained.java:48)
	at org.apache.lucene.test_framework@11.0.0-SNAPSHOT/org.apache.lucene.tests.util.AbstractBeforeAfterRule$1.evaluate(AbstractBeforeAfterRule.java:43)
	at org.apache.lucene.test_framework@11.0.0-SNAPSHOT/org.apache.lucene.tests.util.TestRuleThreadAndTestName$1.evaluate(TestRuleThreadAndTestName.java:45)
	at org.apache.lucene.test_framework@11.0.0-SNAPSHOT/org.apache.lucene.tests.util.TestRuleIgnoreAfterMaxFailures$1.evaluate(TestRuleIgnoreAfterMaxFailures.java:60)
	at org.apache.lucene.test_framework@11.0.0-SNAPSHOT/org.apache.lucene.tests.util.TestRuleMarkFailure$1.evaluate(TestRuleMarkFailure.java:44)
	at junit@4.13.1/org.junit.rules.RunRules.evaluate(RunRules.java:20)
	at randomizedtesting.runner@2.8.1/com.carrotsearch.randomizedtesting.rules.StatementAdapter.evaluate(StatementAdapter.java:36)
	at randomizedtesting.runner@2.8.1/com.carrotsearch.randomizedtesting.ThreadLeakControl$StatementRunner.run(ThreadLeakControl.java:390)
	at randomizedtesting.runner@2.8.1/com.carrotsearch.randomizedtesting.ThreadLeakControl.forkTimeoutingTask(ThreadLeakControl.java:843)
	at randomizedtesting.runner@2.8.1/com.carrotsearch.randomizedtesting.ThreadLeakControl$3.evaluate(ThreadLeakControl.java:490)
	at randomizedtesting.runner@2.8.1/com.carrotsearch.randomizedtesting.RandomizedRunner.runSingleTest(RandomizedRunner.java:955)
	at randomizedtesting.runner@2.8.1/com.carrotsearch.randomizedtesting.RandomizedRunner$5.evaluate(RandomizedRunner.java:840)
	at randomizedtesting.runner@2.8.1/com.carrotsearch.randomizedtesting.RandomizedRunner$6.evaluate(RandomizedRunner.java:891)
	at randomizedtesting.runner@2.8.1/com.carrotsearch.randomizedtesting.RandomizedRunner$7.evaluate(RandomizedRunner.java:902)
	at org.apache.lucene.test_framework@11.0.0-SNAPSHOT/org.apache.lucene.tests.util.AbstractBeforeAfterRule$1.evaluate(AbstractBeforeAfterRule.java:43)
	at randomizedtesting.runner@2.8.1/com.carrotsearch.randomizedtesting.rules.StatementAdapter.evaluate(StatementAdapter.java:36)
	at org.apache.lucene.test_framework@11.0.0-SNAPSHOT/org.apache.lucene.tests.util.TestRuleStoreClassName$1.evaluate(TestRuleStoreClassName.java:38)
	at randomizedtesting.runner@2.8.1/com.carrotsearch.randomizedtesting.rules.NoShadowingOrOverridesOnMethodsRule$1.evaluate(NoShadowingOrOverridesOnMethodsRule.java:40)
	at randomizedtesting.runner@2.8.1/com.carrotsearch.randomizedtesting.rules.NoShadowingOrOverridesOnMethodsRule$1.evaluate(NoShadowingOrOverridesOnMethodsRule.java:40)
	at randomizedtesting.runner@2.8.1/com.carrotsearch.randomizedtesting.rules.StatementAdapter.evaluate(StatementAdapter.java:36)
	at randomizedtesting.runner@2.8.1/com.carrotsearch.randomizedtesting.rules.StatementAdapter.evaluate(StatementAdapter.java:36)
	at org.apache.lucene.test_framework@11.0.0-SNAPSHOT/org.apache.lucene.tests.util.TestRuleAssertionsRequired$1.evaluate(TestRuleAssertionsRequired.java:53)
	at org.apache.lucene.test_framework@11.0.0-SNAPSHOT/org.apache.lucene.tests.util.AbstractBeforeAfterRule$1.evaluate(AbstractBeforeAfterRule.java:43)
	at org.apache.lucene.test_framework@11.0.0-SNAPSHOT/org.apache.lucene.tests.util.TestRuleMarkFailure$1.evaluate(TestRuleMarkFailure.java:44)
	at org.apache.lucene.test_framework@11.0.0-SNAPSHOT/org.apache.lucene.tests.util.TestRuleIgnoreAfterMaxFailures$1.evaluate(TestRuleIgnoreAfterMaxFailures.java:60)
	at org.apache.lucene.test_framework@11.0.0-SNAPSHOT/org.apache.lucene.tests.util.TestRuleIgnoreTestSuites$1.evaluate(TestRuleIgnoreTestSuites.java:47)
	at junit@4.13.1/org.junit.rules.RunRules.evaluate(RunRules.java:20)
	at randomizedtesting.runner@2.8.1/com.carrotsearch.randomizedtesting.rules.StatementAdapter.evaluate(StatementAdapter.java:36)
	at randomizedtesting.runner@2.8.1/com.carrotsearch.randomizedtesting.ThreadLeakControl$StatementRunner.run(ThreadLeakControl.java:390)
	at randomizedtesting.runner@2.8.1/com.carrotsearch.randomizedtesting.ThreadLeakControl.lambda$forkTimeoutingTask$0(ThreadLeakControl.java:850)
	at java.base/java.lang.Thread.run(Thread.java:1583)


FAILED:  org.apache.lucene.backward_index.TestIndexUpgradeBackwardsCompatibility.testUpgradeOldIndex {Lucene-Version:10.0.0; Pattern: index.%1$s-nocfs.zip}

Error Message:
java.lang.AssertionError: too many neighbors: 11

Stack Trace:
java.lang.AssertionError: too many neighbors: 11
	at __randomizedtesting.SeedInfo.seed([9C147645265876CD:E22777D00ABB885E]:0)
	at org.apache.lucene.core@11.0.0-SNAPSHOT/org.apache.lucene.codecs.lucene99.Lucene99HnswVectorsReader$OffHeapHnswGraph.seek(Lucene99HnswVectorsReader.java:499)
	at org.apache.lucene.core@11.0.0-SNAPSHOT/org.apache.lucene.util.hnsw.HnswGraphSearcher.graphSeek(HnswGraphSearcher.java:266)
	at org.apache.lucene.core@11.0.0-SNAPSHOT/org.apache.lucene.util.hnsw.HnswGraphSearcher.searchLevel(HnswGraphSearcher.java:226)
	at org.apache.lucene.core@11.0.0-SNAPSHOT/org.apache.lucene.util.hnsw.HnswGraphSearcher.search(HnswGraphSearcher.java:105)
	at org.apache.lucene.core@11.0.0-SNAPSHOT/org.apache.lucene.util.hnsw.HnswGraphSearcher.search(HnswGraphSearcher.java:70)
	at org.apache.lucene.core@11.0.0-SNAPSHOT/org.apache.lucene.codecs.lucene99.Lucene99HnswVectorsReader.search(Lucene99HnswVectorsReader.java:321)
	at org.apache.lucene.core@11.0.0-SNAPSHOT/org.apache.lucene.codecs.lucene99.Lucene99HnswVectorsReader.search(Lucene99HnswVectorsReader.java:288)
	at org.apache.lucene.core@11.0.0-SNAPSHOT/org.apache.lucene.codecs.perfield.PerFieldKnnVectorsFormat$FieldsReader.search(PerFieldKnnVectorsFormat.java:313)
	at org.apache.lucene.core@11.0.0-SNAPSHOT/org.apache.lucene.index.CheckIndex.checkFloatVectorValues(CheckIndex.java:2772)
	at org.apache.lucene.core@11.0.0-SNAPSHOT/org.apache.lucene.index.CheckIndex.testVectors(CheckIndex.java:2710)
	at org.apache.lucene.core@11.0.0-SNAPSHOT/org.apache.lucene.index.CheckIndex.testSegment(CheckIndex.java:1086)
	at org.apache.lucene.core@11.0.0-SNAPSHOT/org.apache.lucene.index.CheckIndex.checkIndex(CheckIndex.java:786)
	at org.apache.lucene.core@11.0.0-SNAPSHOT/org.apache.lucene.index.CheckIndex.checkIndex(CheckIndex.java:556)
	at org.apache.lucene.test_framework@11.0.0-SNAPSHOT/org.apache.lucene.tests.util.TestUtil.checkIndex(TestUtil.java:338)
	at org.apache.lucene.test_framework@11.0.0-SNAPSHOT/org.apache.lucene.tests.store.MockDirectoryWrapper.close(MockDirectoryWrapper.java:921)
	at org.apache.lucene.core@11.0.0-SNAPSHOT/org.apache.lucene.util.IOUtils.close(IOUtils.java:85)
	at org.apache.lucene.core@11.0.0-SNAPSHOT/org.apache.lucene.util.IOUtils.close(IOUtils.java:72)
	at org.apache.lucene.backward_index.BackwardsCompatibilityTestBase.tearDown(BackwardsCompatibilityTestBase.java:156)
	at java.base/jdk.internal.reflect.DirectMethodHandleAccessor.invoke(DirectMethodHandleAccessor.java:103)
	at java.base/java.lang.reflect.Method.invoke(Method.java:580)
	at randomizedtesting.runner@2.8.1/com.carrotsearch.randomizedtesting.RandomizedRunner.invoke(RandomizedRunner.java:1758)
	at randomizedtesting.runner@2.8.1/com.carrotsearch.randomizedtesting.RandomizedRunner$10.evaluate(RandomizedRunner.java:1004)
	at org.apache.lucene.test_framework@11.0.0-SNAPSHOT/org.apache.lucene.tests.util.TestRuleSetupTeardownChained$1.evaluate(TestRuleSetupTeardownChained.java:48)
	at org.apache.lucene.test_framework@11.0.0-SNAPSHOT/org.apache.lucene.tests.util.AbstractBeforeAfterRule$1.evaluate(AbstractBeforeAfterRule.java:43)
	at org.apache.lucene.test_framework@11.0.0-SNAPSHOT/org.apache.lucene.tests.util.TestRuleThreadAndTestName$1.evaluate(TestRuleThreadAndTestName.java:45)
	at org.apache.lucene.test_framework@11.0.0-SNAPSHOT/org.apache.lucene.tests.util.TestRuleIgnoreAfterMaxFailures$1.evaluate(TestRuleIgnoreAfterMaxFailures.java:60)
	at org.apache.lucene.test_framework@11.0.0-SNAPSHOT/org.apache.lucene.tests.util.TestRuleMarkFailure$1.evaluate(TestRuleMarkFailure.java:44)
	at junit@4.13.1/org.junit.rules.RunRules.evaluate(RunRules.java:20)
	at randomizedtesting.runner@2.8.1/com.carrotsearch.randomizedtesting.rules.StatementAdapter.evaluate(StatementAdapter.java:36)
	at randomizedtesting.runner@2.8.1/com.carrotsearch.randomizedtesting.ThreadLeakControl$StatementRunner.run(ThreadLeakControl.java:390)
	at randomizedtesting.runner@2.8.1/com.carrotsearch.randomizedtesting.ThreadLeakControl.forkTimeoutingTask(ThreadLeakControl.java:843)
	at randomizedtesting.runner@2.8.1/com.carrotsearch.randomizedtesting.ThreadLeakControl$3.evaluate(ThreadLeakControl.java:490)
	at randomizedtesting.runner@2.8.1/com.carrotsearch.randomizedtesting.RandomizedRunner.runSingleTest(RandomizedRunner.java:955)
	at randomizedtesting.runner@2.8.1/com.carrotsearch.randomizedtesting.RandomizedRunner$5.evaluate(RandomizedRunner.java:840)
	at randomizedtesting.runner@2.8.1/com.carrotsearch.randomizedtesting.RandomizedRunner$6.evaluate(RandomizedRunner.java:891)
	at randomizedtesting.runner@2.8.1/com.carrotsearch.randomizedtesting.RandomizedRunner$7.evaluate(RandomizedRunner.java:902)
	at org.apache.lucene.test_framework@11.0.0-SNAPSHOT/org.apache.lucene.tests.util.AbstractBeforeAfterRule$1.evaluate(AbstractBeforeAfterRule.java:43)
	at randomizedtesting.runner@2.8.1/com.carrotsearch.randomizedtesting.rules.StatementAdapter.evaluate(StatementAdapter.java:36)
	at org.apache.lucene.test_framework@11.0.0-SNAPSHOT/org.apache.lucene.tests.util.TestRuleStoreClassName$1.evaluate(TestRuleStoreClassName.java:38)
	at randomizedtesting.runner@2.8.1/com.carrotsearch.randomizedtesting.rules.NoShadowingOrOverridesOnMethodsRule$1.evaluate(NoShadowingOrOverridesOnMethodsRule.java:40)
	at randomizedtesting.runner@2.8.1/com.carrotsearch.randomizedtesting.rules.NoShadowingOrOverridesOnMethodsRule$1.evaluate(NoShadowingOrOverridesOnMethodsRule.java:40)
	at randomizedtesting.runner@2.8.1/com.carrotsearch.randomizedtesting.rules.StatementAdapter.evaluate(StatementAdapter.java:36)
	at randomizedtesting.runner@2.8.1/com.carrotsearch.randomizedtesting.rules.StatementAdapter.evaluate(StatementAdapter.java:36)
	at org.apache.lucene.test_framework@11.0.0-SNAPSHOT/org.apache.lucene.tests.util.TestRuleAssertionsRequired$1.evaluate(TestRuleAssertionsRequired.java:53)
	at org.apache.lucene.test_framework@11.0.0-SNAPSHOT/org.apache.lucene.tests.util.AbstractBeforeAfterRule$1.evaluate(AbstractBeforeAfterRule.java:43)
	at org.apache.lucene.test_framework@11.0.0-SNAPSHOT/org.apache.lucene.tests.util.TestRuleMarkFailure$1.evaluate(TestRuleMarkFailure.java:44)
	at org.apache.lucene.test_framework@11.0.0-SNAPSHOT/org.apache.lucene.tests.util.TestRuleIgnoreAfterMaxFailures$1.evaluate(TestRuleIgnoreAfterMaxFailures.java:60)
	at org.apache.lucene.test_framework@11.0.0-SNAPSHOT/org.apache.lucene.tests.util.TestRuleIgnoreTestSuites$1.evaluate(TestRuleIgnoreTestSuites.java:47)
	at junit@4.13.1/org.junit.rules.RunRules.evaluate(RunRules.java:20)
	at randomizedtesting.runner@2.8.1/com.carrotsearch.randomizedtesting.rules.StatementAdapter.evaluate(StatementAdapter.java:36)
	at randomizedtesting.runner@2.8.1/com.carrotsearch.randomizedtesting.ThreadLeakControl$StatementRunner.run(ThreadLeakControl.java:390)
	at randomizedtesting.runner@2.8.1/com.carrotsearch.randomizedtesting.ThreadLeakControl.lambda$forkTimeoutingTask$0(ThreadLeakControl.java:850)
	at java.base/java.lang.Thread.run(Thread.java:1583)


FAILED:  org.apache.lucene.backward_index.TestIndexUpgradeBackwardsCompatibility.testIndexUpgraderCommandLineArgs {Lucene-Version:10.0.0; Pattern: index.%1$s-cfs.zip}

Error Message:
java.lang.AssertionError: too many neighbors: 11

Stack Trace:
java.lang.AssertionError: too many neighbors: 11
	at __randomizedtesting.SeedInfo.seed([9C147645265876CD:5E046C20E9135753]:0)
	at org.apache.lucene.core@11.0.0-SNAPSHOT/org.apache.lucene.codecs.lucene99.Lucene99HnswVectorsReader$OffHeapHnswGraph.seek(Lucene99HnswVectorsReader.java:499)
	at org.apache.lucene.core@11.0.0-SNAPSHOT/org.apache.lucene.util.hnsw.HnswGraphSearcher.graphSeek(HnswGraphSearcher.java:266)
	at org.apache.lucene.core@11.0.0-SNAPSHOT/org.apache.lucene.util.hnsw.HnswGraphSearcher.searchLevel(HnswGraphSearcher.java:226)
	at org.apache.lucene.core@11.0.0-SNAPSHOT/org.apache.lucene.util.hnsw.HnswGraphSearcher.search(HnswGraphSearcher.java:105)
	at org.apache.lucene.core@11.0.0-SNAPSHOT/org.apache.lucene.util.hnsw.HnswGraphSearcher.search(HnswGraphSearcher.java:70)
	at org.apache.lucene.core@11.0.0-SNAPSHOT/org.apache.lucene.codecs.lucene99.Lucene99HnswVectorsReader.search(Lucene99HnswVectorsReader.java:321)
	at org.apache.lucene.core@11.0.0-SNAPSHOT/org.apache.lucene.codecs.lucene99.Lucene99HnswVectorsReader.search(Lucene99HnswVectorsReader.java:288)
	at org.apache.lucene.core@11.0.0-SNAPSHOT/org.apache.lucene.codecs.perfield.PerFieldKnnVectorsFormat$FieldsReader.search(PerFieldKnnVectorsFormat.java:313)
	at org.apache.lucene.core@11.0.0-SNAPSHOT/org.apache.lucene.index.CheckIndex.checkFloatVectorValues(CheckIndex.java:2772)
	at org.apache.lucene.core@11.0.0-SNAPSHOT/org.apache.lucene.index.CheckIndex.testVectors(CheckIndex.java:2710)
	at org.apache.lucene.core@11.0.0-SNAPSHOT/org.apache.lucene.index.CheckIndex.testSegment(CheckIndex.java:1086)
	at org.apache.lucene.core@11.0.0-SNAPSHOT/org.apache.lucene.index.CheckIndex.checkIndex(CheckIndex.java:786)
	at org.apache.lucene.core@11.0.0-SNAPSHOT/org.apache.lucene.index.CheckIndex.checkIndex(CheckIndex.java:556)
	at org.apache.lucene.test_framework@11.0.0-SNAPSHOT/org.apache.lucene.tests.util.TestUtil.checkIndex(TestUtil.java:338)
	at org.apache.lucene.test_framework@11.0.0-SNAPSHOT/org.apache.lucene.tests.store.MockDirectoryWrapper.close(MockDirectoryWrapper.java:921)
	at org.apache.lucene.backward_index.TestIndexUpgradeBackwardsCompatibility.testIndexUpgraderCommandLineArgs(TestIndexUpgradeBackwardsCompatibility.java:230)
	at java.base/jdk.internal.reflect.DirectMethodHandleAccessor.invoke(DirectMethodHandleAccessor.java:103)
	at java.base/java.lang.reflect.Method.invoke(Method.java:580)
	at randomizedtesting.runner@2.8.1/com.carrotsearch.randomizedtesting.RandomizedRunner.invoke(RandomizedRunner.java:1758)
	at randomizedtesting.runner@2.8.1/com.carrotsearch.randomizedtesting.RandomizedRunner$8.evaluate(RandomizedRunner.java:946)
	at randomizedtesting.runner@2.8.1/com.carrotsearch.randomizedtesting.RandomizedRunner$9.evaluate(RandomizedRunner.java:982)
	at randomizedtesting.runner@2.8.1/com.carrotsearch.randomizedtesting.RandomizedRunner$10.evaluate(RandomizedRunner.java:996)
	at org.apache.lucene.test_framework@11.0.0-SNAPSHOT/org.apache.lucene.tests.util.TestRuleSetupTeardownChained$1.evaluate(TestRuleSetupTeardownChained.java:48)
	at org.apache.lucene.test_framework@11.0.0-SNAPSHOT/org.apache.lucene.tests.util.AbstractBeforeAfterRule$1.evaluate(AbstractBeforeAfterRule.java:43)
	at org.apache.lucene.test_framework@11.0.0-SNAPSHOT/org.apache.lucene.tests.util.TestRuleThreadAndTestName$1.evaluate(TestRuleThreadAndTestName.java:45)
	at org.apache.lucene.test_framework@11.0.0-SNAPSHOT/org.apache.lucene.tests.util.TestRuleIgnoreAfterMaxFailures$1.evaluate(TestRuleIgnoreAfterMaxFailures.java:60)
	at org.apache.lucene.test_framework@11.0.0-SNAPSHOT/org.apache.lucene.tests.util.TestRuleMarkFailure$1.evaluate(TestRuleMarkFailure.java:44)
	at junit@4.13.1/org.junit.rules.RunRules.evaluate(RunRules.java:20)
	at randomizedtesting.runner@2.8.1/com.carrotsearch.randomizedtesting.rules.StatementAdapter.evaluate(StatementAdapter.java:36)
	at randomizedtesting.runner@2.8.1/com.carrotsearch.randomizedtesting.ThreadLeakControl$StatementRunner.run(ThreadLeakControl.java:390)
	at randomizedtesting.runner@2.8.1/com.carrotsearch.randomizedtesting.ThreadLeakControl.forkTimeoutingTask(ThreadLeakControl.java:843)
	at randomizedtesting.runner@2.8.1/com.carrotsearch.randomizedtesting.ThreadLeakControl$3.evaluate(ThreadLeakControl.java:490)
	at randomizedtesting.runner@2.8.1/com.carrotsearch.randomizedtesting.RandomizedRunner.runSingleTest(RandomizedRunner.java:955)
	at randomizedtesting.runner@2.8.1/com.carrotsearch.randomizedtesting.RandomizedRunner$5.evaluate(RandomizedRunner.java:840)
	at randomizedtesting.runner@2.8.1/com.carrotsearch.randomizedtesting.RandomizedRunner$6.evaluate(RandomizedRunner.java:891)
	at randomizedtesting.runner@2.8.1/com.carrotsearch.randomizedtesting.RandomizedRunner$7.evaluate(RandomizedRunner.java:902)
	at org.apache.lucene.test_framework@11.0.0-SNAPSHOT/org.apache.lucene.tests.util.AbstractBeforeAfterRule$1.evaluate(AbstractBeforeAfterRule.java:43)
	at randomizedtesting.runner@2.8.1/com.carrotsearch.randomizedtesting.rules.StatementAdapter.evaluate(StatementAdapter.java:36)
	at org.apache.lucene.test_framework@11.0.0-SNAPSHOT/org.apache.lucene.tests.util.TestRuleStoreClassName$1.evaluate(TestRuleStoreClassName.java:38)
	at randomizedtesting.runner@2.8.1/com.carrotsearch.randomizedtesting.rules.NoShadowingOrOverridesOnMethodsRule$1.evaluate(NoShadowingOrOverridesOnMethodsRule.java:40)
	at randomizedtesting.runner@2.8.1/com.carrotsearch.randomizedtesting.rules.NoShadowingOrOverridesOnMethodsRule$1.evaluate(NoShadowingOrOverridesOnMethodsRule.java:40)
	at randomizedtesting.runner@2.8.1/com.carrotsearch.randomizedtesting.rules.StatementAdapter.evaluate(StatementAdapter.java:36)
	at randomizedtesting.runner@2.8.1/com.carrotsearch.randomizedtesting.rules.StatementAdapter.evaluate(StatementAdapter.java:36)
	at org.apache.lucene.test_framework@11.0.0-SNAPSHOT/org.apache.lucene.tests.util.TestRuleAssertionsRequired$1.evaluate(TestRuleAssertionsRequired.java:53)
	at org.apache.lucene.test_framework@11.0.0-SNAPSHOT/org.apache.lucene.tests.util.AbstractBeforeAfterRule$1.evaluate(AbstractBeforeAfterRule.java:43)
	at org.apache.lucene.test_framework@11.0.0-SNAPSHOT/org.apache.lucene.tests.util.TestRuleMarkFailure$1.evaluate(TestRuleMarkFailure.java:44)
	at org.apache.lucene.test_framework@11.0.0-SNAPSHOT/org.apache.lucene.tests.util.TestRuleIgnoreAfterMaxFailures$1.evaluate(TestRuleIgnoreAfterMaxFailures.java:60)
	at org.apache.lucene.test_framework@11.0.0-SNAPSHOT/org.apache.lucene.tests.util.TestRuleIgnoreTestSuites$1.evaluate(TestRuleIgnoreTestSuites.java:47)
	at junit@4.13.1/org.junit.rules.RunRules.evaluate(RunRules.java:20)
	at randomizedtesting.runner@2.8.1/com.carrotsearch.randomizedtesting.rules.StatementAdapter.evaluate(StatementAdapter.java:36)
	at randomizedtesting.runner@2.8.1/com.carrotsearch.randomizedtesting.ThreadLeakControl$StatementRunner.run(ThreadLeakControl.java:390)
	at randomizedtesting.runner@2.8.1/com.carrotsearch.randomizedtesting.ThreadLeakControl.lambda$forkTimeoutingTask$0(ThreadLeakControl.java:850)
	at java.base/java.lang.Thread.run(Thread.java:1583)


FAILED:  org.apache.lucene.backward_index.TestIndexUpgradeBackwardsCompatibility.testUpgradeOldIndex {Lucene-Version:10.0.0; Pattern: index.%1$s-cfs.zip}

Error Message:
java.lang.AssertionError: too many neighbors: 11

Stack Trace:
java.lang.AssertionError: too many neighbors: 11
	at __randomizedtesting.SeedInfo.seed([9C147645265876CD:E22777D00ABB885E]:0)
	at org.apache.lucene.core@11.0.0-SNAPSHOT/org.apache.lucene.codecs.lucene99.Lucene99HnswVectorsReader$OffHeapHnswGraph.seek(Lucene99HnswVectorsReader.java:499)
	at org.apache.lucene.core@11.0.0-SNAPSHOT/org.apache.lucene.util.hnsw.HnswGraphSearcher.graphSeek(HnswGraphSearcher.java:266)
	at org.apache.lucene.core@11.0.0-SNAPSHOT/org.apache.lucene.util.hnsw.HnswGraphSearcher.searchLevel(HnswGraphSearcher.java:226)
	at org.apache.lucene.core@11.0.0-SNAPSHOT/org.apache.lucene.util.hnsw.HnswGraphSearcher.search(HnswGraphSearcher.java:105)
	at org.apache.lucene.core@11.0.0-SNAPSHOT/org.apache.lucene.util.hnsw.HnswGraphSearcher.search(HnswGraphSearcher.java:70)
	at org.apache.lucene.core@11.0.0-SNAPSHOT/org.apache.lucene.codecs.lucene99.Lucene99HnswVectorsReader.search(Lucene99HnswVectorsReader.java:321)
	at org.apache.lucene.core@11.0.0-SNAPSHOT/org.apache.lucene.codecs.lucene99.Lucene99HnswVectorsReader.search(Lucene99HnswVectorsReader.java:288)
	at org.apache.lucene.core@11.0.0-SNAPSHOT/org.apache.lucene.codecs.perfield.PerFieldKnnVectorsFormat$FieldsReader.search(PerFieldKnnVectorsFormat.java:313)
	at org.apache.lucene.core@11.0.0-SNAPSHOT/org.apache.lucene.index.CheckIndex.checkFloatVectorValues(CheckIndex.java:2772)
	at org.apache.lucene.core@11.0.0-SNAPSHOT/org.apache.lucene.index.CheckIndex.testVectors(CheckIndex.java:2710)
	at org.apache.lucene.core@11.0.0-SNAPSHOT/org.apache.lucene.index.CheckIndex.testSegment(CheckIndex.java:1086)
	at org.apache.lucene.core@11.0.0-SNAPSHOT/org.apache.lucene.index.CheckIndex.checkIndex(CheckIndex.java:786)
	at org.apache.lucene.core@11.0.0-SNAPSHOT/org.apache.lucene.index.CheckIndex.checkIndex(CheckIndex.java:556)
	at org.apache.lucene.test_framework@11.0.0-SNAPSHOT/org.apache.lucene.tests.util.TestUtil.checkIndex(TestUtil.java:338)
	at org.apache.lucene.test_framework@11.0.0-SNAPSHOT/org.apache.lucene.tests.store.MockDirectoryWrapper.close(MockDirectoryWrapper.java:921)
	at org.apache.lucene.core@11.0.0-SNAPSHOT/org.apache.lucene.util.IOUtils.close(IOUtils.java:85)
	at org.apache.lucene.core@11.0.0-SNAPSHOT/org.apache.lucene.util.IOUtils.close(IOUtils.java:72)
	at org.apache.lucene.backward_index.BackwardsCompatibilityTestBase.tearDown(BackwardsCompatibilityTestBase.java:156)
	at java.base/jdk.internal.reflect.DirectMethodHandleAccessor.invoke(DirectMethodHandleAccessor.java:103)
	at java.base/java.lang.reflect.Method.invoke(Method.java:580)
	at randomizedtesting.runner@2.8.1/com.carrotsearch.randomizedtesting.RandomizedRunner.invoke(RandomizedRunner.java:1758)
	at randomizedtesting.runner@2.8.1/com.carrotsearch.randomizedtesting.RandomizedRunner$10.evaluate(RandomizedRunner.java:1004)
	at org.apache.lucene.test_framework@11.0.0-SNAPSHOT/org.apache.lucene.tests.util.TestRuleSetupTeardownChained$1.evaluate(TestRuleSetupTeardownChained.java:48)
	at org.apache.lucene.test_framework@11.0.0-SNAPSHOT/org.apache.lucene.tests.util.AbstractBeforeAfterRule$1.evaluate(AbstractBeforeAfterRule.java:43)
	at org.apache.lucene.test_framework@11.0.0-SNAPSHOT/org.apache.lucene.tests.util.TestRuleThreadAndTestName$1.evaluate(TestRuleThreadAndTestName.java:45)
	at org.apache.lucene.test_framework@11.0.0-SNAPSHOT/org.apache.lucene.tests.util.TestRuleIgnoreAfterMaxFailures$1.evaluate(TestRuleIgnoreAfterMaxFailures.java:60)
	at org.apache.lucene.test_framework@11.0.0-SNAPSHOT/org.apache.lucene.tests.util.TestRuleMarkFailure$1.evaluate(TestRuleMarkFailure.java:44)
	at junit@4.13.1/org.junit.rules.RunRules.evaluate(RunRules.java:20)
	at randomizedtesting.runner@2.8.1/com.carrotsearch.randomizedtesting.rules.StatementAdapter.evaluate(StatementAdapter.java:36)
	at randomizedtesting.runner@2.8.1/com.carrotsearch.randomizedtesting.ThreadLeakControl$StatementRunner.run(ThreadLeakControl.java:390)
	at randomizedtesting.runner@2.8.1/com.carrotsearch.randomizedtesting.ThreadLeakControl.forkTimeoutingTask(ThreadLeakControl.java:843)
	at randomizedtesting.runner@2.8.1/com.carrotsearch.randomizedtesting.ThreadLeakControl$3.evaluate(ThreadLeakControl.java:490)
	at randomizedtesting.runner@2.8.1/com.carrotsearch.randomizedtesting.RandomizedRunner.runSingleTest(RandomizedRunner.java:955)
	at randomizedtesting.runner@2.8.1/com.carrotsearch.randomizedtesting.RandomizedRunner$5.evaluate(RandomizedRunner.java:840)
	at randomizedtesting.runner@2.8.1/com.carrotsearch.randomizedtesting.RandomizedRunner$6.evaluate(RandomizedRunner.java:891)
	at randomizedtesting.runner@2.8.1/com.carrotsearch.randomizedtesting.RandomizedRunner$7.evaluate(RandomizedRunner.java:902)
	at org.apache.lucene.test_framework@11.0.0-SNAPSHOT/org.apache.lucene.tests.util.AbstractBeforeAfterRule$1.evaluate(AbstractBeforeAfterRule.java:43)
	at randomizedtesting.runner@2.8.1/com.carrotsearch.randomizedtesting.rules.StatementAdapter.evaluate(StatementAdapter.java:36)
	at org.apache.lucene.test_framework@11.0.0-SNAPSHOT/org.apache.lucene.tests.util.TestRuleStoreClassName$1.evaluate(TestRuleStoreClassName.java:38)
	at randomizedtesting.runner@2.8.1/com.carrotsearch.randomizedtesting.rules.NoShadowingOrOverridesOnMethodsRule$1.evaluate(NoShadowingOrOverridesOnMethodsRule.java:40)
	at randomizedtesting.runner@2.8.1/com.carrotsearch.randomizedtesting.rules.NoShadowingOrOverridesOnMethodsRule$1.evaluate(NoShadowingOrOverridesOnMethodsRule.java:40)
	at randomizedtesting.runner@2.8.1/com.carrotsearch.randomizedtesting.rules.StatementAdapter.evaluate(StatementAdapter.java:36)
	at randomizedtesting.runner@2.8.1/com.carrotsearch.randomizedtesting.rules.StatementAdapter.evaluate(StatementAdapter.java:36)
	at org.apache.lucene.test_framework@11.0.0-SNAPSHOT/org.apache.lucene.tests.util.TestRuleAssertionsRequired$1.evaluate(TestRuleAssertionsRequired.java:53)
	at org.apache.lucene.test_framework@11.0.0-SNAPSHOT/org.apache.lucene.tests.util.AbstractBeforeAfterRule$1.evaluate(AbstractBeforeAfterRule.java:43)
	at org.apache.lucene.test_framework@11.0.0-SNAPSHOT/org.apache.lucene.tests.util.TestRuleMarkFailure$1.evaluate(TestRuleMarkFailure.java:44)
	at org.apache.lucene.test_framework@11.0.0-SNAPSHOT/org.apache.lucene.tests.util.TestRuleIgnoreAfterMaxFailures$1.evaluate(TestRuleIgnoreAfterMaxFailures.java:60)
	at org.apache.lucene.test_framework@11.0.0-SNAPSHOT/org.apache.lucene.tests.util.TestRuleIgnoreTestSuites$1.evaluate(TestRuleIgnoreTestSuites.java:47)
	at junit@4.13.1/org.junit.rules.RunRules.evaluate(RunRules.java:20)
	at randomizedtesting.runner@2.8.1/com.carrotsearch.randomizedtesting.rules.StatementAdapter.evaluate(StatementAdapter.java:36)
	at randomizedtesting.runner@2.8.1/com.carrotsearch.randomizedtesting.ThreadLeakControl$StatementRunner.run(ThreadLeakControl.java:390)
	at randomizedtesting.runner@2.8.1/com.carrotsearch.randomizedtesting.ThreadLeakControl.lambda$forkTimeoutingTask$0(ThreadLeakControl.java:850)
	at java.base/java.lang.Thread.run(Thread.java:1583)


FAILED:  org.apache.lucene.backward_index.TestIndexUpgradeBackwardsCompatibility.testUpgradeWithNRTReader {Lucene-Version:11.0.0; Pattern: index.%1$s-cfs.zip}

Error Message:
java.lang.AssertionError: too many neighbors: 11

Stack Trace:
java.lang.AssertionError: too many neighbors: 11
	at __randomizedtesting.SeedInfo.seed([9C147645265876CD:A0AD562255C71F10]:0)
	at org.apache.lucene.core@11.0.0-SNAPSHOT/org.apache.lucene.codecs.lucene99.Lucene99HnswVectorsReader$OffHeapHnswGraph.seek(Lucene99HnswVectorsReader.java:499)
	at org.apache.lucene.core@11.0.0-SNAPSHOT/org.apache.lucene.util.hnsw.HnswGraphSearcher.graphSeek(HnswGraphSearcher.java:266)
	at org.apache.lucene.core@11.0.0-SNAPSHOT/org.apache.lucene.util.hnsw.HnswGraphSearcher.searchLevel(HnswGraphSearcher.java:226)
	at org.apache.lucene.core@11.0.0-SNAPSHOT/org.apache.lucene.util.hnsw.HnswGraphSearcher.search(HnswGraphSearcher.java:105)
	at org.apache.lucene.core@11.0.0-SNAPSHOT/org.apache.lucene.util.hnsw.HnswGraphSearcher.search(HnswGraphSearcher.java:70)
	at org.apache.lucene.core@11.0.0-SNAPSHOT/org.apache.lucene.codecs.lucene99.Lucene99HnswVectorsReader.search(Lucene99HnswVectorsReader.java:321)
	at org.apache.lucene.core@11.0.0-SNAPSHOT/org.apache.lucene.codecs.lucene99.Lucene99HnswVectorsReader.search(Lucene99HnswVectorsReader.java:288)
	at org.apache.lucene.core@11.0.0-SNAPSHOT/org.apache.lucene.codecs.perfield.PerFieldKnnVectorsFormat$FieldsReader.search(PerFieldKnnVectorsFormat.java:313)
	at org.apache.lucene.core@11.0.0-SNAPSHOT/org.apache.lucene.index.CheckIndex.checkFloatVectorValues(CheckIndex.java:2772)
	at org.apache.lucene.core@11.0.0-SNAPSHOT/org.apache.lucene.index.CheckIndex.testVectors(CheckIndex.java:2710)
	at org.apache.lucene.core@11.0.0-SNAPSHOT/org.apache.lucene.index.CheckIndex.testSegment(CheckIndex.java:1086)
	at org.apache.lucene.core@11.0.0-SNAPSHOT/org.apache.lucene.index.CheckIndex.checkIndex(CheckIndex.java:786)
	at org.apache.lucene.core@11.0.0-SNAPSHOT/org.apache.lucene.index.CheckIndex.checkIndex(CheckIndex.java:556)
	at org.apache.lucene.test_framework@11.0.0-SNAPSHOT/org.apache.lucene.tests.util.TestUtil.checkIndex(TestUtil.java:338)
	at org.apache.lucene.test_framework@11.0.0-SNAPSHOT/org.apache.lucene.tests.store.MockDirectoryWrapper.close(MockDirectoryWrapper.java:921)
	at org.apache.lucene.core@11.0.0-SNAPSHOT/org.apache.lucene.util.IOUtils.close(IOUtils.java:85)
	at org.apache.lucene.core@11.0.0-SNAPSHOT/org.apache.lucene.util.IOUtils.close(IOUtils.java:72)
	at org.apache.lucene.backward_index.BackwardsCompatibilityTestBase.tearDown(BackwardsCompatibilityTestBase.java:156)
	at java.base/jdk.internal.reflect.DirectMethodHandleAccessor.invoke(DirectMethodHandleAccessor.java:103)
	at java.base/java.lang.reflect.Method.invoke(Method.java:580)
	at randomizedtesting.runner@2.8.1/com.carrotsearch.randomizedtesting.RandomizedRunner.invoke(RandomizedRunner.java:1758)
	at randomizedtesting.runner@2.8.1/com.carrotsearch.randomizedtesting.RandomizedRunner$10.evaluate(RandomizedRunner.java:1004)
	at org.apache.lucene.test_framework@11.0.0-SNAPSHOT/org.apache.lucene.tests.util.TestRuleSetupTeardownChained$1.evaluate(TestRuleSetupTeardownChained.java:48)
	at org.apache.lucene.test_framework@11.0.0-SNAPSHOT/org.apache.lucene.tests.util.AbstractBeforeAfterRule$1.evaluate(AbstractBeforeAfterRule.java:43)
	at org.apache.lucene.test_framework@11.0.0-SNAPSHOT/org.apache.lucene.tests.util.TestRuleThreadAndTestName$1.evaluate(TestRuleThreadAndTestName.java:45)
	at org.apache.lucene.test_framework@11.0.0-SNAPSHOT/org.apache.lucene.tests.util.TestRuleIgnoreAfterMaxFailures$1.evaluate(TestRuleIgnoreAfterMaxFailures.java:60)
	at org.apache.lucene.test_framework@11.0.0-SNAPSHOT/org.apache.lucene.tests.util.TestRuleMarkFailure$1.evaluate(TestRuleMarkFailure.java:44)
	at junit@4.13.1/org.junit.rules.RunRules.evaluate(RunRules.java:20)
	at randomizedtesting.runner@2.8.1/com.carrotsearch.randomizedtesting.rules.StatementAdapter.evaluate(StatementAdapter.java:36)
	at randomizedtesting.runner@2.8.1/com.carrotsearch.randomizedtesting.ThreadLeakControl$StatementRunner.run(ThreadLeakControl.java:390)
	at randomizedtesting.runner@2.8.1/com.carrotsearch.randomizedtesting.ThreadLeakControl.forkTimeoutingTask(ThreadLeakControl.java:843)
	at randomizedtesting.runner@2.8.1/com.carrotsearch.randomizedtesting.ThreadLeakControl$3.evaluate(ThreadLeakControl.java:490)
	at randomizedtesting.runner@2.8.1/com.carrotsearch.randomizedtesting.RandomizedRunner.runSingleTest(RandomizedRunner.java:955)
	at randomizedtesting.runner@2.8.1/com.carrotsearch.randomizedtesting.RandomizedRunner$5.evaluate(RandomizedRunner.java:840)
	at randomizedtesting.runner@2.8.1/com.carrotsearch.randomizedtesting.RandomizedRunner$6.evaluate(RandomizedRunner.java:891)
	at randomizedtesting.runner@2.8.1/com.carrotsearch.randomizedtesting.RandomizedRunner$7.evaluate(RandomizedRunner.java:902)
	at org.apache.lucene.test_framework@11.0.0-SNAPSHOT/org.apache.lucene.tests.util.AbstractBeforeAfterRule$1.evaluate(AbstractBeforeAfterRule.java:43)
	at randomizedtesting.runner@2.8.1/com.carrotsearch.randomizedtesting.rules.StatementAdapter.evaluate(StatementAdapter.java:36)
	at org.apache.lucene.test_framework@11.0.0-SNAPSHOT/org.apache.lucene.tests.util.TestRuleStoreClassName$1.evaluate(TestRuleStoreClassName.java:38)
	at randomizedtesting.runner@2.8.1/com.carrotsearch.randomizedtesting.rules.NoShadowingOrOverridesOnMethodsRule$1.evaluate(NoShadowingOrOverridesOnMethodsRule.java:40)
	at randomizedtesting.runner@2.8.1/com.carrotsearch.randomizedtesting.rules.NoShadowingOrOverridesOnMethodsRule$1.evaluate(NoShadowingOrOverridesOnMethodsRule.java:40)
	at randomizedtesting.runner@2.8.1/com.carrotsearch.randomizedtesting.rules.StatementAdapter.evaluate(StatementAdapter.java:36)
	at randomizedtesting.runner@2.8.1/com.carrotsearch.randomizedtesting.rules.StatementAdapter.evaluate(StatementAdapter.java:36)
	at org.apache.lucene.test_framework@11.0.0-SNAPSHOT/org.apache.lucene.tests.util.TestRuleAssertionsRequired$1.evaluate(TestRuleAssertionsRequired.java:53)
	at org.apache.lucene.test_framework@11.0.0-SNAPSHOT/org.apache.lucene.tests.util.AbstractBeforeAfterRule$1.evaluate(AbstractBeforeAfterRule.java:43)
	at org.apache.lucene.test_framework@11.0.0-SNAPSHOT/org.apache.lucene.tests.util.TestRuleMarkFailure$1.evaluate(TestRuleMarkFailure.java:44)
	at org.apache.lucene.test_framework@11.0.0-SNAPSHOT/org.apache.lucene.tests.util.TestRuleIgnoreAfterMaxFailures$1.evaluate(TestRuleIgnoreAfterMaxFailures.java:60)
	at org.apache.lucene.test_framework@11.0.0-SNAPSHOT/org.apache.lucene.tests.util.TestRuleIgnoreTestSuites$1.evaluate(TestRuleIgnoreTestSuites.java:47)
	at junit@4.13.1/org.junit.rules.RunRules.evaluate(RunRules.java:20)
	at randomizedtesting.runner@2.8.1/com.carrotsearch.randomizedtesting.rules.StatementAdapter.evaluate(StatementAdapter.java:36)
	at randomizedtesting.runner@2.8.1/com.carrotsearch.randomizedtesting.ThreadLeakControl$StatementRunner.run(ThreadLeakControl.java:390)
	at randomizedtesting.runner@2.8.1/com.carrotsearch.randomizedtesting.ThreadLeakControl.lambda$forkTimeoutingTask$0(ThreadLeakControl.java:850)
	at java.base/java.lang.Thread.run(Thread.java:1583)


FAILED:  org.apache.lucene.backward_index.TestIndexUpgradeBackwardsCompatibility.testIndexUpgraderCommandLineArgs {Lucene-Version:10.1.0; Pattern: index.%1$s-nocfs.zip}

Error Message:
java.lang.AssertionError: too many neighbors: 11

Stack Trace:
java.lang.AssertionError: too many neighbors: 11
	at __randomizedtesting.SeedInfo.seed([9C147645265876CD:5E046C20E9135753]:0)
	at org.apache.lucene.core@11.0.0-SNAPSHOT/org.apache.lucene.codecs.lucene99.Lucene99HnswVectorsReader$OffHeapHnswGraph.seek(Lucene99HnswVectorsReader.java:499)
	at org.apache.lucene.core@11.0.0-SNAPSHOT/org.apache.lucene.util.hnsw.HnswGraphSearcher.graphSeek(HnswGraphSearcher.java:266)
	at org.apache.lucene.core@11.0.0-SNAPSHOT/org.apache.lucene.util.hnsw.HnswGraphSearcher.searchLevel(HnswGraphSearcher.java:226)
	at org.apache.lucene.core@11.0.0-SNAPSHOT/org.apache.lucene.util.hnsw.HnswGraphSearcher.search(HnswGraphSearcher.java:105)
	at org.apache.lucene.core@11.0.0-SNAPSHOT/org.apache.lucene.util.hnsw.HnswGraphSearcher.search(HnswGraphSearcher.java:70)
	at org.apache.lucene.core@11.0.0-SNAPSHOT/org.apache.lucene.codecs.lucene99.Lucene99HnswVectorsReader.search(Lucene99HnswVectorsReader.java:321)
	at org.apache.lucene.core@11.0.0-SNAPSHOT/org.apache.lucene.codecs.lucene99.Lucene99HnswVectorsReader.search(Lucene99HnswVectorsReader.java:288)
	at org.apache.lucene.core@11.0.0-SNAPSHOT/org.apache.lucene.codecs.perfield.PerFieldKnnVectorsFormat$FieldsReader.search(PerFieldKnnVectorsFormat.java:313)
	at org.apache.lucene.core@11.0.0-SNAPSHOT/org.apache.lucene.index.CheckIndex.checkFloatVectorValues(CheckIndex.java:2772)
	at org.apache.lucene.core@11.0.0-SNAPSHOT/org.apache.lucene.index.CheckIndex.testVectors(CheckIndex.java:2710)
	at org.apache.lucene.core@11.0.0-SNAPSHOT/org.apache.lucene.index.CheckIndex.testSegment(CheckIndex.java:1086)
	at org.apache.lucene.core@11.0.0-SNAPSHOT/org.apache.lucene.index.CheckIndex.checkIndex(CheckIndex.java:786)
	at org.apache.lucene.core@11.0.0-SNAPSHOT/org.apache.lucene.index.CheckIndex.checkIndex(CheckIndex.java:556)
	at org.apache.lucene.test_framework@11.0.0-SNAPSHOT/org.apache.lucene.tests.util.TestUtil.checkIndex(TestUtil.java:338)
	at org.apache.lucene.test_framework@11.0.0-SNAPSHOT/org.apache.lucene.tests.store.MockDirectoryWrapper.close(MockDirectoryWrapper.java:921)
	at org.apache.lucene.backward_index.TestIndexUpgradeBackwardsCompatibility.testIndexUpgraderCommandLineArgs(TestIndexUpgradeBackwardsCompatibility.java:230)
	at java.base/jdk.internal.reflect.DirectMethodHandleAccessor.invoke(DirectMethodHandleAccessor.java:103)
	at java.base/java.lang.reflect.Method.invoke(Method.java:580)
	at randomizedtesting.runner@2.8.1/com.carrotsearch.randomizedtesting.RandomizedRunner.invoke(RandomizedRunner.java:1758)
	at randomizedtesting.runner@2.8.1/com.carrotsearch.randomizedtesting.RandomizedRunner$8.evaluate(RandomizedRunner.java:946)
	at randomizedtesting.runner@2.8.1/com.carrotsearch.randomizedtesting.RandomizedRunner$9.evaluate(RandomizedRunner.java:982)
	at randomizedtesting.runner@2.8.1/com.carrotsearch.randomizedtesting.RandomizedRunner$10.evaluate(RandomizedRunner.java:996)
	at org.apache.lucene.test_framework@11.0.0-SNAPSHOT/org.apache.lucene.tests.util.TestRuleSetupTeardownChained$1.evaluate(TestRuleSetupTeardownChained.java:48)
	at org.apache.lucene.test_framework@11.0.0-SNAPSHOT/org.apache.lucene.tests.util.AbstractBeforeAfterRule$1.evaluate(AbstractBeforeAfterRule.java:43)
	at org.apache.lucene.test_framework@11.0.0-SNAPSHOT/org.apache.lucene.tests.util.TestRuleThreadAndTestName$1.evaluate(TestRuleThreadAndTestName.java:45)
	at org.apache.lucene.test_framework@11.0.0-SNAPSHOT/org.apache.lucene.tests.util.TestRuleIgnoreAfterMaxFailures$1.evaluate(TestRuleIgnoreAfterMaxFailures.java:60)
	at org.apache.lucene.test_framework@11.0.0-SNAPSHOT/org.apache.lucene.tests.util.TestRuleMarkFailure$1.evaluate(TestRuleMarkFailure.java:44)
	at junit@4.13.1/org.junit.rules.RunRules.evaluate(RunRules.java:20)
	at randomizedtesting.runner@2.8.1/com.carrotsearch.randomizedtesting.rules.StatementAdapter.evaluate(StatementAdapter.java:36)
	at randomizedtesting.runner@2.8.1/com.carrotsearch.randomizedtesting.ThreadLeakControl$StatementRunner.run(ThreadLeakControl.java:390)
	at randomizedtesting.runner@2.8.1/com.carrotsearch.randomizedtesting.ThreadLeakControl.forkTimeoutingTask(ThreadLeakControl.java:843)
	at randomizedtesting.runner@2.8.1/com.carrotsearch.randomizedtesting.ThreadLeakControl$3.evaluate(ThreadLeakControl.java:490)
	at randomizedtesting.runner@2.8.1/com.carrotsearch.randomizedtesting.RandomizedRunner.runSingleTest(RandomizedRunner.java:955)
	at randomizedtesting.runner@2.8.1/com.carrotsearch.randomizedtesting.RandomizedRunner$5.evaluate(RandomizedRunner.java:840)
	at randomizedtesting.runner@2.8.1/com.carrotsearch.randomizedtesting.RandomizedRunner$6.evaluate(RandomizedRunner.java:891)
	at randomizedtesting.runner@2.8.1/com.carrotsearch.randomizedtesting.RandomizedRunner$7.evaluate(RandomizedRunner.java:902)
	at org.apache.lucene.test_framework@11.0.0-SNAPSHOT/org.apache.lucene.tests.util.AbstractBeforeAfterRule$1.evaluate(AbstractBeforeAfterRule.java:43)
	at randomizedtesting.runner@2.8.1/com.carrotsearch.randomizedtesting.rules.StatementAdapter.evaluate(StatementAdapter.java:36)
	at org.apache.lucene.test_framework@11.0.0-SNAPSHOT/org.apache.lucene.tests.util.TestRuleStoreClassName$1.evaluate(TestRuleStoreClassName.java:38)
	at randomizedtesting.runner@2.8.1/com.carrotsearch.randomizedtesting.rules.NoShadowingOrOverridesOnMethodsRule$1.evaluate(NoShadowingOrOverridesOnMethodsRule.java:40)
	at randomizedtesting.runner@2.8.1/com.carrotsearch.randomizedtesting.rules.NoShadowingOrOverridesOnMethodsRule$1.evaluate(NoShadowingOrOverridesOnMethodsRule.java:40)
	at randomizedtesting.runner@2.8.1/com.carrotsearch.randomizedtesting.rules.StatementAdapter.evaluate(StatementAdapter.java:36)
	at randomizedtesting.runner@2.8.1/com.carrotsearch.randomizedtesting.rules.StatementAdapter.evaluate(StatementAdapter.java:36)
	at org.apache.lucene.test_framework@11.0.0-SNAPSHOT/org.apache.lucene.tests.util.TestRuleAssertionsRequired$1.evaluate(TestRuleAssertionsRequired.java:53)
	at org.apache.lucene.test_framework@11.0.0-SNAPSHOT/org.apache.lucene.tests.util.AbstractBeforeAfterRule$1.evaluate(AbstractBeforeAfterRule.java:43)
	at org.apache.lucene.test_framework@11.0.0-SNAPSHOT/org.apache.lucene.tests.util.TestRuleMarkFailure$1.evaluate(TestRuleMarkFailure.java:44)
	at org.apache.lucene.test_framework@11.0.0-SNAPSHOT/org.apache.lucene.tests.util.TestRuleIgnoreAfterMaxFailures$1.evaluate(TestRuleIgnoreAfterMaxFailures.java:60)
	at org.apache.lucene.test_framework@11.0.0-SNAPSHOT/org.apache.lucene.tests.util.TestRuleIgnoreTestSuites$1.evaluate(TestRuleIgnoreTestSuites.java:47)
	at junit@4.13.1/org.junit.rules.RunRules.evaluate(RunRules.java:20)
	at randomizedtesting.runner@2.8.1/com.carrotsearch.randomizedtesting.rules.StatementAdapter.evaluate(StatementAdapter.java:36)
	at randomizedtesting.runner@2.8.1/com.carrotsearch.randomizedtesting.ThreadLeakControl$StatementRunner.run(ThreadLeakControl.java:390)
	at randomizedtesting.runner@2.8.1/com.carrotsearch.randomizedtesting.ThreadLeakControl.lambda$forkTimeoutingTask$0(ThreadLeakControl.java:850)
	at java.base/java.lang.Thread.run(Thread.java:1583)


FAILED:  org.apache.lucene.backward_index.TestIndexUpgradeBackwardsCompatibility.testUpgradeOldIndex {Lucene-Version:10.1.0; Pattern: index.%1$s-nocfs.zip}

Error Message:
java.lang.AssertionError: too many neighbors: 11

Stack Trace:
java.lang.AssertionError: too many neighbors: 11
	at __randomizedtesting.SeedInfo.seed([9C147645265876CD:E22777D00ABB885E]:0)
	at org.apache.lucene.core@11.0.0-SNAPSHOT/org.apache.lucene.codecs.lucene99.Lucene99HnswVectorsReader$OffHeapHnswGraph.seek(Lucene99HnswVectorsReader.java:499)
	at org.apache.lucene.core@11.0.0-SNAPSHOT/org.apache.lucene.util.hnsw.HnswGraphSearcher.graphSeek(HnswGraphSearcher.java:266)
	at org.apache.lucene.core@11.0.0-SNAPSHOT/org.apache.lucene.util.hnsw.HnswGraphSearcher.searchLevel(HnswGraphSearcher.java:226)
	at org.apache.lucene.core@11.0.0-SNAPSHOT/org.apache.lucene.util.hnsw.HnswGraphSearcher.search(HnswGraphSearcher.java:105)
	at org.apache.lucene.core@11.0.0-SNAPSHOT/org.apache.lucene.util.hnsw.HnswGraphSearcher.search(HnswGraphSearcher.java:70)
	at org.apache.lucene.core@11.0.0-SNAPSHOT/org.apache.lucene.codecs.lucene99.Lucene99HnswVectorsReader.search(Lucene99HnswVectorsReader.java:321)
	at org.apache.lucene.core@11.0.0-SNAPSHOT/org.apache.lucene.codecs.lucene99.Lucene99HnswVectorsReader.search(Lucene99HnswVectorsReader.java:288)
	at org.apache.lucene.core@11.0.0-SNAPSHOT/org.apache.lucene.codecs.perfield.PerFieldKnnVectorsFormat$FieldsReader.search(PerFieldKnnVectorsFormat.java:313)
	at org.apache.lucene.core@11.0.0-SNAPSHOT/org.apache.lucene.index.CheckIndex.checkFloatVectorValues(CheckIndex.java:2772)
	at org.apache.lucene.core@11.0.0-SNAPSHOT/org.apache.lucene.index.CheckIndex.testVectors(CheckIndex.java:2710)
	at org.apache.lucene.core@11.0.0-SNAPSHOT/org.apache.lucene.index.CheckIndex.testSegment(CheckIndex.java:1086)
	at org.apache.lucene.core@11.0.0-SNAPSHOT/org.apache.lucene.index.CheckIndex.checkIndex(CheckIndex.java:786)
	at org.apache.lucene.core@11.0.0-SNAPSHOT/org.apache.lucene.index.CheckIndex.checkIndex(CheckIndex.java:556)
	at org.apache.lucene.test_framework@11.0.0-SNAPSHOT/org.apache.lucene.tests.util.TestUtil.checkIndex(TestUtil.java:338)
	at org.apache.lucene.test_framework@11.0.0-SNAPSHOT/org.apache.lucene.tests.store.MockDirectoryWrapper.close(MockDirectoryWrapper.java:921)
	at org.apache.lucene.core@11.0.0-SNAPSHOT/org.apache.lucene.util.IOUtils.close(IOUtils.java:85)
	at org.apache.lucene.core@11.0.0-SNAPSHOT/org.apache.lucene.util.IOUtils.close(IOUtils.java:72)
	at org.apache.lucene.backward_index.BackwardsCompatibilityTestBase.tearDown(BackwardsCompatibilityTestBase.java:156)
	at java.base/jdk.internal.reflect.DirectMethodHandleAccessor.invoke(DirectMethodHandleAccessor.java:103)
	at java.base/java.lang.reflect.Method.invoke(Method.java:580)
	at randomizedtesting.runner@2.8.1/com.carrotsearch.randomizedtesting.RandomizedRunner.invoke(RandomizedRunner.java:1758)
	at randomizedtesting.runner@2.8.1/com.carrotsearch.randomizedtesting.RandomizedRunner$10.evaluate(RandomizedRunner.java:1004)
	at org.apache.lucene.test_framework@11.0.0-SNAPSHOT/org.apache.lucene.tests.util.TestRuleSetupTeardownChained$1.evaluate(TestRuleSetupTeardownChained.java:48)
	at org.apache.lucene.test_framework@11.0.0-SNAPSHOT/org.apache.lucene.tests.util.AbstractBeforeAfterRule$1.evaluate(AbstractBeforeAfterRule.java:43)
	at org.apache.lucene.test_framework@11.0.0-SNAPSHOT/org.apache.lucene.tests.util.TestRuleThreadAndTestName$1.evaluate(TestRuleThreadAndTestName.java:45)
	at org.apache.lucene.test_framework@11.0.0-SNAPSHOT/org.apache.lucene.tests.util.TestRuleIgnoreAfterMaxFailures$1.evaluate(TestRuleIgnoreAfterMaxFailures.java:60)
	at org.apache.lucene.test_framework@11.0.0-SNAPSHOT/org.apache.lucene.tests.util.TestRuleMarkFailure$1.evaluate(TestRuleMarkFailure.java:44)
	at junit@4.13.1/org.junit.rules.RunRules.evaluate(RunRules.java:20)
	at randomizedtesting.runner@2.8.1/com.carrotsearch.randomizedtesting.rules.StatementAdapter.evaluate(StatementAdapter.java:36)
	at randomizedtesting.runner@2.8.1/com.carrotsearch.randomizedtesting.ThreadLeakControl$StatementRunner.run(ThreadLeakControl.java:390)
	at randomizedtesting.runner@2.8.1/com.carrotsearch.randomizedtesting.ThreadLeakControl.forkTimeoutingTask(ThreadLeakControl.java:843)
	at randomizedtesting.runner@2.8.1/com.carrotsearch.randomizedtesting.ThreadLeakControl$3.evaluate(ThreadLeakControl.java:490)
	at randomizedtesting.runner@2.8.1/com.carrotsearch.randomizedtesting.RandomizedRunner.runSingleTest(RandomizedRunner.java:955)
	at randomizedtesting.runner@2.8.1/com.carrotsearch.randomizedtesting.RandomizedRunner$5.evaluate(RandomizedRunner.java:840)
	at randomizedtesting.runner@2.8.1/com.carrotsearch.randomizedtesting.RandomizedRunner$6.evaluate(RandomizedRunner.java:891)
	at randomizedtesting.runner@2.8.1/com.carrotsearch.randomizedtesting.RandomizedRunner$7.evaluate(RandomizedRunner.java:902)
	at org.apache.lucene.test_framework@11.0.0-SNAPSHOT/org.apache.lucene.tests.util.AbstractBeforeAfterRule$1.evaluate(AbstractBeforeAfterRule.java:43)
	at randomizedtesting.runner@2.8.1/com.carrotsearch.randomizedtesting.rules.StatementAdapter.evaluate(StatementAdapter.java:36)
	at org.apache.lucene.test_framework@11.0.0-SNAPSHOT/org.apache.lucene.tests.util.TestRuleStoreClassName$1.evaluate(TestRuleStoreClassName.java:38)
	at randomizedtesting.runner@2.8.1/com.carrotsearch.randomizedtesting.rules.NoShadowingOrOverridesOnMethodsRule$1.evaluate(NoShadowingOrOverridesOnMethodsRule.java:40)
	at randomizedtesting.runner@2.8.1/com.carrotsearch.randomizedtesting.rules.NoShadowingOrOverridesOnMethodsRule$1.evaluate(NoShadowingOrOverridesOnMethodsRule.java:40)
	at randomizedtesting.runner@2.8.1/com.carrotsearch.randomizedtesting.rules.StatementAdapter.evaluate(StatementAdapter.java:36)
	at randomizedtesting.runner@2.8.1/com.carrotsearch.randomizedtesting.rules.StatementAdapter.evaluate(StatementAdapter.java:36)
	at org.apache.lucene.test_framework@11.0.0-SNAPSHOT/org.apache.lucene.tests.util.TestRuleAssertionsRequired$1.evaluate(TestRuleAssertionsRequired.java:53)
	at org.apache.lucene.test_framework@11.0.0-SNAPSHOT/org.apache.lucene.tests.util.AbstractBeforeAfterRule$1.evaluate(AbstractBeforeAfterRule.java:43)
	at org.apache.lucene.test_framework@11.0.0-SNAPSHOT/org.apache.lucene.tests.util.TestRuleMarkFailure$1.evaluate(TestRuleMarkFailure.java:44)
	at org.apache.lucene.test_framework@11.0.0-SNAPSHOT/org.apache.lucene.tests.util.TestRuleIgnoreAfterMaxFailures$1.evaluate(TestRuleIgnoreAfterMaxFailures.java:60)
	at org.apache.lucene.test_framework@11.0.0-SNAPSHOT/org.apache.lucene.tests.util.TestRuleIgnoreTestSuites$1.evaluate(TestRuleIgnoreTestSuites.java:47)
	at junit@4.13.1/org.junit.rules.RunRules.evaluate(RunRules.java:20)
	at randomizedtesting.runner@2.8.1/com.carrotsearch.randomizedtesting.rules.StatementAdapter.evaluate(StatementAdapter.java:36)
	at randomizedtesting.runner@2.8.1/com.carrotsearch.randomizedtesting.ThreadLeakControl$StatementRunner.run(ThreadLeakControl.java:390)
	at randomizedtesting.runner@2.8.1/com.carrotsearch.randomizedtesting.ThreadLeakControl.lambda$forkTimeoutingTask$0(ThreadLeakControl.java:850)
	at java.base/java.lang.Thread.run(Thread.java:1583)


FAILED:  org.apache.lucene.backward_index.TestIndexUpgradeBackwardsCompatibility.testIndexUpgraderCommandLineArgs {Lucene-Version:10.1.0; Pattern: index.%1$s-cfs.zip}

Error Message:
java.lang.AssertionError: too many neighbors: 11

Stack Trace:
java.lang.AssertionError: too many neighbors: 11
	at __randomizedtesting.SeedInfo.seed([9C147645265876CD:5E046C20E9135753]:0)
	at org.apache.lucene.core@11.0.0-SNAPSHOT/org.apache.lucene.codecs.lucene99.Lucene99HnswVectorsReader$OffHeapHnswGraph.seek(Lucene99HnswVectorsReader.java:499)
	at org.apache.lucene.core@11.0.0-SNAPSHOT/org.apache.lucene.util.hnsw.HnswGraphSearcher.graphSeek(HnswGraphSearcher.java:266)
	at org.apache.lucene.core@11.0.0-SNAPSHOT/org.apache.lucene.util.hnsw.HnswGraphSearcher.searchLevel(HnswGraphSearcher.java:226)
	at org.apache.lucene.core@11.0.0-SNAPSHOT/org.apache.lucene.util.hnsw.HnswGraphSearcher.search(HnswGraphSearcher.java:105)
	at org.apache.lucene.core@11.0.0-SNAPSHOT/org.apache.lucene.util.hnsw.HnswGraphSearcher.search(HnswGraphSearcher.java:70)
	at org.apache.lucene.core@11.0.0-SNAPSHOT/org.apache.lucene.codecs.lucene99.Lucene99HnswVectorsReader.search(Lucene99HnswVectorsReader.java:321)
	at org.apache.lucene.core@11.0.0-SNAPSHOT/org.apache.lucene.codecs.lucene99.Lucene99HnswVectorsReader.search(Lucene99HnswVectorsReader.java:288)
	at org.apache.lucene.core@11.0.0-SNAPSHOT/org.apache.lucene.codecs.perfield.PerFieldKnnVectorsFormat$FieldsReader.search(PerFieldKnnVectorsFormat.java:313)
	at org.apache.lucene.core@11.0.0-SNAPSHOT/org.apache.lucene.index.CheckIndex.checkFloatVectorValues(CheckIndex.java:2772)
	at org.apache.lucene.core@11.0.0-SNAPSHOT/org.apache.lucene.index.CheckIndex.testVectors(CheckIndex.java:2710)
	at org.apache.lucene.core@11.0.0-SNAPSHOT/org.apache.lucene.index.CheckIndex.testSegment(CheckIndex.java:1086)
	at org.apache.lucene.core@11.0.0-SNAPSHOT/org.apache.lucene.index.CheckIndex.checkIndex(CheckIndex.java:786)
	at org.apache.lucene.core@11.0.0-SNAPSHOT/org.apache.lucene.index.CheckIndex.checkIndex(CheckIndex.java:556)
	at org.apache.lucene.test_framework@11.0.0-SNAPSHOT/org.apache.lucene.tests.util.TestUtil.checkIndex(TestUtil.java:338)
	at org.apache.lucene.test_framework@11.0.0-SNAPSHOT/org.apache.lucene.tests.store.MockDirectoryWrapper.close(MockDirectoryWrapper.java:921)
	at org.apache.lucene.backward_index.TestIndexUpgradeBackwardsCompatibility.testIndexUpgraderCommandLineArgs(TestIndexUpgradeBackwardsCompatibility.java:230)
	at java.base/jdk.internal.reflect.DirectMethodHandleAccessor.invoke(DirectMethodHandleAccessor.java:103)
	at java.base/java.lang.reflect.Method.invoke(Method.java:580)
	at randomizedtesting.runner@2.8.1/com.carrotsearch.randomizedtesting.RandomizedRunner.invoke(RandomizedRunner.java:1758)
	at randomizedtesting.runner@2.8.1/com.carrotsearch.randomizedtesting.RandomizedRunner$8.evaluate(RandomizedRunner.java:946)
	at randomizedtesting.runner@2.8.1/com.carrotsearch.randomizedtesting.RandomizedRunner$9.evaluate(RandomizedRunner.java:982)
	at randomizedtesting.runner@2.8.1/com.carrotsearch.randomizedtesting.RandomizedRunner$10.evaluate(RandomizedRunner.java:996)
	at org.apache.lucene.test_framework@11.0.0-SNAPSHOT/org.apache.lucene.tests.util.TestRuleSetupTeardownChained$1.evaluate(TestRuleSetupTeardownChained.java:48)
	at org.apache.lucene.test_framework@11.0.0-SNAPSHOT/org.apache.lucene.tests.util.AbstractBeforeAfterRule$1.evaluate(AbstractBeforeAfterRule.java:43)
	at org.apache.lucene.test_framework@11.0.0-SNAPSHOT/org.apache.lucene.tests.util.TestRuleThreadAndTestName$1.evaluate(TestRuleThreadAndTestName.java:45)
	at org.apache.lucene.test_framework@11.0.0-SNAPSHOT/org.apache.lucene.tests.util.TestRuleIgnoreAfterMaxFailures$1.evaluate(TestRuleIgnoreAfterMaxFailures.java:60)
	at org.apache.lucene.test_framework@11.0.0-SNAPSHOT/org.apache.lucene.tests.util.TestRuleMarkFailure$1.evaluate(TestRuleMarkFailure.java:44)
	at junit@4.13.1/org.junit.rules.RunRules.evaluate(RunRules.java:20)
	at randomizedtesting.runner@2.8.1/com.carrotsearch.randomizedtesting.rules.StatementAdapter.evaluate(StatementAdapter.java:36)
	at randomizedtesting.runner@2.8.1/com.carrotsearch.randomizedtesting.ThreadLeakControl$StatementRunner.run(ThreadLeakControl.java:390)
	at randomizedtesting.runner@2.8.1/com.carrotsearch.randomizedtesting.ThreadLeakControl.forkTimeoutingTask(ThreadLeakControl.java:843)
	at randomizedtesting.runner@2.8.1/com.carrotsearch.randomizedtesting.ThreadLeakControl$3.evaluate(ThreadLeakControl.java:490)
	at randomizedtesting.runner@2.8.1/com.carrotsearch.randomizedtesting.RandomizedRunner.runSingleTest(RandomizedRunner.java:955)
	at randomizedtesting.runner@2.8.1/com.carrotsearch.randomizedtesting.RandomizedRunner$5.evaluate(RandomizedRunner.java:840)
	at randomizedtesting.runner@2.8.1/com.carrotsearch.randomizedtesting.RandomizedRunner$6.evaluate(RandomizedRunner.java:891)
	at randomizedtesting.runner@2.8.1/com.carrotsearch.randomizedtesting.RandomizedRunner$7.evaluate(RandomizedRunner.java:902)
	at org.apache.lucene.test_framework@11.0.0-SNAPSHOT/org.apache.lucene.tests.util.AbstractBeforeAfterRule$1.evaluate(AbstractBeforeAfterRule.java:43)
	at randomizedtesting.runner@2.8.1/com.carrotsearch.randomizedtesting.rules.StatementAdapter.evaluate(StatementAdapter.java:36)
	at org.apache.lucene.test_framework@11.0.0-SNAPSHOT/org.apache.lucene.tests.util.TestRuleStoreClassName$1.evaluate(TestRuleStoreClassName.java:38)
	at randomizedtesting.runner@2.8.1/com.carrotsearch.randomizedtesting.rules.NoShadowingOrOverridesOnMethodsRule$1.evaluate(NoShadowingOrOverridesOnMethodsRule.java:40)
	at randomizedtesting.runner@2.8.1/com.carrotsearch.randomizedtesting.rules.NoShadowingOrOverridesOnMethodsRule$1.evaluate(NoShadowingOrOverridesOnMethodsRule.java:40)
	at randomizedtesting.runner@2.8.1/com.carrotsearch.randomizedtesting.rules.StatementAdapter.evaluate(StatementAdapter.java:36)
	at randomizedtesting.runner@2.8.1/com.carrotsearch.randomizedtesting.rules.StatementAdapter.evaluate(StatementAdapter.java:36)
	at org.apache.lucene.test_framework@11.0.0-SNAPSHOT/org.apache.lucene.tests.util.TestRuleAssertionsRequired$1.evaluate(TestRuleAssertionsRequired.java:53)
	at org.apache.lucene.test_framework@11.0.0-SNAPSHOT/org.apache.lucene.tests.util.AbstractBeforeAfterRule$1.evaluate(AbstractBeforeAfterRule.java:43)
	at org.apache.lucene.test_framework@11.0.0-SNAPSHOT/org.apache.lucene.tests.util.TestRuleMarkFailure$1.evaluate(TestRuleMarkFailure.java:44)
	at org.apache.lucene.test_framework@11.0.0-SNAPSHOT/org.apache.lucene.tests.util.TestRuleIgnoreAfterMaxFailures$1.evaluate(TestRuleIgnoreAfterMaxFailures.java:60)
	at org.apache.lucene.test_framework@11.0.0-SNAPSHOT/org.apache.lucene.tests.util.TestRuleIgnoreTestSuites$1.evaluate(TestRuleIgnoreTestSuites.java:47)
	at junit@4.13.1/org.junit.rules.RunRules.evaluate(RunRules.java:20)
	at randomizedtesting.runner@2.8.1/com.carrotsearch.randomizedtesting.rules.StatementAdapter.evaluate(StatementAdapter.java:36)
	at randomizedtesting.runner@2.8.1/com.carrotsearch.randomizedtesting.ThreadLeakControl$StatementRunner.run(ThreadLeakControl.java:390)
	at randomizedtesting.runner@2.8.1/com.carrotsearch.randomizedtesting.ThreadLeakControl.lambda$forkTimeoutingTask$0(ThreadLeakControl.java:850)
	at java.base/java.lang.Thread.run(Thread.java:1583)


FAILED:  org.apache.lucene.backward_index.TestIndexUpgradeBackwardsCompatibility.testUpgradeOldIndex {Lucene-Version:10.1.0; Pattern: index.%1$s-cfs.zip}

Error Message:
java.lang.AssertionError: too many neighbors: 11

Stack Trace:
java.lang.AssertionError: too many neighbors: 11
	at __randomizedtesting.SeedInfo.seed([9C147645265876CD:E22777D00ABB885E]:0)
	at org.apache.lucene.core@11.0.0-SNAPSHOT/org.apache.lucene.codecs.lucene99.Lucene99HnswVectorsReader$OffHeapHnswGraph.seek(Lucene99HnswVectorsReader.java:499)
	at org.apache.lucene.core@11.0.0-SNAPSHOT/org.apache.lucene.util.hnsw.HnswGraphSearcher.graphSeek(HnswGraphSearcher.java:266)
	at org.apache.lucene.core@11.0.0-SNAPSHOT/org.apache.lucene.util.hnsw.HnswGraphSearcher.searchLevel(HnswGraphSearcher.java:226)
	at org.apache.lucene.core@11.0.0-SNAPSHOT/org.apache.lucene.util.hnsw.HnswGraphSearcher.search(HnswGraphSearcher.java:105)
	at org.apache.lucene.core@11.0.0-SNAPSHOT/org.apache.lucene.util.hnsw.HnswGraphSearcher.search(HnswGraphSearcher.java:70)
	at org.apache.lucene.core@11.0.0-SNAPSHOT/org.apache.lucene.codecs.lucene99.Lucene99HnswVectorsReader.search(Lucene99HnswVectorsReader.java:321)
	at org.apache.lucene.core@11.0.0-SNAPSHOT/org.apache.lucene.codecs.lucene99.Lucene99HnswVectorsReader.search(Lucene99HnswVectorsReader.java:288)
	at org.apache.lucene.core@11.0.0-SNAPSHOT/org.apache.lucene.codecs.perfield.PerFieldKnnVectorsFormat$FieldsReader.search(PerFieldKnnVectorsFormat.java:313)
	at org.apache.lucene.core@11.0.0-SNAPSHOT/org.apache.lucene.index.CheckIndex.checkFloatVectorValues(CheckIndex.java:2772)
	at org.apache.lucene.core@11.0.0-SNAPSHOT/org.apache.lucene.index.CheckIndex.testVectors(CheckIndex.java:2710)
	at org.apache.lucene.core@11.0.0-SNAPSHOT/org.apache.lucene.index.CheckIndex.testSegment(CheckIndex.java:1086)
	at org.apache.lucene.core@11.0.0-SNAPSHOT/org.apache.lucene.index.CheckIndex.checkIndex(CheckIndex.java:786)
	at org.apache.lucene.core@11.0.0-SNAPSHOT/org.apache.lucene.index.CheckIndex.checkIndex(CheckIndex.java:556)
	at org.apache.lucene.test_framework@11.0.0-SNAPSHOT/org.apache.lucene.tests.util.TestUtil.checkIndex(TestUtil.java:338)
	at org.apache.lucene.test_framework@11.0.0-SNAPSHOT/org.apache.lucene.tests.store.MockDirectoryWrapper.close(MockDirectoryWrapper.java:921)
	at org.apache.lucene.core@11.0.0-SNAPSHOT/org.apache.lucene.util.IOUtils.close(IOUtils.java:85)
	at org.apache.lucene.core@11.0.0-SNAPSHOT/org.apache.lucene.util.IOUtils.close(IOUtils.java:72)
	at org.apache.lucene.backward_index.BackwardsCompatibilityTestBase.tearDown(BackwardsCompatibilityTestBase.java:156)
	at java.base/jdk.internal.reflect.DirectMethodHandleAccessor.invoke(DirectMethodHandleAccessor.java:103)
	at java.base/java.lang.reflect.Method.invoke(Method.java:580)
	at randomizedtesting.runner@2.8.1/com.carrotsearch.randomizedtesting.RandomizedRunner.invoke(RandomizedRunner.java:1758)
	at randomizedtesting.runner@2.8.1/com.carrotsearch.randomizedtesting.RandomizedRunner$10.evaluate(RandomizedRunner.java:1004)
	at org.apache.lucene.test_framework@11.0.0-SNAPSHOT/org.apache.lucene.tests.util.TestRuleSetupTeardownChained$1.evaluate(TestRuleSetupTeardownChained.java:48)
	at org.apache.lucene.test_framework@11.0.0-SNAPSHOT/org.apache.lucene.tests.util.AbstractBeforeAfterRule$1.evaluate(AbstractBeforeAfterRule.java:43)
	at org.apache.lucene.test_framework@11.0.0-SNAPSHOT/org.apache.lucene.tests.util.TestRuleThreadAndTestName$1.evaluate(TestRuleThreadAndTestName.java:45)
	at org.apache.lucene.test_framework@11.0.0-SNAPSHOT/org.apache.lucene.tests.util.TestRuleIgnoreAfterMaxFailures$1.evaluate(TestRuleIgnoreAfterMaxFailures.java:60)
	at org.apache.lucene.test_framework@11.0.0-SNAPSHOT/org.apache.lucene.tests.util.TestRuleMarkFailure$1.evaluate(TestRuleMarkFailure.java:44)
	at junit@4.13.1/org.junit.rules.RunRules.evaluate(RunRules.java:20)
	at randomizedtesting.runner@2.8.1/com.carrotsearch.randomizedtesting.rules.StatementAdapter.evaluate(StatementAdapter.java:36)
	at randomizedtesting.runner@2.8.1/com.carrotsearch.randomizedtesting.ThreadLeakControl$StatementRunner.run(ThreadLeakControl.java:390)
	at randomizedtesting.runner@2.8.1/com.carrotsearch.randomizedtesting.ThreadLeakControl.forkTimeoutingTask(ThreadLeakControl.java:843)
	at randomizedtesting.runner@2.8.1/com.carrotsearch.randomizedtesting.ThreadLeakControl$3.evaluate(ThreadLeakControl.java:490)
	at randomizedtesting.runner@2.8.1/com.carrotsearch.randomizedtesting.RandomizedRunner.runSingleTest(RandomizedRunner.java:955)
	at randomizedtesting.runner@2.8.1/com.carrotsearch.randomizedtesting.RandomizedRunner$5.evaluate(RandomizedRunner.java:840)
	at randomizedtesting.runner@2.8.1/com.carrotsearch.randomizedtesting.RandomizedRunner$6.evaluate(RandomizedRunner.java:891)
	at randomizedtesting.runner@2.8.1/com.carrotsearch.randomizedtesting.RandomizedRunner$7.evaluate(RandomizedRunner.java:902)
	at org.apache.lucene.test_framework@11.0.0-SNAPSHOT/org.apache.lucene.tests.util.AbstractBeforeAfterRule$1.evaluate(AbstractBeforeAfterRule.java:43)
	at randomizedtesting.runner@2.8.1/com.carrotsearch.randomizedtesting.rules.StatementAdapter.evaluate(StatementAdapter.java:36)
	at org.apache.lucene.test_framework@11.0.0-SNAPSHOT/org.apache.lucene.tests.util.TestRuleStoreClassName$1.evaluate(TestRuleStoreClassName.java:38)
	at randomizedtesting.runner@2.8.1/com.carrotsearch.randomizedtesting.rules.NoShadowingOrOverridesOnMethodsRule$1.evaluate(NoShadowingOrOverridesOnMethodsRule.java:40)
	at randomizedtesting.runner@2.8.1/com.carrotsearch.randomizedtesting.rules.NoShadowingOrOverridesOnMethodsRule$1.evaluate(NoShadowingOrOverridesOnMethodsRule.java:40)
	at randomizedtesting.runner@2.8.1/com.carrotsearch.randomizedtesting.rules.StatementAdapter.evaluate(StatementAdapter.java:36)
	at randomizedtesting.runner@2.8.1/com.carrotsearch.randomizedtesting.rules.StatementAdapter.evaluate(StatementAdapter.java:36)
	at org.apache.lucene.test_framework@11.0.0-SNAPSHOT/org.apache.lucene.tests.util.TestRuleAssertionsRequired$1.evaluate(TestRuleAssertionsRequired.java:53)
	at org.apache.lucene.test_framework@11.0.0-SNAPSHOT/org.apache.lucene.tests.util.AbstractBeforeAfterRule$1.evaluate(AbstractBeforeAfterRule.java:43)
	at org.apache.lucene.test_framework@11.0.0-SNAPSHOT/org.apache.lucene.tests.util.TestRuleMarkFailure$1.evaluate(TestRuleMarkFailure.java:44)
	at org.apache.lucene.test_framework@11.0.0-SNAPSHOT/org.apache.lucene.tests.util.TestRuleIgnoreAfterMaxFailures$1.evaluate(TestRuleIgnoreAfterMaxFailures.java:60)
	at org.apache.lucene.test_framework@11.0.0-SNAPSHOT/org.apache.lucene.tests.util.TestRuleIgnoreTestSuites$1.evaluate(TestRuleIgnoreTestSuites.java:47)
	at junit@4.13.1/org.junit.rules.RunRules.evaluate(RunRules.java:20)
	at randomizedtesting.runner@2.8.1/com.carrotsearch.randomizedtesting.rules.StatementAdapter.evaluate(StatementAdapter.java:36)
	at randomizedtesting.runner@2.8.1/com.carrotsearch.randomizedtesting.ThreadLeakControl$StatementRunner.run(ThreadLeakControl.java:390)
	at randomizedtesting.runner@2.8.1/com.carrotsearch.randomizedtesting.ThreadLeakControl.lambda$forkTimeoutingTask$0(ThreadLeakControl.java:850)
	at java.base/java.lang.Thread.run(Thread.java:1583)




Build Log:
[...truncated 2028 lines...]
ERROR: The following test(s) have failed:
  - org.apache.lucene.backward_index.TestIndexUpgradeBackwardsCompatibility.testUpgradeWithNRTReader {Lucene-Version:11.0.0; Pattern: index.%1$s-nocfs.zip} (:lucene:backward-codecs)
    Test output: /home/jenkins/jenkins-home/712657a4/workspace/Lucene/Lucene-MMAPv2-Linux (s390x big endian)/lucene/backward-codecs/build/test-results/test/outputs/OUTPUT-org.apache.lucene.backward_index.TestIndexUpgradeBackwardsCompatibility.txt
    Reproduce with: gradlew :lucene:backward-codecs:test --tests "org.apache.lucene.backward_index.TestIndexUpgradeBackwardsCompatibility.testUpgradeWithNRTReader {Lucene-Version:11.0.0; Pattern: index.%1$s-nocfs.zip}" -Ptests.jvms=4 -Ptests.jvmargs= -Ptests.seed=9C147645265876CD -Ptests.multiplier=2 -Ptests.directory=MMapDirectory -Ptests.gui=true -Ptests.file.encoding=UTF-8 -Ptests.vectorsize=128 -Ptests.forceintegervectors=true

  - org.apache.lucene.backward_index.TestIndexUpgradeBackwardsCompatibility.testIndexUpgraderCommandLineArgs {Lucene-Version:10.0.0; Pattern: index.%1$s-nocfs.zip} (:lucene:backward-codecs)
    Test output: /home/jenkins/jenkins-home/712657a4/workspace/Lucene/Lucene-MMAPv2-Linux (s390x big endian)/lucene/backward-codecs/build/test-results/test/outputs/OUTPUT-org.apache.lucene.backward_index.TestIndexUpgradeBackwardsCompatibility.txt
    Reproduce with: gradlew :lucene:backward-codecs:test --tests "org.apache.lucene.backward_index.TestIndexUpgradeBackwardsCompatibility.testIndexUpgraderCommandLineArgs {Lucene-Version:10.0.0; Pattern: index.%1$s-nocfs.zip}" -Ptests.jvms=4 -Ptests.jvmargs= -Ptests.seed=9C147645265876CD -Ptests.multiplier=2 -Ptests.directory=MMapDirectory -Ptests.gui=true -Ptests.file.encoding=UTF-8 -Ptests.vectorsize=128 -Ptests.forceintegervectors=true

  - org.apache.lucene.backward_index.TestIndexUpgradeBackwardsCompatibility.testUpgradeOldIndex {Lucene-Version:10.0.0; Pattern: index.%1$s-nocfs.zip} (:lucene:backward-codecs)
    Test output: /home/jenkins/jenkins-home/712657a4/workspace/Lucene/Lucene-MMAPv2-Linux (s390x big endian)/lucene/backward-codecs/build/test-results/test/outputs/OUTPUT-org.apache.lucene.backward_index.TestIndexUpgradeBackwardsCompatibility.txt
    Reproduce with: gradlew :lucene:backward-codecs:test --tests "org.apache.lucene.backward_index.TestIndexUpgradeBackwardsCompatibility.testUpgradeOldIndex {Lucene-Version:10.0.0; Pattern: index.%1$s-nocfs.zip}" -Ptests.jvms=4 -Ptests.jvmargs= -Ptests.seed=9C147645265876CD -Ptests.multiplier=2 -Ptests.directory=MMapDirectory -Ptests.gui=true -Ptests.file.encoding=UTF-8 -Ptests.vectorsize=128 -Ptests.forceintegervectors=true

  - org.apache.lucene.backward_index.TestIndexUpgradeBackwardsCompatibility.testIndexUpgraderCommandLineArgs {Lucene-Version:10.0.0; Pattern: index.%1$s-cfs.zip} (:lucene:backward-codecs)
    Test output: /home/jenkins/jenkins-home/712657a4/workspace/Lucene/Lucene-MMAPv2-Linux (s390x big endian)/lucene/backward-codecs/build/test-results/test/outputs/OUTPUT-org.apache.lucene.backward_index.TestIndexUpgradeBackwardsCompatibility.txt
    Reproduce with: gradlew :lucene:backward-codecs:test --tests "org.apache.lucene.backward_index.TestIndexUpgradeBackwardsCompatibility.testIndexUpgraderCommandLineArgs {Lucene-Version:10.0.0; Pattern: index.%1$s-cfs.zip}" -Ptests.jvms=4 -Ptests.jvmargs= -Ptests.seed=9C147645265876CD -Ptests.multiplier=2 -Ptests.directory=MMapDirectory -Ptests.gui=true -Ptests.file.encoding=UTF-8 -Ptests.vectorsize=128 -Ptests.forceintegervectors=true

  - org.apache.lucene.backward_index.TestIndexUpgradeBackwardsCompatibility.testUpgradeOldIndex {Lucene-Version:10.0.0; Pattern: index.%1$s-cfs.zip} (:lucene:backward-codecs)
    Test output: /home/jenkins/jenkins-home/712657a4/workspace/Lucene/Lucene-MMAPv2-Linux (s390x big endian)/lucene/backward-codecs/build/test-results/test/outputs/OUTPUT-org.apache.lucene.backward_index.TestIndexUpgradeBackwardsCompatibility.txt
    Reproduce with: gradlew :lucene:backward-codecs:test --tests "org.apache.lucene.backward_index.TestIndexUpgradeBackwardsCompatibility.testUpgradeOldIndex {Lucene-Version:10.0.0; Pattern: index.%1$s-cfs.zip}" -Ptests.jvms=4 -Ptests.jvmargs= -Ptests.seed=9C147645265876CD -Ptests.multiplier=2 -Ptests.directory=MMapDirectory -Ptests.gui=true -Ptests.file.encoding=UTF-8 -Ptests.vectorsize=128 -Ptests.forceintegervectors=true

  - org.apache.lucene.backward_index.TestIndexUpgradeBackwardsCompatibility.testUpgradeWithNRTReader {Lucene-Version:11.0.0; Pattern: index.%1$s-cfs.zip} (:lucene:backward-codecs)
    Test output: /home/jenkins/jenkins-home/712657a4/workspace/Lucene/Lucene-MMAPv2-Linux (s390x big endian)/lucene/backward-codecs/build/test-results/test/outputs/OUTPUT-org.apache.lucene.backward_index.TestIndexUpgradeBackwardsCompatibility.txt
    Reproduce with: gradlew :lucene:backward-codecs:test --tests "org.apache.lucene.backward_index.TestIndexUpgradeBackwardsCompatibility.testUpgradeWithNRTReader {Lucene-Version:11.0.0; Pattern: index.%1$s-cfs.zip}" -Ptests.jvms=4 -Ptests.jvmargs= -Ptests.seed=9C147645265876CD -Ptests.multiplier=2 -Ptests.directory=MMapDirectory -Ptests.gui=true -Ptests.file.encoding=UTF-8 -Ptests.vectorsize=128 -Ptests.forceintegervectors=true

  - org.apache.lucene.backward_index.TestIndexUpgradeBackwardsCompatibility.testIndexUpgraderCommandLineArgs {Lucene-Version:10.1.0; Pattern: index.%1$s-nocfs.zip} (:lucene:backward-codecs)
    Test output: /home/jenkins/jenkins-home/712657a4/workspace/Lucene/Lucene-MMAPv2-Linux (s390x big endian)/lucene/backward-codecs/build/test-results/test/outputs/OUTPUT-org.apache.lucene.backward_index.TestIndexUpgradeBackwardsCompatibility.txt
    Reproduce with: gradlew :lucene:backward-codecs:test --tests "org.apache.lucene.backward_index.TestIndexUpgradeBackwardsCompatibility.testIndexUpgraderCommandLineArgs {Lucene-Version:10.1.0; Pattern: index.%1$s-nocfs.zip}" -Ptests.jvms=4 -Ptests.jvmargs= -Ptests.seed=9C147645265876CD -Ptests.multiplier=2 -Ptests.directory=MMapDirectory -Ptests.gui=true -Ptests.file.encoding=UTF-8 -Ptests.vectorsize=128 -Ptests.forceintegervectors=true

  - org.apache.lucene.backward_index.TestIndexUpgradeBackwardsCompatibility.testUpgradeOldIndex {Lucene-Version:10.1.0; Pattern: index.%1$s-nocfs.zip} (:lucene:backward-codecs)
    Test output: /home/jenkins/jenkins-home/712657a4/workspace/Lucene/Lucene-MMAPv2-Linux (s390x big endian)/lucene/backward-codecs/build/test-results/test/outputs/OUTPUT-org.apache.lucene.backward_index.TestIndexUpgradeBackwardsCompatibility.txt
    Reproduce with: gradlew :lucene:backward-codecs:test --tests "org.apache.lucene.backward_index.TestIndexUpgradeBackwardsCompatibility.testUpgradeOldIndex {Lucene-Version:10.1.0; Pattern: index.%1$s-nocfs.zip}" -Ptests.jvms=4 -Ptests.jvmargs= -Ptests.seed=9C147645265876CD -Ptests.multiplier=2 -Ptests.directory=MMapDirectory -Ptests.gui=true -Ptests.file.encoding=UTF-8 -Ptests.vectorsize=128 -Ptests.forceintegervectors=true

  - org.apache.lucene.backward_index.TestIndexUpgradeBackwardsCompatibility.testIndexUpgraderCommandLineArgs {Lucene-Version:10.1.0; Pattern: index.%1$s-cfs.zip} (:lucene:backward-codecs)
    Test output: /home/jenkins/jenkins-home/712657a4/workspace/Lucene/Lucene-MMAPv2-Linux (s390x big endian)/lucene/backward-codecs/build/test-results/test/outputs/OUTPUT-org.apache.lucene.backward_index.TestIndexUpgradeBackwardsCompatibility.txt
    Reproduce with: gradlew :lucene:backward-codecs:test --tests "org.apache.lucene.backward_index.TestIndexUpgradeBackwardsCompatibility.testIndexUpgraderCommandLineArgs {Lucene-Version:10.1.0; Pattern: index.%1$s-cfs.zip}" -Ptests.jvms=4 -Ptests.jvmargs= -Ptests.seed=9C147645265876CD -Ptests.multiplier=2 -Ptests.directory=MMapDirectory -Ptests.gui=true -Ptests.file.encoding=UTF-8 -Ptests.vectorsize=128 -Ptests.forceintegervectors=true

  - org.apache.lucene.backward_index.TestIndexUpgradeBackwardsCompatibility.testUpgradeOldIndex {Lucene-Version:10.1.0; Pattern: index.%1$s-cfs.zip} (:lucene:backward-codecs)
    Test output: /home/jenkins/jenkins-home/712657a4/workspace/Lucene/Lucene-MMAPv2-Linux (s390x big endian)/lucene/backward-codecs/build/test-results/test/outputs/OUTPUT-org.apache.lucene.backward_index.TestIndexUpgradeBackwardsCompatibility.txt
    Reproduce with: gradlew :lucene:backward-codecs:test --tests "org.apache.lucene.backward_index.TestIndexUpgradeBackwardsCompatibility.testUpgradeOldIndex {Lucene-Version:10.1.0; Pattern: index.%1$s-cfs.zip}" -Ptests.jvms=4 -Ptests.jvmargs= -Ptests.seed=9C147645265876CD -Ptests.multiplier=2 -Ptests.directory=MMapDirectory -Ptests.gui=true -Ptests.file.encoding=UTF-8 -Ptests.vectorsize=128 -Ptests.forceintegervectors=true


Deprecated Gradle features were used in this build, making it incompatible with Gradle 9.0.

You can use '--warning-mode all' to show the individual deprecation warnings and determine if they come from your own scripts or plugins.

For more on this, please refer to https://docs.gradle.org/8.10/userguide/command_line_interface.html#sec:command_line_warnings in the Gradle documentation.

BUILD SUCCESSFUL in 12m 29s
246 actionable tasks: 246 executed

Publishing build scan...
https://ge.apache.org/s/4txisah5qi2iy

Build step 'Invoke Gradle script' changed build result to SUCCESS
Archiving artifacts
‘**/*.events’ doesn’t match anything: ‘**’ exists but not ‘**/*.events’
No artifacts found that match the file pattern "**/*.events,heapdumps/**,**/hs_err_pid*". Configuration error?
Recording test results
[Checks API] No suitable checks publisher found.
Build step 'Publish JUnit test result report' changed build result to UNSTABLE
Email was triggered for: Unstable (Test Failures)
Sending email for trigger: Unstable (Test Failures)

[JENKINS] Lucene » Lucene-MMAPv2-Linux (s390x big endian) - Build # 760 - Still Unstable!

Posted by Apache Jenkins Server <je...@builds.apache.org>.
Build: https://ci-builds.apache.org/job/Lucene/job/Lucene-MMAPv2-Linux%20(s390x%20big%20endian)/760/

1 tests failed.
FAILED:  org.apache.lucene.index.TestIndexWriterWithThreads.testCloseWithThreads

Error Message:
java.lang.IllegalStateException: this writer hit an unrecoverable error; cannot commit

Stack Trace:
java.lang.IllegalStateException: this writer hit an unrecoverable error; cannot commit
	at __randomizedtesting.SeedInfo.seed([74E1F671960558A8:6925DF06F5F0420E]:0)
	at org.apache.lucene.index.IndexWriter.startCommit(IndexWriter.java:5582)
	at org.apache.lucene.index.IndexWriter.prepareCommitInternal(IndexWriter.java:3784)
	at org.apache.lucene.index.IndexWriter.commitInternal(IndexWriter.java:4125)
	at org.apache.lucene.index.IndexWriter.commit(IndexWriter.java:4087)
	at org.apache.lucene.index.TestIndexWriterWithThreads.testCloseWithThreads(TestIndexWriterWithThreads.java:240)
	at java.base/jdk.internal.reflect.DirectMethodHandleAccessor.invoke(DirectMethodHandleAccessor.java:103)
	at java.base/java.lang.reflect.Method.invoke(Method.java:580)
	at com.carrotsearch.randomizedtesting.RandomizedRunner.invoke(RandomizedRunner.java:1758)
	at com.carrotsearch.randomizedtesting.RandomizedRunner$8.evaluate(RandomizedRunner.java:946)
	at com.carrotsearch.randomizedtesting.RandomizedRunner$9.evaluate(RandomizedRunner.java:982)
	at com.carrotsearch.randomizedtesting.RandomizedRunner$10.evaluate(RandomizedRunner.java:996)
	at org.apache.lucene.tests.util.TestRuleSetupTeardownChained$1.evaluate(TestRuleSetupTeardownChained.java:48)
	at org.apache.lucene.tests.util.AbstractBeforeAfterRule$1.evaluate(AbstractBeforeAfterRule.java:43)
	at org.apache.lucene.tests.util.TestRuleThreadAndTestName$1.evaluate(TestRuleThreadAndTestName.java:45)
	at org.apache.lucene.tests.util.TestRuleIgnoreAfterMaxFailures$1.evaluate(TestRuleIgnoreAfterMaxFailures.java:60)
	at org.apache.lucene.tests.util.TestRuleMarkFailure$1.evaluate(TestRuleMarkFailure.java:44)
	at org.junit.rules.RunRules.evaluate(RunRules.java:20)
	at com.carrotsearch.randomizedtesting.rules.StatementAdapter.evaluate(StatementAdapter.java:36)
	at com.carrotsearch.randomizedtesting.ThreadLeakControl$StatementRunner.run(ThreadLeakControl.java:390)
	at com.carrotsearch.randomizedtesting.ThreadLeakControl.forkTimeoutingTask(ThreadLeakControl.java:843)
	at com.carrotsearch.randomizedtesting.ThreadLeakControl$3.evaluate(ThreadLeakControl.java:490)
	at com.carrotsearch.randomizedtesting.RandomizedRunner.runSingleTest(RandomizedRunner.java:955)
	at com.carrotsearch.randomizedtesting.RandomizedRunner$5.evaluate(RandomizedRunner.java:840)
	at com.carrotsearch.randomizedtesting.RandomizedRunner$6.evaluate(RandomizedRunner.java:891)
	at com.carrotsearch.randomizedtesting.RandomizedRunner$7.evaluate(RandomizedRunner.java:902)
	at org.apache.lucene.tests.util.AbstractBeforeAfterRule$1.evaluate(AbstractBeforeAfterRule.java:43)
	at com.carrotsearch.randomizedtesting.rules.StatementAdapter.evaluate(StatementAdapter.java:36)
	at org.apache.lucene.tests.util.TestRuleStoreClassName$1.evaluate(TestRuleStoreClassName.java:38)
	at com.carrotsearch.randomizedtesting.rules.NoShadowingOrOverridesOnMethodsRule$1.evaluate(NoShadowingOrOverridesOnMethodsRule.java:40)
	at com.carrotsearch.randomizedtesting.rules.NoShadowingOrOverridesOnMethodsRule$1.evaluate(NoShadowingOrOverridesOnMethodsRule.java:40)
	at com.carrotsearch.randomizedtesting.rules.StatementAdapter.evaluate(StatementAdapter.java:36)
	at com.carrotsearch.randomizedtesting.rules.StatementAdapter.evaluate(StatementAdapter.java:36)
	at org.apache.lucene.tests.util.TestRuleAssertionsRequired$1.evaluate(TestRuleAssertionsRequired.java:53)
	at org.apache.lucene.tests.util.AbstractBeforeAfterRule$1.evaluate(AbstractBeforeAfterRule.java:43)
	at org.apache.lucene.tests.util.TestRuleMarkFailure$1.evaluate(TestRuleMarkFailure.java:44)
	at org.apache.lucene.tests.util.TestRuleIgnoreAfterMaxFailures$1.evaluate(TestRuleIgnoreAfterMaxFailures.java:60)
	at org.apache.lucene.tests.util.TestRuleIgnoreTestSuites$1.evaluate(TestRuleIgnoreTestSuites.java:47)
	at org.junit.rules.RunRules.evaluate(RunRules.java:20)
	at com.carrotsearch.randomizedtesting.rules.StatementAdapter.evaluate(StatementAdapter.java:36)
	at com.carrotsearch.randomizedtesting.ThreadLeakControl$StatementRunner.run(ThreadLeakControl.java:390)
	at com.carrotsearch.randomizedtesting.ThreadLeakControl.lambda$forkTimeoutingTask$0(ThreadLeakControl.java:850)
	at java.base/java.lang.Thread.run(Thread.java:1583)
Caused by: java.nio.file.FileSystemException: /home/jenkins/jenkins-home/712657a4/workspace/Lucene/Lucene-MMAPv2-Linux (s390x big endian)/lucene/core/build/tmp/tests-tmp/lucene.index.TestIndexWriterWithThreads_74E1F671960558A8-001/index-MMapDirectory-010/_7c_Lucene90TermVectorsIndex-doc_ids_ta.tmp: Too many open files
	at org.apache.lucene.tests.mockfile.HandleLimitFS.onOpen(HandleLimitFS.java:67)
	at org.apache.lucene.tests.mockfile.HandleTrackingFS.callOpenHook(HandleTrackingFS.java:82)
	at org.apache.lucene.tests.mockfile.HandleTrackingFS.newOutputStream(HandleTrackingFS.java:163)
	at org.apache.lucene.tests.mockfile.HandleTrackingFS.newOutputStream(HandleTrackingFS.java:132)
	at org.apache.lucene.tests.mockfile.FilterFileSystemProvider.newOutputStream(FilterFileSystemProvider.java:200)
	at java.base/java.nio.file.Files.newOutputStream(Files.java:227)
	at org.apache.lucene.store.FSDirectory$FSIndexOutput.<init>(FSDirectory.java:389)
	at org.apache.lucene.store.FSDirectory.createTempOutput(FSDirectory.java:229)
	at org.apache.lucene.tests.store.MockDirectoryWrapper.createTempOutput(MockDirectoryWrapper.java:753)
	at org.apache.lucene.store.FilterDirectory.createTempOutput(FilterDirectory.java:81)
	at org.apache.lucene.store.TrackingDirectoryWrapper.createTempOutput(TrackingDirectoryWrapper.java:49)
	at org.apache.lucene.codecs.lucene90.compressing.FieldsIndexWriter.<init>(FieldsIndexWriter.java:83)
	at org.apache.lucene.codecs.lucene90.compressing.Lucene90CompressingTermVectorsWriter.<init>(Lucene90CompressingTermVectorsWriter.java:286)
	at org.apache.lucene.codecs.lucene90.compressing.Lucene90CompressingTermVectorsFormat.vectorsWriter(Lucene90CompressingTermVectorsFormat.java:103)
	at org.apache.lucene.tests.codecs.asserting.AssertingTermVectorsFormat.vectorsWriter(AssertingTermVectorsFormat.java:51)
	at org.apache.lucene.index.TermVectorsConsumer.initTermVectorsWriter(TermVectorsConsumer.java:106)
	at org.apache.lucene.index.TermVectorsConsumer.finishDocument(TermVectorsConsumer.java:126)
	at org.apache.lucene.index.TermsHash.finishDocument(TermsHash.java:95)
	at org.apache.lucene.index.IndexingChain.processDocument(IndexingChain.java:633)
	at org.apache.lucene.index.DocumentsWriterPerThread.updateDocuments(DocumentsWriterPerThread.java:274)
	at org.apache.lucene.index.DocumentsWriter.updateDocuments(DocumentsWriter.java:425)
	at org.apache.lucene.index.IndexWriter.updateDocuments(IndexWriter.java:1552)
	at org.apache.lucene.index.IndexWriter.updateDocument(IndexWriter.java:1837)
	at org.apache.lucene.index.TestIndexWriterWithThreads$IndexerThread.run(TestIndexWriterWithThreads.java:93)




Build Log:
[...truncated 1051 lines...]
ERROR: The following test(s) have failed:
  - org.apache.lucene.index.TestIndexWriterWithThreads.testCloseWithThreads (:lucene:core)
    Test output: /home/jenkins/jenkins-home/712657a4/workspace/Lucene/Lucene-MMAPv2-Linux (s390x big endian)/lucene/core/build/test-results/test/outputs/OUTPUT-org.apache.lucene.index.TestIndexWriterWithThreads.txt
    Reproduce with: gradlew :lucene:core:test --tests "org.apache.lucene.index.TestIndexWriterWithThreads.testCloseWithThreads" -Ptests.jvms=4 -Ptests.jvmargs= -Ptests.seed=74E1F671960558A8 -Ptests.multiplier=2 -Ptests.directory=MMapDirectory -Ptests.gui=true -Ptests.file.encoding=UTF-8 -Ptests.vectorsize=default -Ptests.forceintegervectors=false


Deprecated Gradle features were used in this build, making it incompatible with Gradle 9.0.

You can use '--warning-mode all' to show the individual deprecation warnings and determine if they come from your own scripts or plugins.

For more on this, please refer to https://docs.gradle.org/8.10/userguide/command_line_interface.html#sec:command_line_warnings in the Gradle documentation.

BUILD SUCCESSFUL in 28m 55s
246 actionable tasks: 246 executed

Publishing build scan...
https://ge.apache.org/s/ot4dasvah7xi2

Build step 'Invoke Gradle script' changed build result to SUCCESS
Archiving artifacts
‘**/*.events’ doesn’t match anything: ‘**’ exists but not ‘**/*.events’
No artifacts found that match the file pattern "**/*.events,heapdumps/**,**/hs_err_pid*". Configuration error?
Recording test results
[Checks API] No suitable checks publisher found.
Build step 'Publish JUnit test result report' changed build result to UNSTABLE
Email was triggered for: Unstable (Test Failures)
Sending email for trigger: Unstable (Test Failures)