You are viewing a plain text version of this content. The canonical link for it is here.
Posted to commits@jena.apache.org by Apache Jenkins Server <je...@builds.apache.org> on 2011/10/17 10:16:10 UTC

Build failed in Jenkins: Jena_LARQ » LARQ #257

See <https://builds.apache.org/job/Jena_LARQ/org.apache.jena$jena-larq/257/>

------------------------------------------
channel started
<===[JENKINS REMOTING CAPACITY]===>   Executing Maven:  -B -f <https://builds.apache.org/job/Jena_LARQ/org.apache.jena$jena-larq/ws/pom.xml> clean install findbugs:findbugs cobertura:cobertura pmd:pmd
Downloading: http://repo1.maven.org/maven2/org/apache/maven/plugins/maven-release-plugin/2.2.1/maven-release-plugin-2.2.1.jar
[INFO] Scanning for projects...
Downloaded: http://repo1.maven.org/maven2/org/apache/maven/plugins/maven-release-plugin/2.2.1/maven-release-plugin-2.2.1.jar (43 KB at 114.9 KB/sec)
Downloading: http://repo1.maven.org/maven2/org/apache/maven/plugins/maven-scm-plugin/1.4/maven-scm-plugin-1.4.jar
Downloaded: http://repo1.maven.org/maven2/org/apache/maven/plugins/maven-scm-plugin/1.4/maven-scm-plugin-1.4.jar (54 KB at 177.8 KB/sec)
Downloading: http://repo1.maven.org/maven2/org/codehaus/mojo/maven-metadata.xml
Downloading: http://repo1.maven.org/maven2/org/apache/maven/plugins/maven-metadata.xml
Downloaded: http://repo1.maven.org/maven2/org/codehaus/mojo/maven-metadata.xml (18 KB at 25.6 KB/sec)
Downloaded: http://repo1.maven.org/maven2/org/apache/maven/plugins/maven-metadata.xml (11 KB at 11.9 KB/sec)
Downloading: http://repo1.maven.org/maven2/org/codehaus/mojo/findbugs-maven-plugin/maven-metadata.xml
Downloaded: http://repo1.maven.org/maven2/org/codehaus/mojo/findbugs-maven-plugin/maven-metadata.xml (679 B at 1.3 KB/sec)
Downloading: http://repo1.maven.org/maven2/org/codehaus/mojo/cobertura-maven-plugin/maven-metadata.xml
Downloaded: http://repo1.maven.org/maven2/org/codehaus/mojo/cobertura-maven-plugin/maven-metadata.xml (520 B at 1.1 KB/sec)
[INFO]                                                                         
[INFO] ------------------------------------------------------------------------
[INFO] Building LARQ 0.2.2-incubating-SNAPSHOT
[INFO] ------------------------------------------------------------------------
Downloading: http://repository.apache.org/snapshots/com/hp/hpl/jena/tdb/0.8.11-SNAPSHOT/maven-metadata.xml
Downloading: http://repository.apache.org/snapshots/com/hp/hpl/jena/tdb/0.8.11-SNAPSHOT/tdb-0.8.11-SNAPSHOT.pom
[WARNING] The POM for com.hp.hpl.jena:tdb:jar:0.8.11-SNAPSHOT is missing, no dependency information available
Downloading: http://repository.apache.org/snapshots/com/hp/hpl/jena/tdb/0.8.11-SNAPSHOT/tdb-0.8.11-SNAPSHOT.jar
[JENKINS] Archiving <https://builds.apache.org/job/Jena_LARQ/org.apache.jena$jena-larq/ws/pom.xml> to /home/hudson/hudson/jobs/Jena_LARQ/modules/org.apache.jena$jena-larq/builds/2011-10-17_08-15-44/archive/org.apache.jena/jena-larq/0.2.2-incubating-SNAPSHOT/jena-larq-0.2.2-incubating-SNAPSHOT.pom
[INFO] ------------------------------------------------------------------------
[INFO] BUILD FAILURE
[INFO] ------------------------------------------------------------------------
[INFO] Total time: 11.962s
[INFO] Finished at: Mon Oct 17 08:16:09 UTC 2011
[INFO] Final Memory: 12M/114M
[INFO] ------------------------------------------------------------------------
mavenExecutionResult exceptions not empty
message : Failed to execute goal on project jena-larq: Could not resolve dependencies for project org.apache.jena:jena-larq:jar:0.2.2-incubating-SNAPSHOT: Could not find artifact com.hp.hpl.jena:tdb:jar:0.8.11-SNAPSHOT in Nexus (http://repository.apache.org/snapshots)
cause : Could not resolve dependencies for project org.apache.jena:jena-larq:jar:0.2.2-incubating-SNAPSHOT: Could not find artifact com.hp.hpl.jena:tdb:jar:0.8.11-SNAPSHOT in Nexus (http://repository.apache.org/snapshots)
Stack trace : 
org.apache.maven.lifecycle.LifecycleExecutionException: Failed to execute goal on project jena-larq: Could not resolve dependencies for project org.apache.jena:jena-larq:jar:0.2.2-incubating-SNAPSHOT: Could not find artifact com.hp.hpl.jena:tdb:jar:0.8.11-SNAPSHOT in Nexus (http://repository.apache.org/snapshots)
	at org.apache.maven.lifecycle.internal.LifecycleDependencyResolver.getDependencies(LifecycleDependencyResolver.java:196)
	at org.apache.maven.lifecycle.internal.LifecycleDependencyResolver.resolveProjectDependencies(LifecycleDependencyResolver.java:108)
	at org.apache.maven.lifecycle.internal.MojoExecutor.ensureDependenciesAreResolved(MojoExecutor.java:258)
	at org.apache.maven.lifecycle.internal.MojoExecutor.execute(MojoExecutor.java:201)
	at org.apache.maven.lifecycle.internal.MojoExecutor.execute(MojoExecutor.java:153)
	at org.apache.maven.lifecycle.internal.MojoExecutor.execute(MojoExecutor.java:145)
	at org.apache.maven.lifecycle.internal.LifecycleModuleBuilder.buildProject(LifecycleModuleBuilder.java:84)
	at org.apache.maven.lifecycle.internal.LifecycleModuleBuilder.buildProject(LifecycleModuleBuilder.java:59)
	at org.apache.maven.lifecycle.internal.LifecycleStarter.singleThreadedBuild(LifecycleStarter.java:183)
	at org.apache.maven.lifecycle.internal.LifecycleStarter.execute(LifecycleStarter.java:161)
	at org.apache.maven.DefaultMaven.doExecute(DefaultMaven.java:319)
	at org.apache.maven.DefaultMaven.execute(DefaultMaven.java:156)
	at org.jvnet.hudson.maven3.launcher.Maven3Launcher.main(Maven3Launcher.java:79)
	at sun.reflect.NativeMethodAccessorImpl.invoke0(Native Method)
	at sun.reflect.NativeMethodAccessorImpl.invoke(NativeMethodAccessorImpl.java:39)
	at sun.reflect.DelegatingMethodAccessorImpl.invoke(DelegatingMethodAccessorImpl.java:25)
	at java.lang.reflect.Method.invoke(Method.java:597)
	at org.codehaus.plexus.classworlds.launcher.Launcher.launchStandard(Launcher.java:329)
	at org.codehaus.plexus.classworlds.launcher.Launcher.launch(Launcher.java:239)
	at org.jvnet.hudson.maven3.agent.Maven3Main.launch(Maven3Main.java:158)
	at hudson.maven.Maven3Builder.call(Maven3Builder.java:122)
	at hudson.maven.Maven3Builder.call(Maven3Builder.java:74)
	at hudson.remoting.UserRequest.perform(UserRequest.java:118)
	at hudson.remoting.UserRequest.perform(UserRequest.java:48)
	at hudson.remoting.Request$2.run(Request.java:287)
	at java.util.concurrent.Executors$RunnableAdapter.call(Executors.java:441)
	at java.util.concurrent.FutureTask$Sync.innerRun(FutureTask.java:303)
	at java.util.concurrent.FutureTask.run(FutureTask.java:138)
	at java.util.concurrent.ThreadPoolExecutor$Worker.runTask(ThreadPoolExecutor.java:886)
	at java.util.concurrent.ThreadPoolExecutor$Worker.run(ThreadPoolExecutor.java:908)
	at java.lang.Thread.run(Thread.java:662)
Caused by: org.apache.maven.project.DependencyResolutionException: Could not resolve dependencies for project org.apache.jena:jena-larq:jar:0.2.2-incubating-SNAPSHOT: Could not find artifact com.hp.hpl.jena:tdb:jar:0.8.11-SNAPSHOT in Nexus (http://repository.apache.org/snapshots)
	at org.apache.maven.project.DefaultProjectDependenciesResolver.resolve(DefaultProjectDependenciesResolver.java:170)
	at org.apache.maven.lifecycle.internal.LifecycleDependencyResolver.getDependencies(LifecycleDependencyResolver.java:171)
	... 30 more
Caused by: org.sonatype.aether.resolution.DependencyResolutionException: Could not find artifact com.hp.hpl.jena:tdb:jar:0.8.11-SNAPSHOT in Nexus (http://repository.apache.org/snapshots)
	at org.sonatype.aether.impl.internal.DefaultRepositorySystem.resolveDependencies(DefaultRepositorySystem.java:412)
	at org.apache.maven.project.DefaultProjectDependenciesResolver.resolve(DefaultProjectDependenciesResolver.java:164)
	... 31 more
Caused by: org.sonatype.aether.resolution.ArtifactResolutionException: Could not find artifact com.hp.hpl.jena:tdb:jar:0.8.11-SNAPSHOT in Nexus (http://repository.apache.org/snapshots)
	at org.sonatype.aether.impl.internal.DefaultArtifactResolver.resolve(DefaultArtifactResolver.java:541)
	at org.sonatype.aether.impl.internal.DefaultArtifactResolver.resolveArtifacts(DefaultArtifactResolver.java:220)
	at org.sonatype.aether.impl.internal.DefaultRepositorySystem.resolveDependencies(DefaultRepositorySystem.java:395)
	... 32 more
Caused by: org.sonatype.aether.transfer.ArtifactNotFoundException: Could not find artifact com.hp.hpl.jena:tdb:jar:0.8.11-SNAPSHOT in Nexus (http://repository.apache.org/snapshots)
	at org.sonatype.aether.connector.wagon.WagonRepositoryConnector$4.wrap(WagonRepositoryConnector.java:945)
	at org.sonatype.aether.connector.wagon.WagonRepositoryConnector$4.wrap(WagonRepositoryConnector.java:940)
	at org.sonatype.aether.connector.wagon.WagonRepositoryConnector$GetTask.flush(WagonRepositoryConnector.java:695)
	at org.sonatype.aether.connector.wagon.WagonRepositoryConnector$GetTask.flush(WagonRepositoryConnector.java:689)
	at org.sonatype.aether.connector.wagon.WagonRepositoryConnector.get(WagonRepositoryConnector.java:445)
	at org.sonatype.aether.impl.internal.DefaultArtifactResolver.resolve(DefaultArtifactResolver.java:460)
	... 34 more


Jenkins build is back to normal : Jena_LARQ » LARQ #259

Posted by Apache Jenkins Server <je...@builds.apache.org>.
See <https://builds.apache.org/job/Jena_LARQ/org.apache.jena$jena-larq/259/>



Build failed in Jenkins: Jena_LARQ » LARQ #258

Posted by Apache Jenkins Server <je...@builds.apache.org>.
See <https://builds.apache.org/job/Jena_LARQ/org.apache.jena$jena-larq/258/>

------------------------------------------
<===[JENKINS REMOTING CAPACITY]===>channel started
   Executing Maven:  -B -f <https://builds.apache.org/job/Jena_LARQ/org.apache.jena$jena-larq/ws/pom.xml> clean install findbugs:findbugs cobertura:cobertura pmd:pmd
[INFO] Scanning for projects...
[INFO]                                                                         
[INFO] ------------------------------------------------------------------------
[INFO] Building LARQ 0.2.2-incubating-SNAPSHOT
[INFO] ------------------------------------------------------------------------
Downloading: http://repository.apache.org/snapshots/com/hp/hpl/jena/tdb/0.8.11-SNAPSHOT/tdb-0.8.11-SNAPSHOT.pom
[WARNING] The POM for com.hp.hpl.jena:tdb:jar:0.8.11-SNAPSHOT is missing, no dependency information available
Downloading: http://repository.apache.org/snapshots/com/hp/hpl/jena/tdb/0.8.11-SNAPSHOT/tdb-0.8.11-SNAPSHOT.jar
[JENKINS] Archiving <https://builds.apache.org/job/Jena_LARQ/org.apache.jena$jena-larq/ws/pom.xml> to /home/hudson/hudson/jobs/Jena_LARQ/modules/org.apache.jena$jena-larq/builds/2011-10-17_09-07-44/archive/org.apache.jena/jena-larq/0.2.2-incubating-SNAPSHOT/jena-larq-0.2.2-incubating-SNAPSHOT.pom
[INFO] ------------------------------------------------------------------------
[INFO] BUILD FAILURE
[INFO] ------------------------------------------------------------------------
[INFO] Total time: 9.762s
[INFO] Finished at: Mon Oct 17 09:08:06 UTC 2011
[INFO] Final Memory: 11M/114M
[INFO] ------------------------------------------------------------------------
mavenExecutionResult exceptions not empty
message : Failed to execute goal on project jena-larq: Could not resolve dependencies for project org.apache.jena:jena-larq:jar:0.2.2-incubating-SNAPSHOT: Could not find artifact com.hp.hpl.jena:tdb:jar:0.8.11-SNAPSHOT in Nexus (http://repository.apache.org/snapshots)
cause : Could not resolve dependencies for project org.apache.jena:jena-larq:jar:0.2.2-incubating-SNAPSHOT: Could not find artifact com.hp.hpl.jena:tdb:jar:0.8.11-SNAPSHOT in Nexus (http://repository.apache.org/snapshots)
Stack trace : 
org.apache.maven.lifecycle.LifecycleExecutionException: Failed to execute goal on project jena-larq: Could not resolve dependencies for project org.apache.jena:jena-larq:jar:0.2.2-incubating-SNAPSHOT: Could not find artifact com.hp.hpl.jena:tdb:jar:0.8.11-SNAPSHOT in Nexus (http://repository.apache.org/snapshots)
	at org.apache.maven.lifecycle.internal.LifecycleDependencyResolver.getDependencies(LifecycleDependencyResolver.java:196)
	at org.apache.maven.lifecycle.internal.LifecycleDependencyResolver.resolveProjectDependencies(LifecycleDependencyResolver.java:108)
	at org.apache.maven.lifecycle.internal.MojoExecutor.ensureDependenciesAreResolved(MojoExecutor.java:258)
	at org.apache.maven.lifecycle.internal.MojoExecutor.execute(MojoExecutor.java:201)
	at org.apache.maven.lifecycle.internal.MojoExecutor.execute(MojoExecutor.java:153)
	at org.apache.maven.lifecycle.internal.MojoExecutor.execute(MojoExecutor.java:145)
	at org.apache.maven.lifecycle.internal.LifecycleModuleBuilder.buildProject(LifecycleModuleBuilder.java:84)
	at org.apache.maven.lifecycle.internal.LifecycleModuleBuilder.buildProject(LifecycleModuleBuilder.java:59)
	at org.apache.maven.lifecycle.internal.LifecycleStarter.singleThreadedBuild(LifecycleStarter.java:183)
	at org.apache.maven.lifecycle.internal.LifecycleStarter.execute(LifecycleStarter.java:161)
	at org.apache.maven.DefaultMaven.doExecute(DefaultMaven.java:319)
	at org.apache.maven.DefaultMaven.execute(DefaultMaven.java:156)
	at org.jvnet.hudson.maven3.launcher.Maven3Launcher.main(Maven3Launcher.java:79)
	at sun.reflect.NativeMethodAccessorImpl.invoke0(Native Method)
	at sun.reflect.NativeMethodAccessorImpl.invoke(NativeMethodAccessorImpl.java:39)
	at sun.reflect.DelegatingMethodAccessorImpl.invoke(DelegatingMethodAccessorImpl.java:25)
	at java.lang.reflect.Method.invoke(Method.java:597)
	at org.codehaus.plexus.classworlds.launcher.Launcher.launchStandard(Launcher.java:329)
	at org.codehaus.plexus.classworlds.launcher.Launcher.launch(Launcher.java:239)
	at org.jvnet.hudson.maven3.agent.Maven3Main.launch(Maven3Main.java:158)
	at hudson.maven.Maven3Builder.call(Maven3Builder.java:122)
	at hudson.maven.Maven3Builder.call(Maven3Builder.java:74)
	at hudson.remoting.UserRequest.perform(UserRequest.java:118)
	at hudson.remoting.UserRequest.perform(UserRequest.java:48)
	at hudson.remoting.Request$2.run(Request.java:287)
	at java.util.concurrent.Executors$RunnableAdapter.call(Executors.java:441)
	at java.util.concurrent.FutureTask$Sync.innerRun(FutureTask.java:303)
	at java.util.concurrent.FutureTask.run(FutureTask.java:138)
	at java.util.concurrent.ThreadPoolExecutor$Worker.runTask(ThreadPoolExecutor.java:886)
	at java.util.concurrent.ThreadPoolExecutor$Worker.run(ThreadPoolExecutor.java:908)
	at java.lang.Thread.run(Thread.java:662)
Caused by: org.apache.maven.project.DependencyResolutionException: Could not resolve dependencies for project org.apache.jena:jena-larq:jar:0.2.2-incubating-SNAPSHOT: Could not find artifact com.hp.hpl.jena:tdb:jar:0.8.11-SNAPSHOT in Nexus (http://repository.apache.org/snapshots)
	at org.apache.maven.project.DefaultProjectDependenciesResolver.resolve(DefaultProjectDependenciesResolver.java:170)
	at org.apache.maven.lifecycle.internal.LifecycleDependencyResolver.getDependencies(LifecycleDependencyResolver.java:171)
	... 30 more
Caused by: org.sonatype.aether.resolution.DependencyResolutionException: Could not find artifact com.hp.hpl.jena:tdb:jar:0.8.11-SNAPSHOT in Nexus (http://repository.apache.org/snapshots)
	at org.sonatype.aether.impl.internal.DefaultRepositorySystem.resolveDependencies(DefaultRepositorySystem.java:412)
	at org.apache.maven.project.DefaultProjectDependenciesResolver.resolve(DefaultProjectDependenciesResolver.java:164)
	... 31 more
Caused by: org.sonatype.aether.resolution.ArtifactResolutionException: Could not find artifact com.hp.hpl.jena:tdb:jar:0.8.11-SNAPSHOT in Nexus (http://repository.apache.org/snapshots)
	at org.sonatype.aether.impl.internal.DefaultArtifactResolver.resolve(DefaultArtifactResolver.java:541)
	at org.sonatype.aether.impl.internal.DefaultArtifactResolver.resolveArtifacts(DefaultArtifactResolver.java:220)
	at org.sonatype.aether.impl.internal.DefaultRepositorySystem.resolveDependencies(DefaultRepositorySystem.java:395)
	... 32 more
Caused by: org.sonatype.aether.transfer.ArtifactNotFoundException: Could not find artifact com.hp.hpl.jena:tdb:jar:0.8.11-SNAPSHOT in Nexus (http://repository.apache.org/snapshots)
	at org.sonatype.aether.connector.wagon.WagonRepositoryConnector$4.wrap(WagonRepositoryConnector.java:945)
	at org.sonatype.aether.connector.wagon.WagonRepositoryConnector$4.wrap(WagonRepositoryConnector.java:940)
	at org.sonatype.aether.connector.wagon.WagonRepositoryConnector$GetTask.flush(WagonRepositoryConnector.java:695)
	at org.sonatype.aether.connector.wagon.WagonRepositoryConnector$GetTask.flush(WagonRepositoryConnector.java:689)
	at org.sonatype.aether.connector.wagon.WagonRepositoryConnector.get(WagonRepositoryConnector.java:445)
	at org.sonatype.aether.impl.internal.DefaultArtifactResolver.resolve(DefaultArtifactResolver.java:460)
	... 34 more