You are viewing a plain text version of this content. The canonical link for it is here.
Posted to commits@logging.apache.org by Apache Jenkins Server <je...@builds.apache.org> on 2017/07/09 10:03:52 UTC

Build failed in Jenkins: logging-log4net » feature/cd-pipeline #110

See <https://builds.apache.org/job/logging-log4net/job/feature%252Fcd-pipeline/110/display/redirect>

------------------------------------------
[...truncated 337 B...]
[Pipeline] node
Running on H22 in /home/jenkins/jenkins-slave/workspace/log4net_feature_cd-pipeline-76KUCPODUF6LCE45226EBUR4GNVLYPMYVC23Z4ITBOMNJT3CA2WA@2
[Pipeline] {
[Pipeline] timeout
Timeout set to expire in 1 hr 0 min
[Pipeline] {
[Pipeline] stage
[Pipeline] { (checkout)
[Pipeline] deleteDir
[Pipeline] checkout
Cloning the remote Git repository
Cloning repository https://github.com/apache/logging-log4net.git
 > git init /home/jenkins/jenkins-slave/workspace/log4net_feature_cd-pipeline-76KUCPODUF6LCE45226EBUR4GNVLYPMYVC23Z4ITBOMNJT3CA2WA@2 # timeout=10
Fetching upstream changes from https://github.com/apache/logging-log4net.git
 > git --version # timeout=10
using GIT_ASKPASS to set credentials dpsenner at github
 > git fetch --tags --progress https://github.com/apache/logging-log4net.git +refs/heads/*:refs/remotes/origin/*
 > git config remote.origin.url https://github.com/apache/logging-log4net.git # timeout=10
 > git config --add remote.origin.fetch +refs/heads/*:refs/remotes/origin/* # timeout=10
 > git config remote.origin.url https://github.com/apache/logging-log4net.git # timeout=10
Fetching upstream changes from https://github.com/apache/logging-log4net.git
using GIT_ASKPASS to set credentials dpsenner at github
 > git fetch --tags --progress https://github.com/apache/logging-log4net.git +refs/heads/*:refs/remotes/origin/*
 > git config remote.origin1.url https://github.com/apache/logging-log4net.git # timeout=10
Fetching upstream changes from https://github.com/apache/logging-log4net.git
using GIT_ASKPASS to set credentials dpsenner at github
 > git fetch --tags --progress https://github.com/apache/logging-log4net.git +refs/pull/*/head:refs/remotes/origin/pr/*
Checking out Revision 14675ee9646cfa0f62a9c6c021ae0e6d955536e6 (feature/cd-pipeline)
 > git config core.sparsecheckout # timeout=10
 > git checkout -f 14675ee9646cfa0f62a9c6c021ae0e6d955536e6
 > git rev-list 66d05d5c37739ef6e92eb9b0fefdecb1733ead77 # timeout=10
[Pipeline] }
[Pipeline] // stage
[Pipeline] stage
[Pipeline] { (build netstandard)
[Pipeline] getContext
[Pipeline] readFile
[Pipeline] sh
[log4net_feature_cd-pipeline-76KUCPODUF6LCE45226EBUR4GNVLYPMYVC23Z4ITBOMNJT3CA2WA@2] Running shell script
+ docker build -t a9aac75f2d81e2c9c47a34909592ca018feea301 -f buildtools/docker/builder-netstandard/Dockerfile buildtools/docker/builder-netstandard
Sending build context to Docker daemon 3.584 kB
Step 1/7 : FROM microsoft/dotnet
 ---> ab1dcd1a2496
Step 2/7 : MAINTAINER "dev@logging.apache.org"
 ---> Using cache
 ---> 1a392e603f49
Step 3/7 : RUN apt-get update && apt-get install -y nant git
 ---> Using cache
 ---> 67e2a492c30d
Step 4/7 : RUN groupadd -r -g 12040 jenkins-slave
 ---> Using cache
 ---> 75bcc9b0d1fb
Step 5/7 : RUN useradd --home-dir /home/jenkins/jenkins-slave/workspace --shell /bin/bash --uid 10025 --gid 12040 --groups 12040 -p -M jenkins
 ---> Using cache
 ---> f69955957b60
Step 6/7 : COPY entrypoint.sh /usr/local/bin/entrypoint.sh
 ---> e8ad97f1791a
Removing intermediate container 6ea1c8d7d948
Step 7/7 : ENTRYPOINT /usr/local/bin/entrypoint.sh
 ---> Running in 0a8006e87423
 ---> fc3b1c724fa7
Removing intermediate container 0a8006e87423
Successfully built fc3b1c724fa7
[Pipeline] dockerFingerprintFrom
[Pipeline] sh
[log4net_feature_cd-pipeline-76KUCPODUF6LCE45226EBUR4GNVLYPMYVC23Z4ITBOMNJT3CA2WA@2] Running shell script
+ docker inspect -f . a9aac75f2d81e2c9c47a34909592ca018feea301
.
[Pipeline] withDockerContainer
H22 does not seem to be running inside a container
$ docker run -t -d -u 10025:12040 -w /home/jenkins/jenkins-slave/workspace/log4net_feature_cd-pipeline-76KUCPODUF6LCE45226EBUR4GNVLYPMYVC23Z4ITBOMNJT3CA2WA@2 -v /home/jenkins/jenkins-slave/workspace/log4net_feature_cd-pipeline-76KUCPODUF6LCE45226EBUR4GNVLYPMYVC23Z4ITBOMNJT3CA2WA@2:/home/jenkins/jenkins-slave/workspace/log4net_feature_cd-pipeline-76KUCPODUF6LCE45226EBUR4GNVLYPMYVC23Z4ITBOMNJT3CA2WA@2:rw -v /home/jenkins/jenkins-slave/workspace/log4net_feature_cd-pipeline-76KUCPODUF6LCE45226EBUR4GNVLYPMYVC23Z4ITBOMNJT3CA2WA@2@tmp:/home/jenkins/jenkins-slave/workspace/log4net_feature_cd-pipeline-76KUCPODUF6LCE45226EBUR4GNVLYPMYVC23Z4ITBOMNJT3CA2WA@2@tmp:rw -e ******** -e ******** -e ******** -e ******** -e ******** -e ******** -e ******** -e ******** -e ******** -e ******** -e ******** -e ******** -e ******** -e ******** -e ******** -e ******** -e ******** -e ******** -e ******** -e ******** -e ******** -e ******** -e ******** --entrypoint cat a9aac75f2d81e2c9c47a34909592ca018feea301
[Pipeline] {
[Pipeline] sh
[log4net_feature_cd-pipeline-76KUCPODUF6LCE45226EBUR4GNVLYPMYVC23Z4ITBOMNJT3CA2WA@2] Running shell script
++ pwd
+ export HOME=/home/jenkins/jenkins-slave/workspace/log4net_feature_cd-pipeline-76KUCPODUF6LCE45226EBUR4GNVLYPMYVC23Z4ITBOMNJT3CA2WA@2
+ HOME=/home/jenkins/jenkins-slave/workspace/log4net_feature_cd-pipeline-76KUCPODUF6LCE45226EBUR4GNVLYPMYVC23Z4ITBOMNJT3CA2WA@2
[log4net_feature_cd-pipeline-76KUCPODUF6LCE45226EBUR4GNVLYPMYVC23Z4ITBOMNJT3CA2WA@2] Running shell script
[Pipeline] sh
+ echo home=/home/jenkins/jenkins-slave/workspace
home=/home/jenkins/jenkins-slave/workspace
[Pipeline] sh
[log4net_feature_cd-pipeline-76KUCPODUF6LCE45226EBUR4GNVLYPMYVC23Z4ITBOMNJT3CA2WA@2] Running shell script
+ echo user=
user=
[Pipeline] sh
[log4net_feature_cd-pipeline-76KUCPODUF6LCE45226EBUR4GNVLYPMYVC23Z4ITBOMNJT3CA2WA@2] Running shell script
+ cat /etc/passwd
root:x:0:0:root:/root:/bin/bash
daemon:x:1:1:daemon:/usr/sbin:/usr/sbin/nologin
bin:x:2:2:bin:/bin:/usr/sbin/nologin
sys:x:3:3:sys:/dev:/usr/sbin/nologin
sync:x:4:65534:sync:/bin:/bin/sync
games:x:5:60:games:/usr/games:/usr/sbin/nologin
man:x:6:12:man:/var/cache/man:/usr/sbin/nologin
lp:x:7:7:lp:/var/spool/lpd:/usr/sbin/nologin
mail:x:8:8:mail:/var/mail:/usr/sbin/nologin
news:x:9:9:news:/var/spool/news:/usr/sbin/nologin
uucp:x:10:10:uucp:/var/spool/uucp:/usr/sbin/nologin
proxy:x:13:13:proxy:/bin:/usr/sbin/nologin
www-data:x:33:33:www-data:/var/www:/usr/sbin/nologin
backup:x:34:34:backup:/var/backups:/usr/sbin/nologin
list:x:38:38:Mailing List Manager:/var/list:/usr/sbin/nologin
irc:x:39:39:ircd:/var/run/ircd:/usr/sbin/nologin
gnats:x:41:41:Gnats Bug-Reporting System (admin):/var/lib/gnats:/usr/sbin/nologin
nobody:x:65534:65534:nobody:/nonexistent:/usr/sbin/nologin
systemd-timesync:x:100:103:systemd Time Synchronization,,,:/run/systemd:/bin/false
systemd-network:x:101:104:systemd Network Management,,,:/run/systemd/netif:/bin/false
systemd-resolve:x:102:105:systemd Resolver,,,:/run/systemd/resolve:/bin/false
systemd-bus-proxy:x:103:106:systemd Bus Proxy,,,:/run/systemd:/bin/false
jenkins:x:10025:12040::/home/jenkins/jenkins-slave/workspace:/bin/bash
[Pipeline] checkout
 > git rev-parse --is-inside-work-tree # timeout=10
Fetching changes from 2 remote Git repositories
 > git config remote.origin.url https://github.com/apache/logging-log4net.git # timeout=10
Fetching upstream changes from https://github.com/apache/logging-log4net.git
 > git --version # timeout=10
using GIT_ASKPASS to set credentials dpsenner at github
 > git fetch --tags --progress https://github.com/apache/logging-log4net.git +refs/heads/*:refs/remotes/origin/*
 > git config remote.origin1.url https://github.com/apache/logging-log4net.git # timeout=10
Fetching upstream changes from https://github.com/apache/logging-log4net.git
using GIT_ASKPASS to set credentials dpsenner at github
 > git fetch --tags --progress https://github.com/apache/logging-log4net.git +refs/pull/*/head:refs/remotes/origin/pr/*
Checking out Revision 14675ee9646cfa0f62a9c6c021ae0e6d955536e6 (feature/cd-pipeline)
 > git config core.sparsecheckout # timeout=10
 > git checkout -f 14675ee9646cfa0f62a9c6c021ae0e6d955536e6
[Pipeline] sh
[log4net_feature_cd-pipeline-76KUCPODUF6LCE45226EBUR4GNVLYPMYVC23Z4ITBOMNJT3CA2WA@2] Running shell script
+ nant compile-netstandard
NAnt 0.92 (Build 0.92.4526.0; rc1; 05/23/2012)
Copyright (C) 2001-2012 Gerry Shaw
http://nant.sourceforge.net

Buildfile: file:///home/jenkins/jenkins-slave/workspace/log4net_feature_cd-pipeline-76KUCPODUF6LCE45226EBUR4GNVLYPMYVC23Z4ITBOMNJT3CA2WA@2/log4net.build
Target framework: Mono 4.0 Profile
Target(s) specified: compile-netstandard 


check-current-build-config:


set-build-configuration:


set-debug-build-configuration:


check-current-build-config:


set-build-configuration-flags:


compile-netstandard:


set-debug-build-configuration:


check-current-build-config:


set-build-configuration-flags:


compile-netstandard-current-configuration:

     [echo] dotnet --version
     [exec] 1.0.4
     [echo] dotnet restore log4net.netstandard.sln
     [exec] /usr/share/dotnet/sdk/1.0.4/NuGet.targets(97,5): error : Failed to read NuGet.Config due to unauthorized access. Path: '/home/jenkins/jenkins-slave/workspace/.nuget/NuGet/NuGet.Config'. [/home/jenkins/jenkins-slave/workspace/log4net_feature_cd-pipeline-76KUCPODUF6LCE45226EBUR4GNVLYPMYVC23Z4ITBOMNJT3CA2WA@2/netstandard/log4net.netstandard.sln]
     [exec] /usr/share/dotnet/sdk/1.0.4/NuGet.targets(97,5): error :   Access to the path '/home/jenkins/jenkins-slave/workspace/.nuget/NuGet' is denied. [/home/jenkins/jenkins-slave/workspace/log4net_feature_cd-pipeline-76KUCPODUF6LCE45226EBUR4GNVLYPMYVC23Z4ITBOMNJT3CA2WA@2/netstandard/log4net.netstandard.sln]
     [exec] /usr/share/dotnet/sdk/1.0.4/NuGet.targets(97,5): error :   Permission denied [/home/jenkins/jenkins-slave/workspace/log4net_feature_cd-pipeline-76KUCPODUF6LCE45226EBUR4GNVLYPMYVC23Z4ITBOMNJT3CA2WA@2/netstandard/log4net.netstandard.sln]

BUILD FAILED

/home/jenkins/jenkins-slave/workspace/log4net_feature_cd-pipeline-76KUCPODUF6LCE45226EBUR4GNVLYPMYVC23Z4ITBOMNJT3CA2WA@2/log4net.build(1768,8):
External Program Failed: dotnet (return code was 1)

Total time: 2.6 seconds.

[Pipeline] }
$ docker stop --time=1 09de72da30bd5143e4dde6c522b9511240c92b8df808875799002ed41ce74917
$ docker rm -f 09de72da30bd5143e4dde6c522b9511240c92b8df808875799002ed41ce74917
[Pipeline] // withDockerContainer
[Pipeline] }
[Pipeline] // stage
[Pipeline] stage
[Pipeline] { (build net-3.5)
Stage 'build net-3.5' skipped due to earlier failure(s)
[Pipeline] }
[Pipeline] // stage
[Pipeline] stage
[Pipeline] { (build net-3.5-cp)
Stage 'build net-3.5-cp' skipped due to earlier failure(s)
[Pipeline] }
[Pipeline] // stage
[Pipeline] stage
[Pipeline] { (build net-4.0)
Stage 'build net-4.0' skipped due to earlier failure(s)
[Pipeline] }
[Pipeline] // stage
[Pipeline] stage
[Pipeline] { (build net-4.0-cp)
Stage 'build net-4.0-cp' skipped due to earlier failure(s)
[Pipeline] }
[Pipeline] // stage
[Pipeline] stage
[Pipeline] { (build net-4.5)
Stage 'build net-4.5' skipped due to earlier failure(s)
[Pipeline] }
[Pipeline] // stage
[Pipeline] stage
[Pipeline] { (build mono-2.0)
Stage 'build mono-2.0' skipped due to earlier failure(s)
[Pipeline] }
[Pipeline] // stage
[Pipeline] stage
[Pipeline] { (build mono-3.5)
Stage 'build mono-3.5' skipped due to earlier failure(s)
[Pipeline] }
[Pipeline] // stage
[Pipeline] stage
[Pipeline] { (build mono-4.0)
Stage 'build mono-4.0' skipped due to earlier failure(s)
[Pipeline] }
[Pipeline] // stage
[Pipeline] stage
[Pipeline] { (build site)
Stage 'build site' skipped due to earlier failure(s)
[Pipeline] }
[Pipeline] // stage
[Pipeline] stage
[Pipeline] { (prepare package)
Stage 'prepare package' skipped due to earlier failure(s)
[Pipeline] }
[Pipeline] // stage
[Pipeline] stage
[Pipeline] { (check test results)
Stage 'check test results' skipped due to earlier failure(s)
[Pipeline] }
[Pipeline] // stage
[Pipeline] stage
[Pipeline] { (publish site)
Stage 'publish site' skipped due to earlier failure(s)
[Pipeline] }
[Pipeline] // stage
[Pipeline] stage
[Pipeline] { (Declarative: Post Actions)