You are viewing a plain text version of this content. The canonical link for it is here.
Posted to dev@geode.apache.org by Apache Jenkins Server <je...@builds.apache.org> on 2017/02/13 16:10:09 UTC

Build failed in Jenkins: Geode-nightly #747

See <https://builds.apache.org/job/Geode-nightly/747/>

------------------------------------------
[...truncated 1416 lines...]
Note: Some input files use unchecked or unsafe operations.
Note: Recompile with -Xlint:unchecked for details.

:geode-cq:processTestResources
:geode-cq:testClasses
:geode-cq:checkMissedTests
:geode-cq:spotlessJavaCheck
:geode-cq:spotlessCheck
:geode-cq:test
:geode-cq:check
:geode-cq:build
:geode-cq:distributedTest
:geode-cq:flakyTest
:geode-cq:integrationTest
:geode-json:assemble
:geode-json:compileTestJava UP-TO-DATE
:geode-json:processTestResources UP-TO-DATE
:geode-json:testClasses UP-TO-DATE
:geode-json:checkMissedTests UP-TO-DATE
:geode-json:spotlessJavaCheck
:geode-json:spotlessCheck
:geode-json:test UP-TO-DATE
:geode-json:check
:geode-json:build
:geode-json:distributedTest UP-TO-DATE
:geode-json:flakyTest UP-TO-DATE
:geode-json:integrationTest UP-TO-DATE
:geode-junit:javadoc
:geode-junit:javadocJar
:geode-junit:sourcesJar
:geode-junit:signArchives SKIPPED
:geode-junit:assemble
:geode-junit:compileTestJava
:geode-junit:processTestResources UP-TO-DATE
:geode-junit:testClasses
:geode-junit:checkMissedTests
:geode-junit:spotlessJavaCheck
:geode-junit:spotlessCheck
:geode-junit:test
:geode-junit:check
:geode-junit:build
:geode-junit:distributedTest
:geode-junit:flakyTest
:geode-junit:integrationTest
:geode-lucene:assemble
:geode-lucene:compileTestJava
Download https://repo1.maven.org/maven2/org/apache/lucene/lucene-test-framework/6.0.0/lucene-test-framework-6.0.0.pom
Download https://repo1.maven.org/maven2/org/apache/lucene/lucene-codecs/6.0.0/lucene-codecs-6.0.0.pom
Download https://repo1.maven.org/maven2/org/apache/lucene/lucene-test-framework/6.0.0/lucene-test-framework-6.0.0.jar
Download https://repo1.maven.org/maven2/org/apache/lucene/lucene-codecs/6.0.0/lucene-codecs-6.0.0.jar
Note: Some input files use or override a deprecated API.
Note: Recompile with -Xlint:deprecation for details.
Note: Some input files use unchecked or unsafe operations.
Note: Recompile with -Xlint:unchecked for details.
:geode-lucene:processTestResources
:geode-lucene:testClasses
:geode-lucene:checkMissedTests
:geode-lucene:spotlessJavaCheck
:geode-lucene:spotlessCheck
:geode-lucene:test
:geode-lucene:check
:geode-lucene:build
:geode-lucene:distributedTest
:geode-lucene:flakyTest
:geode-lucene:integrationTest
:geode-old-client-support:assemble
:geode-old-client-support:compileTestJava
:geode-old-client-support:processTestResources UP-TO-DATE
:geode-old-client-support:testClasses
:geode-old-client-support:checkMissedTests
:geode-old-client-support:spotlessJavaCheck
:geode-old-client-support:spotlessCheck
:geode-old-client-support:test
:geode-old-client-support:check
:geode-old-client-support:build
:geode-old-client-support:distributedTest
:geode-old-client-support:flakyTest
:geode-old-client-support:integrationTest
:geode-old-versions:javadoc UP-TO-DATE
:geode-old-versions:javadocJar
:geode-old-versions:sourcesJar
:geode-old-versions:signArchives SKIPPED
:geode-old-versions:assemble
:geode-old-versions:compileTestJava UP-TO-DATE
:geode-old-versions:processTestResources UP-TO-DATE
:geode-old-versions:testClasses UP-TO-DATE
:geode-old-versions:checkMissedTests UP-TO-DATE
:geode-old-versions:spotlessJavaCheck
:geode-old-versions:spotlessCheck
:geode-old-versions:test UP-TO-DATE
:geode-old-versions:check
:geode-old-versions:build
:geode-old-versions:distributedTest UP-TO-DATE
:geode-old-versions:flakyTest UP-TO-DATE
:geode-old-versions:integrationTest UP-TO-DATE
:geode-pulse:assemble
:geode-pulse:compileTestJava
Download https://repo1.maven.org/maven2/org/seleniumhq/selenium/selenium-api/2.53.1/selenium-api-2.53.1.pom
Download https://repo1.maven.org/maven2/org/seleniumhq/selenium/selenium-parent/2.53.1/selenium-parent-2.53.1.pom
Download https://repo1.maven.org/maven2/org/seleniumhq/selenium/selenium-remote-driver/2.53.1/selenium-remote-driver-2.53.1.pom
Download https://repo1.maven.org/maven2/org/seleniumhq/selenium/selenium-support/2.53.1/selenium-support-2.53.1.pom
Download https://repo1.maven.org/maven2/org/springframework/spring-test/4.3.2.RELEASE/spring-test-4.3.2.RELEASE.pom
Download https://repo1.maven.org/maven2/com/tdunning/json/1.7/json-1.7.pom
Download https://repo1.maven.org/maven2/org/seleniumhq/selenium/selenium-api/2.53.1/selenium-api-2.53.1.jar
Download https://repo1.maven.org/maven2/org/seleniumhq/selenium/selenium-remote-driver/2.53.1/selenium-remote-driver-2.53.1.jar
Download https://repo1.maven.org/maven2/org/seleniumhq/selenium/selenium-support/2.53.1/selenium-support-2.53.1.jar
Download https://repo1.maven.org/maven2/org/springframework/spring-test/4.3.2.RELEASE/spring-test-4.3.2.RELEASE.jar
Download https://repo1.maven.org/maven2/com/tdunning/json/1.7/json-1.7.jar
Note: <https://builds.apache.org/job/Geode-nightly/ws/geode-pulse/src/test/java/org/apache/geode/tools/pulse/tests/ui/PulseBase.java> uses or overrides a deprecated API.
Note: Recompile with -Xlint:deprecation for details.
Note: <https://builds.apache.org/job/Geode-nightly/ws/geode-pulse/src/test/java/org/apache/geode/tools/pulse/controllers/PulseControllerJUnitTest.java> uses unchecked or unsafe operations.
Note: Recompile with -Xlint:unchecked for details.
:geode-pulse:processTestResources
:geode-pulse:testClasses
:geode-pulse:checkMissedTests
:geode-pulse:spotlessJavaCheck
:geode-pulse:spotlessCheck
:geode-pulse:test
:geode-pulse:check
:geode-pulse:build
:geode-pulse:distributedTest
:geode-pulse:flakyTest
:geode-pulse:integrationTest
:geode-rebalancer:assemble
:geode-rebalancer:compileTestJava
:geode-rebalancer:processTestResources UP-TO-DATE
:geode-rebalancer:testClasses
:geode-rebalancer:checkMissedTests
:geode-rebalancer:spotlessJavaCheck
:geode-rebalancer:spotlessCheck
:geode-rebalancer:test
:geode-rebalancer:check
:geode-rebalancer:build
:geode-rebalancer:distributedTest
:geode-rebalancer:flakyTest
:geode-rebalancer:integrationTest
:geode-wan:assemble
:geode-wan:compileTestJavaNote: Some input files use or override a deprecated API.
Note: Recompile with -Xlint:deprecation for details.
Note: Some input files use unchecked or unsafe operations.
Note: Recompile with -Xlint:unchecked for details.

:geode-wan:processTestResources
:geode-wan:testClasses
:geode-wan:checkMissedTests
:geode-wan:spotlessJavaCheck
:geode-wan:spotlessCheck
:geode-wan:test
:geode-wan:check
:geode-wan:build
:geode-wan:distributedTest
:geode-wan:flakyTest
:geode-wan:integrationTest
:geode-web:assemble
:geode-web:compileTestJavaNote: Some input files use or override a deprecated API.
Note: Recompile with -Xlint:deprecation for details.
Note: Some input files use unchecked or unsafe operations.
Note: Recompile with -Xlint:unchecked for details.

:geode-web:processTestResources UP-TO-DATE
:geode-web:testClasses
:geode-web:checkMissedTests
:geode-web:spotlessJavaCheck
:geode-web:spotlessCheck
:geode-web:test
:geode-web:check
:geode-web:build
:geode-web:distributedTest
:geode-web:flakyTest
:geode-web:integrationTest
:geode-web-api:assemble
:geode-web-api:compileTestJava
:geode-web-api:processTestResources UP-TO-DATE
:geode-web-api:testClasses
:geode-web-api:checkMissedTests
:geode-web-api:spotlessJavaCheck
:geode-web-api:spotlessCheck
:geode-web-api:test
:geode-web-api:check
:geode-web-api:build
:geode-web-api:distributedTest
:geode-web-api:flakyTest
:geode-web-api:integrationTest
:combineReports
All test reports at <https://builds.apache.org/job/Geode-nightly/ws/build/reports/combined>
:extensions/geode-modules:precheckin
:extensions/geode-modules-assembly:precheckin
:extensions/geode-modules-session:precheckin
:extensions/geode-modules-session-internal:precheckin
:extensions/geode-modules-tomcat7:precheckin
:extensions/geode-modules-tomcat8:precheckin
:geode-assembly:precheckin
:geode-benchmarks:precheckin
:geode-common:precheckin
:geode-cq:precheckin
:geode-json:precheckin
:geode-junit:precheckin
:geode-lucene:precheckin
:geode-old-client-support:precheckin
:geode-old-versions:precheckin
:geode-pulse:precheckin
:geode-rebalancer:precheckin
:geode-wan:precheckin
:geode-web:precheckin
:geode-web-api:precheckin
:compileJava UP-TO-DATE
:processResources UP-TO-DATE
:classes UP-TO-DATE
:jar
:uploadArchives
:extensions/geode-modules:uploadArchives
:extensions/geode-modules-assembly:uploadArchives SKIPPED
:extensions/geode-modules-session:uploadArchives
:extensions/geode-modules-session-internal:uploadArchives
:extensions/geode-modules-tomcat7:uploadArchives
:extensions/geode-modules-tomcat8:uploadArchives
:geode-assembly:uploadArchives SKIPPED
:geode-benchmarks:uploadArchives SKIPPED
:geode-common:uploadArchives
:geode-core:uploadArchives
:geode-cq:uploadArchives
:geode-json:uploadArchives
:geode-junit:uploadArchives
:geode-lucene:uploadArchives
:geode-old-client-support:uploadArchives
:geode-old-versions:uploadArchives SKIPPED
:geode-pulse:uploadArchives
:geode-rebalancer:uploadArchives
:geode-wan:uploadArchives
:geode-web:uploadArchives
:geode-web-api:uploadArchives

FAILURE: Build failed with an exception.

* What went wrong:
Execution failed for task ':geode-core:distributedTest'.
> There were failing tests. See the report at: file://<https://builds.apache.org/job/Geode-nightly/ws/geode-core/build/reports/distributedTest/index.html>

* Try:
Run with --stacktrace option to get the stack trace. Run with --info or --debug option to get more log output.

BUILD FAILED

Total time: 12 hrs 25 mins 1.659 secs
Build step 'Invoke Gradle script' changed build result to FAILURE
Build step 'Invoke Gradle script' marked build as failure
Archiving artifacts
Compressed 348.66 MB of artifacts by 33.1% relative to #746
Recording test results

Build failed in Jenkins: Geode-nightly #753

Posted by Apache Jenkins Server <je...@builds.apache.org>.
See <https://builds.apache.org/job/Geode-nightly/753/display/redirect>

------------------------------------------
[...truncated 99.89 KB...]

org.apache.geode.management.UniversalMembershipListenerAdapterDUnitTest > testSystemClientEventsInServer FAILED
    org.junit.ComparisonFailure: expected:<[67.195.81.13]9(12149)<ec><v44>:32...> but was:<[asf91]9(12149)<ec><v44>:32...>
        at org.junit.Assert.assertEquals(Assert.java:115)
        at org.junit.Assert.assertEquals(Assert.java:144)
        at org.apache.geode.management.UniversalMembershipListenerAdapterDUnitTest.doTestSystemClientEventsInServer(UniversalMembershipListenerAdapterDUnitTest.java:946)
        at org.apache.geode.management.UniversalMembershipListenerAdapterDUnitTest.testSystemClientEventsInServer(UniversalMembershipListenerAdapterDUnitTest.java:731)

6854 tests completed, 1 failed, 605 skipped
:geode-core:distributedTest FAILED
:geode-core:flakyTest
:geode-core:integrationTest
:geode-cq:assemble
:geode-cq:compileTestJavaNote: Some input files use or override a deprecated API.
Note: Recompile with -Xlint:deprecation for details.
Note: Some input files use unchecked or unsafe operations.
Note: Recompile with -Xlint:unchecked for details.

:geode-cq:processTestResources
:geode-cq:testClasses
:geode-cq:checkMissedTests
:geode-cq:spotlessJavaCheck
:geode-cq:spotlessCheck
:geode-cq:test
:geode-cq:check
:geode-cq:build
:geode-cq:distributedTest
:geode-cq:flakyTest
:geode-cq:integrationTest
:geode-json:assemble
:geode-json:compileTestJava UP-TO-DATE
:geode-json:processTestResources UP-TO-DATE
:geode-json:testClasses UP-TO-DATE
:geode-json:checkMissedTests UP-TO-DATE
:geode-json:spotlessJavaCheck
:geode-json:spotlessCheck
:geode-json:test UP-TO-DATE
:geode-json:check
:geode-json:build
:geode-json:distributedTest UP-TO-DATE
:geode-json:flakyTest UP-TO-DATE
:geode-json:integrationTest UP-TO-DATE
:geode-junit:javadoc
:geode-junit:javadocJar
:geode-junit:sourcesJar
:geode-junit:signArchives SKIPPED
:geode-junit:assemble
:geode-junit:compileTestJava
:geode-junit:processTestResources UP-TO-DATE
:geode-junit:testClasses
:geode-junit:checkMissedTests
:geode-junit:spotlessJavaCheck
:geode-junit:spotlessCheck
:geode-junit:test
:geode-junit:check
:geode-junit:build
:geode-junit:distributedTest
:geode-junit:flakyTest
:geode-junit:integrationTest
:geode-lucene:assemble
:geode-lucene:compileTestJavaNote: Some input files use or override a deprecated API.
Note: Recompile with -Xlint:deprecation for details.
Note: Some input files use unchecked or unsafe operations.
Note: Recompile with -Xlint:unchecked for details.

:geode-lucene:processTestResources
:geode-lucene:testClasses
:geode-lucene:checkMissedTests
:geode-lucene:spotlessJavaCheck
:geode-lucene:spotlessCheck
:geode-lucene:test
:geode-lucene:check
:geode-lucene:build
:geode-lucene:distributedTest
:geode-lucene:flakyTest
:geode-lucene:integrationTest
:geode-old-client-support:assemble
:geode-old-client-support:compileTestJava
:geode-old-client-support:processTestResources UP-TO-DATE
:geode-old-client-support:testClasses
:geode-old-client-support:checkMissedTests
:geode-old-client-support:spotlessJavaCheck
:geode-old-client-support:spotlessCheck
:geode-old-client-support:test
:geode-old-client-support:check
:geode-old-client-support:build
:geode-old-client-support:distributedTest
:geode-old-client-support:flakyTest
:geode-old-client-support:integrationTest
:geode-old-versions:javadoc UP-TO-DATE
:geode-old-versions:javadocJar
:geode-old-versions:sourcesJar
:geode-old-versions:signArchives SKIPPED
:geode-old-versions:assemble
:geode-old-versions:compileTestJava UP-TO-DATE
:geode-old-versions:processTestResources UP-TO-DATE
:geode-old-versions:testClasses UP-TO-DATE
:geode-old-versions:checkMissedTests UP-TO-DATE
:geode-old-versions:spotlessJavaCheck
:geode-old-versions:spotlessCheck
:geode-old-versions:test UP-TO-DATE
:geode-old-versions:check
:geode-old-versions:build
:geode-old-versions:distributedTest UP-TO-DATE
:geode-old-versions:flakyTest UP-TO-DATE
:geode-old-versions:integrationTest UP-TO-DATE
:geode-pulse:assemble
:geode-pulse:compileTestJavaNote: <https://builds.apache.org/job/Geode-nightly/ws/geode-pulse/src/test/java/org/apache/geode/tools/pulse/tests/ui/PulseBase.java> uses or overrides a deprecated API.
Note: Recompile with -Xlint:deprecation for details.
Note: <https://builds.apache.org/job/Geode-nightly/ws/geode-pulse/src/test/java/org/apache/geode/tools/pulse/controllers/PulseControllerJUnitTest.java> uses unchecked or unsafe operations.
Note: Recompile with -Xlint:unchecked for details.

:geode-pulse:processTestResources
:geode-pulse:testClasses
:geode-pulse:checkMissedTests
:geode-pulse:spotlessJavaCheck
:geode-pulse:spotlessCheck
:geode-pulse:test
:geode-pulse:check
:geode-pulse:build
:geode-pulse:distributedTest
:geode-pulse:flakyTest
:geode-pulse:integrationTest
:geode-rebalancer:assemble
:geode-rebalancer:compileTestJava
:geode-rebalancer:processTestResources UP-TO-DATE
:geode-rebalancer:testClasses
:geode-rebalancer:checkMissedTests
:geode-rebalancer:spotlessJavaCheck
:geode-rebalancer:spotlessCheck
:geode-rebalancer:test
:geode-rebalancer:check
:geode-rebalancer:build
:geode-rebalancer:distributedTest
:geode-rebalancer:flakyTest
:geode-rebalancer:integrationTest
:geode-wan:assemble
:geode-wan:compileTestJavaNote: Some input files use or override a deprecated API.
Note: Recompile with -Xlint:deprecation for details.
Note: Some input files use unchecked or unsafe operations.
Note: Recompile with -Xlint:unchecked for details.

:geode-wan:processTestResources
:geode-wan:testClasses
:geode-wan:checkMissedTests
:geode-wan:spotlessJavaCheck
:geode-wan:spotlessCheck
:geode-wan:test
:geode-wan:check
:geode-wan:build
:geode-wan:distributedTest
:geode-wan:flakyTest
:geode-wan:integrationTest
:geode-web:assemble
:geode-web:compileTestJavaNote: Some input files use or override a deprecated API.
Note: Recompile with -Xlint:deprecation for details.
Note: Some input files use unchecked or unsafe operations.
Note: Recompile with -Xlint:unchecked for details.

:geode-web:processTestResources UP-TO-DATE
:geode-web:testClasses
:geode-web:checkMissedTests
:geode-web:spotlessJavaCheck
:geode-web:spotlessCheck
:geode-web:test
:geode-web:check
:geode-web:build
:geode-web:distributedTest
:geode-web:flakyTest
:geode-web:integrationTest
:geode-web-api:assemble
:geode-web-api:compileTestJava
:geode-web-api:processTestResources UP-TO-DATE
:geode-web-api:testClasses
:geode-web-api:checkMissedTests
:geode-web-api:spotlessJavaCheck
:geode-web-api:spotlessCheck
:geode-web-api:test
:geode-web-api:check
:geode-web-api:build
:geode-web-api:distributedTest
:geode-web-api:flakyTest
:geode-web-api:integrationTest
:combineReports
All test reports at <https://builds.apache.org/job/Geode-nightly/ws/build/reports/combined>
:extensions/geode-modules:precheckin
:extensions/geode-modules-assembly:precheckin
:extensions/geode-modules-session:precheckin
:extensions/geode-modules-session-internal:precheckin
:extensions/geode-modules-tomcat7:precheckin
:extensions/geode-modules-tomcat8:precheckin
:geode-assembly:precheckin
:geode-benchmarks:precheckin
:geode-common:precheckin
:geode-cq:precheckin
:geode-json:precheckin
:geode-junit:precheckin
:geode-lucene:precheckin
:geode-old-client-support:precheckin
:geode-old-versions:precheckin
:geode-pulse:precheckin
:geode-rebalancer:precheckin
:geode-wan:precheckin
:geode-web:precheckin
:geode-web-api:precheckin
:compileJava UP-TO-DATE
:processResources UP-TO-DATE
:classes UP-TO-DATE
:jar
:uploadArchives
:extensions/geode-modules:uploadArchives
:extensions/geode-modules-assembly:uploadArchives SKIPPED
:extensions/geode-modules-session:uploadArchives
:extensions/geode-modules-session-internal:uploadArchives
:extensions/geode-modules-tomcat7:uploadArchives
:extensions/geode-modules-tomcat8:uploadArchives
:geode-assembly:uploadArchives SKIPPED
:geode-benchmarks:uploadArchives SKIPPED
:geode-common:uploadArchives
:geode-core:uploadArchives
:geode-cq:uploadArchives
:geode-json:uploadArchives
:geode-junit:uploadArchives
:geode-lucene:uploadArchives
:geode-old-client-support:uploadArchives
:geode-old-versions:uploadArchives SKIPPED
:geode-pulse:uploadArchives
:geode-rebalancer:uploadArchives
:geode-wan:uploadArchives
:geode-web:uploadArchives
:geode-web-api:uploadArchives

FAILURE: Build failed with an exception.

* What went wrong:
Execution failed for task ':geode-core:distributedTest'.
> There were failing tests. See the report at: file://<https://builds.apache.org/job/Geode-nightly/ws/geode-core/build/reports/distributedTest/index.html>

* Try:
Run with --stacktrace option to get the stack trace. Run with --info or --debug option to get more log output.

BUILD FAILED

Total time: 12 hrs 22 mins 56.827 secs
Build step 'Invoke Gradle script' changed build result to FAILURE
Build step 'Invoke Gradle script' marked build as failure
Archiving artifacts
Compressed 325.53 MB of artifacts by 19.7% relative to #746
Recording test results

Build failed in Jenkins: Geode-nightly #752

Posted by Apache Jenkins Server <je...@builds.apache.org>.
See <https://builds.apache.org/job/Geode-nightly/752/changes>

Changes:

[upthewaterspout] Adding GIITestHook to excludedClasses.txt

[upthewaterspout] Removing incubating reference from BUILDING.md

[ukohlmeyer] GEODE-2142: Removal of non-compliant org.json implementation.

[ukohlmeyer] GEODE-2142: Spotless

[ukohlmeyer] Revert "GEODE-2142: Spotless"

[ukohlmeyer] Revert "GEODE-2142: Removal of non-compliant org.json implementation."

[abaker] Remove generated html files

[upthewaterspout] Run backwards compatibility tests against 1.1.0.

[Anil] GEODE-2490: Avoid processing tombstone GC message in-line

------------------------------------------
[...truncated 556 lines...]
:geode-core:distributedTest

org.apache.geode.distributed.LocatorUDPSecurityDUnitTest > testNonSSLLocatorDiesWhenConnectingToSSLLocator FAILED
    org.apache.geode.test.dunit.RMIException: While invoking org.apache.geode.test.dunit.NamedCallable.call in VM 1 running on Host asf902.gq1.ygridcore.net with 5 VMs

        Caused by:
        java.lang.AssertionError: expected:<1> but was:<2>

6854 tests completed, 1 failed, 605 skipped
:geode-core:distributedTest FAILED
:geode-core:flakyTest
:geode-core:integrationTest
:geode-cq:assemble
:geode-cq:compileTestJavaNote: Some input files use or override a deprecated API.
Note: Recompile with -Xlint:deprecation for details.
Note: Some input files use unchecked or unsafe operations.
Note: Recompile with -Xlint:unchecked for details.

:geode-cq:processTestResources
:geode-cq:testClasses
:geode-cq:checkMissedTests
:geode-cq:spotlessJavaCheck
:geode-cq:spotlessCheck
:geode-cq:test
:geode-cq:check
:geode-cq:build
:geode-cq:distributedTest
:geode-cq:flakyTest
:geode-cq:integrationTest
:geode-json:assemble
:geode-json:compileTestJava UP-TO-DATE
:geode-json:processTestResources UP-TO-DATE
:geode-json:testClasses UP-TO-DATE
:geode-json:checkMissedTests UP-TO-DATE
:geode-json:spotlessJavaCheck
:geode-json:spotlessCheck
:geode-json:test UP-TO-DATE
:geode-json:check
:geode-json:build
:geode-json:distributedTest UP-TO-DATE
:geode-json:flakyTest UP-TO-DATE
:geode-json:integrationTest UP-TO-DATE
:geode-junit:javadoc
:geode-junit:javadocJar
:geode-junit:sourcesJar
:geode-junit:signArchives SKIPPED
:geode-junit:assemble
:geode-junit:compileTestJava
:geode-junit:processTestResources UP-TO-DATE
:geode-junit:testClasses
:geode-junit:checkMissedTests
:geode-junit:spotlessJavaCheck
:geode-junit:spotlessCheck
:geode-junit:test
:geode-junit:check
:geode-junit:build
:geode-junit:distributedTest
:geode-junit:flakyTest
:geode-junit:integrationTest
:geode-lucene:assemble
:geode-lucene:compileTestJavaNote: Some input files use or override a deprecated API.
Note: Recompile with -Xlint:deprecation for details.
Note: Some input files use unchecked or unsafe operations.
Note: Recompile with -Xlint:unchecked for details.

:geode-lucene:processTestResources
:geode-lucene:testClasses
:geode-lucene:checkMissedTests
:geode-lucene:spotlessJavaCheck
:geode-lucene:spotlessCheck
:geode-lucene:test
:geode-lucene:check
:geode-lucene:build
:geode-lucene:distributedTest
:geode-lucene:flakyTest
:geode-lucene:integrationTest
:geode-old-client-support:assemble
:geode-old-client-support:compileTestJava
:geode-old-client-support:processTestResources UP-TO-DATE
:geode-old-client-support:testClasses
:geode-old-client-support:checkMissedTests
:geode-old-client-support:spotlessJavaCheck
:geode-old-client-support:spotlessCheck
:geode-old-client-support:test
:geode-old-client-support:check
:geode-old-client-support:build
:geode-old-client-support:distributedTest
:geode-old-client-support:flakyTest
:geode-old-client-support:integrationTest
:geode-old-versions:javadoc UP-TO-DATE
:geode-old-versions:javadocJar
:geode-old-versions:sourcesJar
:geode-old-versions:signArchives SKIPPED
:geode-old-versions:assemble
:geode-old-versions:compileTestJava UP-TO-DATE
:geode-old-versions:processTestResources UP-TO-DATE
:geode-old-versions:testClasses UP-TO-DATE
:geode-old-versions:checkMissedTests UP-TO-DATE
:geode-old-versions:spotlessJavaCheck
:geode-old-versions:spotlessCheck
:geode-old-versions:test UP-TO-DATE
:geode-old-versions:check
:geode-old-versions:build
:geode-old-versions:distributedTest UP-TO-DATE
:geode-old-versions:flakyTest UP-TO-DATE
:geode-old-versions:integrationTest UP-TO-DATE
:geode-pulse:assemble
:geode-pulse:compileTestJavaNote: <https://builds.apache.org/job/Geode-nightly/ws/geode-pulse/src/test/java/org/apache/geode/tools/pulse/tests/ui/PulseBase.java> uses or overrides a deprecated API.
Note: Recompile with -Xlint:deprecation for details.
Note: <https://builds.apache.org/job/Geode-nightly/ws/geode-pulse/src/test/java/org/apache/geode/tools/pulse/controllers/PulseControllerJUnitTest.java> uses unchecked or unsafe operations.
Note: Recompile with -Xlint:unchecked for details.

:geode-pulse:processTestResources
:geode-pulse:testClasses
:geode-pulse:checkMissedTests
:geode-pulse:spotlessJavaCheck
:geode-pulse:spotlessCheck
:geode-pulse:test
:geode-pulse:check
:geode-pulse:build
:geode-pulse:distributedTest
:geode-pulse:flakyTest
:geode-pulse:integrationTest
:geode-rebalancer:assemble
:geode-rebalancer:compileTestJava
:geode-rebalancer:processTestResources UP-TO-DATE
:geode-rebalancer:testClasses
:geode-rebalancer:checkMissedTests
:geode-rebalancer:spotlessJavaCheck
:geode-rebalancer:spotlessCheck
:geode-rebalancer:test
:geode-rebalancer:check
:geode-rebalancer:build
:geode-rebalancer:distributedTest
:geode-rebalancer:flakyTest
:geode-rebalancer:integrationTest
:geode-wan:assemble
:geode-wan:compileTestJavaNote: Some input files use or override a deprecated API.
Note: Recompile with -Xlint:deprecation for details.
Note: Some input files use unchecked or unsafe operations.
Note: Recompile with -Xlint:unchecked for details.

:geode-wan:processTestResources
:geode-wan:testClasses
:geode-wan:checkMissedTests
:geode-wan:spotlessJavaCheck
:geode-wan:spotlessCheck
:geode-wan:test
:geode-wan:check
:geode-wan:build
:geode-wan:distributedTest
:geode-wan:flakyTest
:geode-wan:integrationTest
:geode-web:assemble
:geode-web:compileTestJavaNote: Some input files use or override a deprecated API.
Note: Recompile with -Xlint:deprecation for details.
Note: Some input files use unchecked or unsafe operations.
Note: Recompile with -Xlint:unchecked for details.

:geode-web:processTestResources UP-TO-DATE
:geode-web:testClasses
:geode-web:checkMissedTests
:geode-web:spotlessJavaCheck
:geode-web:spotlessCheck
:geode-web:test
:geode-web:check
:geode-web:build
:geode-web:distributedTest
:geode-web:flakyTest
:geode-web:integrationTest
:geode-web-api:assemble
:geode-web-api:compileTestJava
:geode-web-api:processTestResources UP-TO-DATE
:geode-web-api:testClasses
:geode-web-api:checkMissedTests
:geode-web-api:spotlessJavaCheck
:geode-web-api:spotlessCheck
:geode-web-api:test
:geode-web-api:check
:geode-web-api:build
:geode-web-api:distributedTest
:geode-web-api:flakyTest
:geode-web-api:integrationTest
:combineReports
All test reports at <https://builds.apache.org/job/Geode-nightly/ws/build/reports/combined>
:extensions/geode-modules:precheckin
:extensions/geode-modules-assembly:precheckin
:extensions/geode-modules-session:precheckin
:extensions/geode-modules-session-internal:precheckin
:extensions/geode-modules-tomcat7:precheckin
:extensions/geode-modules-tomcat8:precheckin
:geode-assembly:precheckin
:geode-benchmarks:precheckin
:geode-common:precheckin
:geode-cq:precheckin
:geode-json:precheckin
:geode-junit:precheckin
:geode-lucene:precheckin
:geode-old-client-support:precheckin
:geode-old-versions:precheckin
:geode-pulse:precheckin
:geode-rebalancer:precheckin
:geode-wan:precheckin
:geode-web:precheckin
:geode-web-api:precheckin
:compileJava UP-TO-DATE
:processResources UP-TO-DATE
:classes UP-TO-DATE
:jar
:uploadArchives
:extensions/geode-modules:uploadArchives
:extensions/geode-modules-assembly:uploadArchives SKIPPED
:extensions/geode-modules-session:uploadArchives
:extensions/geode-modules-session-internal:uploadArchives
:extensions/geode-modules-tomcat7:uploadArchives
:extensions/geode-modules-tomcat8:uploadArchives
:geode-assembly:uploadArchives SKIPPED
:geode-benchmarks:uploadArchives SKIPPED
:geode-common:uploadArchives
:geode-core:uploadArchives
:geode-cq:uploadArchives
:geode-json:uploadArchives
:geode-junit:uploadArchives
:geode-lucene:uploadArchives
:geode-old-client-support:uploadArchives
:geode-old-versions:uploadArchives SKIPPED
:geode-pulse:uploadArchives
:geode-rebalancer:uploadArchives
:geode-wan:uploadArchives
:geode-web:uploadArchives
:geode-web-api:uploadArchives

FAILURE: Build failed with an exception.

* What went wrong:
Execution failed for task ':geode-core:distributedTest'.
> There were failing tests. See the report at: file://<https://builds.apache.org/job/Geode-nightly/ws/geode-core/build/reports/distributedTest/index.html>

* Try:
Run with --stacktrace option to get the stack trace. Run with --info or --debug option to get more log output.

BUILD FAILED

Total time: 13 hrs 20 mins 38.878 secs
Build step 'Invoke Gradle script' changed build result to FAILURE
Build step 'Invoke Gradle script' marked build as failure
Archiving artifacts
Compressed 325.53 MB of artifacts by 19.7% relative to #746
Recording test results

Re: Build failed in Jenkins: Geode-nightly #751

Posted by Dan Smith <ds...@pivotal.io>.
This AnalyzeSerializablesJUnitTest failure is my fault. It's fixed now.

-Dan

On Fri, Feb 17, 2017 at 8:55 AM, Apache Jenkins Server <
jenkins@builds.apache.org> wrote:

> See <https://builds.apache.org/job/Geode-nightly/751/changes>
>
> Changes:
>
> [lhughesgodfrey] Added keys for Lynn Hughes-Godfrey
>
> [gzhou] GEODE-1956: fix the race condition that cause the vm only hosts 1
>
> [abaker] Revert "GEODE-1956: fix the race condition that cause the vm only
> hosts
>
> [hkhamesra] Removed "-SNAPSHOT" from gradle.properties
>
> [bschuchardt] GEODE-2368 Need to fix log message in DirectChannel
>
> [bschuchardt] GEODE-1965 Create backward-compatibility unit test framework
>
> [upthewaterspout] GEODE-2386: Wait until classpath doesn't contain
> gradle-worker.jar
>
> [upthewaterspout] GEODE-2386 Don't call System.setProperties(null) when
> rule is used twice
>
> [hkhamesra] Updated KEYS file.
>
> [bschuchardt] GEODE-2433  Backwards compatibility tests are not actually
> running
>
> [bschuchardt] GEODE-2433 Backwards compatibility tests are not actually
> running
>
> [upthewaterspout] GEODE-2432: Disable maven artifacts for geode-benchmarks
>
> [bschuchardt] GEODE-2433  Backwards compatibility tests are not actually
> running
>
> [upthewaterspout] GEODE-2434: Generate old version classpaths in doLast
>
> [jiliao] GEODE-2430: Refactor ZipUtils
>
> [jiliao] GEODE-2430: Remove jar and zip files from test resources
>
> [jiliao] GEODE-2430: Fix failing tests
>
> [dbarnes] GEODE-2052: Docs to segregate types of properties Added Server /
> Locator
>
> [klund] GEODE-2474: refactor code to use SystemUtils for OS system
> properties
>
> [klund] GEODE-2481: extract default properties generation to its own class
>
> [huynhja] GEODE-2491: Reduce logging of handled exceptions in
> LuceneEventListener
>
> [dbarnes] GEODE-2052 (docs) Add server-only flag to deploy-working-dir
> property
>
> [kmiller] Updated index.html.
>
> [kmiller] Add 1.1.0 manual and docs/index.html page to website content.
>
> [klund] GEODE-2496: apply Flaky category to flaky test due to
> ConnectExceptions
>
> [kmiller] GEODE-2498 Revise published 1.1.0 manual, so it has no
> references to
>
> [upthewaterspout] GEODE-2402: Write to the lucene region buckets using a
> callback argument
>
> [upthewaterspout] Reducing the time taken by a test that was waiting 60
> seconds
>
> [upthewaterspout] Make sure IndexRepositorySpy doesn't mock the same
> object twice
>
> ------------------------------------------
> [...truncated 546 lines...]
>     org/apache/geode/internal/cache/InitialImageOperation$
> GIITestHook,false,isRunning:boolean,region_name:java/lang/
> String,type:org/apache/geode/internal/cache/InitialImageOperation$
> GIITestHookType
>
>
>     If the class is not persisted or sent over the wire add it to the
> excludedClasses.txt file in the
>     /org/apache/geode/codeAnalysis/ directory.  Otherwise if this doesn't
>     break backward compatibility move the file actualSerializables.dat to
> the
>     codeAnalysis test directory and rename to sanctionedSerializables.txt
>         at org.junit.Assert.fail(Assert.java:88)
>         at org.apache.geode.codeAnalysis.AnalyzeSerializablesJUnitTest.
> testSerializables(AnalyzeSerializablesJUnitTest.java:234)
>
> 3363 tests completed, 1 failed, 165 skipped
> :geode-core:integrationTest FAILED
> :geode-cq:assemble
> :geode-cq:compileTestJavaNote: Some input files use or override a
> deprecated API.
> Note: Recompile with -Xlint:deprecation for details.
> Note: Some input files use unchecked or unsafe operations.
> Note: Recompile with -Xlint:unchecked for details.
>
> :geode-cq:processTestResources
> :geode-cq:testClasses
> :geode-cq:checkMissedTests
> :geode-cq:spotlessJavaCheck
> :geode-cq:spotlessCheck
> :geode-cq:test
> :geode-cq:check
> :geode-cq:build
> :geode-cq:distributedTest
> :geode-cq:flakyTest
> :geode-cq:integrationTest
> :geode-json:assemble
> :geode-json:compileTestJava UP-TO-DATE
> :geode-json:processTestResources UP-TO-DATE
> :geode-json:testClasses UP-TO-DATE
> :geode-json:checkMissedTests UP-TO-DATE
> :geode-json:spotlessJavaCheck
> :geode-json:spotlessCheck
> :geode-json:test UP-TO-DATE
> :geode-json:check
> :geode-json:build
> :geode-json:distributedTest UP-TO-DATE
> :geode-json:flakyTest UP-TO-DATE
> :geode-json:integrationTest UP-TO-DATE
> :geode-junit:javadoc
> :geode-junit:javadocJar
> :geode-junit:sourcesJar
> :geode-junit:signArchives SKIPPED
> :geode-junit:assemble
> :geode-junit:compileTestJava
> :geode-junit:processTestResources UP-TO-DATE
> :geode-junit:testClasses
> :geode-junit:checkMissedTests
> :geode-junit:spotlessJavaCheck
> :geode-junit:spotlessCheck
> :geode-junit:test
> :geode-junit:check
> :geode-junit:build
> :geode-junit:distributedTest
> :geode-junit:flakyTest
> :geode-junit:integrationTest
> :geode-lucene:assemble
> :geode-lucene:compileTestJavaNote: Some input files use or override a
> deprecated API.
> Note: Recompile with -Xlint:deprecation for details.
> Note: Some input files use unchecked or unsafe operations.
> Note: Recompile with -Xlint:unchecked for details.
>
> :geode-lucene:processTestResources
> :geode-lucene:testClasses
> :geode-lucene:checkMissedTests
> :geode-lucene:spotlessJavaCheck
> :geode-lucene:spotlessCheck
> :geode-lucene:test
> :geode-lucene:check
> :geode-lucene:build
> :geode-lucene:distributedTest
> :geode-lucene:flakyTest
> :geode-lucene:integrationTest
> :geode-old-client-support:assemble
> :geode-old-client-support:compileTestJava
> :geode-old-client-support:processTestResources UP-TO-DATE
> :geode-old-client-support:testClasses
> :geode-old-client-support:checkMissedTests
> :geode-old-client-support:spotlessJavaCheck
> :geode-old-client-support:spotlessCheck
> :geode-old-client-support:test
> :geode-old-client-support:check
> :geode-old-client-support:build
> :geode-old-client-support:distributedTest
> :geode-old-client-support:flakyTest
> :geode-old-client-support:integrationTest
> :geode-old-versions:javadoc UP-TO-DATE
> :geode-old-versions:javadocJar
> :geode-old-versions:sourcesJar
> :geode-old-versions:signArchives SKIPPED
> :geode-old-versions:assemble
> :geode-old-versions:compileTestJava UP-TO-DATE
> :geode-old-versions:processTestResources UP-TO-DATE
> :geode-old-versions:testClasses UP-TO-DATE
> :geode-old-versions:checkMissedTests UP-TO-DATE
> :geode-old-versions:spotlessJavaCheck
> :geode-old-versions:spotlessCheck
> :geode-old-versions:test UP-TO-DATE
> :geode-old-versions:check
> :geode-old-versions:build
> :geode-old-versions:distributedTest UP-TO-DATE
> :geode-old-versions:flakyTest UP-TO-DATE
> :geode-old-versions:integrationTest UP-TO-DATE
> :geode-pulse:assemble
> :geode-pulse:compileTestJavaNote: <https://builds.apache.org/
> job/Geode-nightly/ws/geode-pulse/src/test/java/org/
> apache/geode/tools/pulse/tests/ui/PulseBase.java> uses or overrides a
> deprecated API.
> Note: Recompile with -Xlint:deprecation for details.
> Note: <https://builds.apache.org/job/Geode-nightly/ws/geode-
> pulse/src/test/java/org/apache/geode/tools/pulse/controllers/
> PulseControllerJUnitTest.java> uses unchecked or unsafe operations.
> Note: Recompile with -Xlint:unchecked for details.
>
> :geode-pulse:processTestResources
> :geode-pulse:testClasses
> :geode-pulse:checkMissedTests
> :geode-pulse:spotlessJavaCheck
> :geode-pulse:spotlessCheck
> :geode-pulse:test
> :geode-pulse:check
> :geode-pulse:build
> :geode-pulse:distributedTest
> :geode-pulse:flakyTest
> :geode-pulse:integrationTest
> :geode-rebalancer:assemble
> :geode-rebalancer:compileTestJava
> :geode-rebalancer:processTestResources UP-TO-DATE
> :geode-rebalancer:testClasses
> :geode-rebalancer:checkMissedTests
> :geode-rebalancer:spotlessJavaCheck
> :geode-rebalancer:spotlessCheck
> :geode-rebalancer:test
> :geode-rebalancer:check
> :geode-rebalancer:build
> :geode-rebalancer:distributedTest
> :geode-rebalancer:flakyTest
> :geode-rebalancer:integrationTest
> :geode-wan:assemble
> :geode-wan:compileTestJavaNote: Some input files use or override a
> deprecated API.
> Note: Recompile with -Xlint:deprecation for details.
> Note: Some input files use unchecked or unsafe operations.
> Note: Recompile with -Xlint:unchecked for details.
>
> :geode-wan:processTestResources
> :geode-wan:testClasses
> :geode-wan:checkMissedTests
> :geode-wan:spotlessJavaCheck
> :geode-wan:spotlessCheck
> :geode-wan:test
> :geode-wan:check
> :geode-wan:build
> :geode-wan:distributedTest
> :geode-wan:flakyTest
> :geode-wan:integrationTest
> :geode-web:assemble
> :geode-web:compileTestJavaNote: Some input files use or override a
> deprecated API.
> Note: Recompile with -Xlint:deprecation for details.
> Note: Some input files use unchecked or unsafe operations.
> Note: Recompile with -Xlint:unchecked for details.
>
> :geode-web:processTestResources UP-TO-DATE
> :geode-web:testClasses
> :geode-web:checkMissedTests
> :geode-web:spotlessJavaCheck
> :geode-web:spotlessCheck
> :geode-web:test
> :geode-web:check
> :geode-web:build
> :geode-web:distributedTest
> :geode-web:flakyTest
> :geode-web:integrationTest
> :geode-web-api:assemble
> :geode-web-api:compileTestJava
> :geode-web-api:processTestResources UP-TO-DATE
> :geode-web-api:testClasses
> :geode-web-api:checkMissedTests
> :geode-web-api:spotlessJavaCheck
> :geode-web-api:spotlessCheck
> :geode-web-api:test
> :geode-web-api:check
> :geode-web-api:build
> :geode-web-api:distributedTest
> :geode-web-api:flakyTest
> :geode-web-api:integrationTest
> :combineReports
> All test reports at <https://builds.apache.org/job/Geode-nightly/ws/build/
> reports/combined>
> :extensions/geode-modules:precheckin
> :extensions/geode-modules-assembly:precheckin
> :extensions/geode-modules-session:precheckin
> :extensions/geode-modules-session-internal:precheckin
> :extensions/geode-modules-tomcat7:precheckin
> :extensions/geode-modules-tomcat8:precheckin
> :geode-assembly:precheckin
> :geode-benchmarks:precheckin
> :geode-common:precheckin
> :geode-cq:precheckin
> :geode-json:precheckin
> :geode-junit:precheckin
> :geode-lucene:precheckin
> :geode-old-client-support:precheckin
> :geode-old-versions:precheckin
> :geode-pulse:precheckin
> :geode-rebalancer:precheckin
> :geode-wan:precheckin
> :geode-web:precheckin
> :geode-web-api:precheckin
> :compileJava UP-TO-DATE
> :processResources UP-TO-DATE
> :classes UP-TO-DATE
> :jar
> :uploadArchives
> :extensions/geode-modules:uploadArchives
> :extensions/geode-modules-assembly:uploadArchives SKIPPED
> :extensions/geode-modules-session:uploadArchives
> :extensions/geode-modules-session-internal:uploadArchives
> :extensions/geode-modules-tomcat7:uploadArchives
> :extensions/geode-modules-tomcat8:uploadArchives
> :geode-assembly:uploadArchives SKIPPED
> :geode-benchmarks:uploadArchives SKIPPED
> :geode-common:uploadArchives
> :geode-core:uploadArchives
> :geode-cq:uploadArchives
> :geode-json:uploadArchives
> :geode-junit:uploadArchives
> :geode-lucene:uploadArchives
> :geode-old-client-support:uploadArchives
> :geode-old-versions:uploadArchives SKIPPED
> :geode-pulse:uploadArchives
> :geode-rebalancer:uploadArchives
> :geode-wan:uploadArchives
> :geode-web:uploadArchives
> :geode-web-api:uploadArchives
>
> FAILURE: Build failed with an exception.
>
> * What went wrong:
> Execution failed for task ':geode-core:integrationTest'.
> > There were failing tests. See the report at: file://<
> https://builds.apache.org/job/Geode-nightly/ws/geode-core/build/reports/
> integrationTest/index.html>
>
> * Try:
> Run with --stacktrace option to get the stack trace. Run with --info or
> --debug option to get more log output.
>
> BUILD FAILED
>
> Total time: 13 hrs 9 mins 55.571 secs
> Build step 'Invoke Gradle script' changed build result to FAILURE
> Build step 'Invoke Gradle script' marked build as failure
> Archiving artifacts
> Compressed 390.49 MB of artifacts by 26.3% relative to #746
> Recording test results
>

Build failed in Jenkins: Geode-nightly #751

Posted by Apache Jenkins Server <je...@builds.apache.org>.
See <https://builds.apache.org/job/Geode-nightly/751/changes>

Changes:

[lhughesgodfrey] Added keys for Lynn Hughes-Godfrey

[gzhou] GEODE-1956: fix the race condition that cause the vm only hosts 1

[abaker] Revert "GEODE-1956: fix the race condition that cause the vm only hosts

[hkhamesra] Removed "-SNAPSHOT" from gradle.properties

[bschuchardt] GEODE-2368 Need to fix log message in DirectChannel

[bschuchardt] GEODE-1965 Create backward-compatibility unit test framework

[upthewaterspout] GEODE-2386: Wait until classpath doesn't contain gradle-worker.jar

[upthewaterspout] GEODE-2386 Don't call System.setProperties(null) when rule is used twice

[hkhamesra] Updated KEYS file.

[bschuchardt] GEODE-2433  Backwards compatibility tests are not actually running

[bschuchardt] GEODE-2433 Backwards compatibility tests are not actually running

[upthewaterspout] GEODE-2432: Disable maven artifacts for geode-benchmarks

[bschuchardt] GEODE-2433  Backwards compatibility tests are not actually running

[upthewaterspout] GEODE-2434: Generate old version classpaths in doLast

[jiliao] GEODE-2430: Refactor ZipUtils

[jiliao] GEODE-2430: Remove jar and zip files from test resources

[jiliao] GEODE-2430: Fix failing tests

[dbarnes] GEODE-2052: Docs to segregate types of properties Added Server / Locator

[klund] GEODE-2474: refactor code to use SystemUtils for OS system properties

[klund] GEODE-2481: extract default properties generation to its own class

[huynhja] GEODE-2491: Reduce logging of handled exceptions in LuceneEventListener

[dbarnes] GEODE-2052 (docs) Add server-only flag to deploy-working-dir property

[kmiller] Updated index.html.

[kmiller] Add 1.1.0 manual and docs/index.html page to website content.

[klund] GEODE-2496: apply Flaky category to flaky test due to ConnectExceptions

[kmiller] GEODE-2498 Revise published 1.1.0 manual, so it has no references to

[upthewaterspout] GEODE-2402: Write to the lucene region buckets using a callback argument

[upthewaterspout] Reducing the time taken by a test that was waiting 60 seconds

[upthewaterspout] Make sure IndexRepositorySpy doesn't mock the same object twice

------------------------------------------
[...truncated 546 lines...]
    org/apache/geode/internal/cache/InitialImageOperation$GIITestHook,false,isRunning:boolean,region_name:java/lang/String,type:org/apache/geode/internal/cache/InitialImageOperation$GIITestHookType


    If the class is not persisted or sent over the wire add it to the excludedClasses.txt file in the 
    /org/apache/geode/codeAnalysis/ directory.  Otherwise if this doesn't 
    break backward compatibility move the file actualSerializables.dat to the 
    codeAnalysis test directory and rename to sanctionedSerializables.txt
        at org.junit.Assert.fail(Assert.java:88)
        at org.apache.geode.codeAnalysis.AnalyzeSerializablesJUnitTest.testSerializables(AnalyzeSerializablesJUnitTest.java:234)

3363 tests completed, 1 failed, 165 skipped
:geode-core:integrationTest FAILED
:geode-cq:assemble
:geode-cq:compileTestJavaNote: Some input files use or override a deprecated API.
Note: Recompile with -Xlint:deprecation for details.
Note: Some input files use unchecked or unsafe operations.
Note: Recompile with -Xlint:unchecked for details.

:geode-cq:processTestResources
:geode-cq:testClasses
:geode-cq:checkMissedTests
:geode-cq:spotlessJavaCheck
:geode-cq:spotlessCheck
:geode-cq:test
:geode-cq:check
:geode-cq:build
:geode-cq:distributedTest
:geode-cq:flakyTest
:geode-cq:integrationTest
:geode-json:assemble
:geode-json:compileTestJava UP-TO-DATE
:geode-json:processTestResources UP-TO-DATE
:geode-json:testClasses UP-TO-DATE
:geode-json:checkMissedTests UP-TO-DATE
:geode-json:spotlessJavaCheck
:geode-json:spotlessCheck
:geode-json:test UP-TO-DATE
:geode-json:check
:geode-json:build
:geode-json:distributedTest UP-TO-DATE
:geode-json:flakyTest UP-TO-DATE
:geode-json:integrationTest UP-TO-DATE
:geode-junit:javadoc
:geode-junit:javadocJar
:geode-junit:sourcesJar
:geode-junit:signArchives SKIPPED
:geode-junit:assemble
:geode-junit:compileTestJava
:geode-junit:processTestResources UP-TO-DATE
:geode-junit:testClasses
:geode-junit:checkMissedTests
:geode-junit:spotlessJavaCheck
:geode-junit:spotlessCheck
:geode-junit:test
:geode-junit:check
:geode-junit:build
:geode-junit:distributedTest
:geode-junit:flakyTest
:geode-junit:integrationTest
:geode-lucene:assemble
:geode-lucene:compileTestJavaNote: Some input files use or override a deprecated API.
Note: Recompile with -Xlint:deprecation for details.
Note: Some input files use unchecked or unsafe operations.
Note: Recompile with -Xlint:unchecked for details.

:geode-lucene:processTestResources
:geode-lucene:testClasses
:geode-lucene:checkMissedTests
:geode-lucene:spotlessJavaCheck
:geode-lucene:spotlessCheck
:geode-lucene:test
:geode-lucene:check
:geode-lucene:build
:geode-lucene:distributedTest
:geode-lucene:flakyTest
:geode-lucene:integrationTest
:geode-old-client-support:assemble
:geode-old-client-support:compileTestJava
:geode-old-client-support:processTestResources UP-TO-DATE
:geode-old-client-support:testClasses
:geode-old-client-support:checkMissedTests
:geode-old-client-support:spotlessJavaCheck
:geode-old-client-support:spotlessCheck
:geode-old-client-support:test
:geode-old-client-support:check
:geode-old-client-support:build
:geode-old-client-support:distributedTest
:geode-old-client-support:flakyTest
:geode-old-client-support:integrationTest
:geode-old-versions:javadoc UP-TO-DATE
:geode-old-versions:javadocJar
:geode-old-versions:sourcesJar
:geode-old-versions:signArchives SKIPPED
:geode-old-versions:assemble
:geode-old-versions:compileTestJava UP-TO-DATE
:geode-old-versions:processTestResources UP-TO-DATE
:geode-old-versions:testClasses UP-TO-DATE
:geode-old-versions:checkMissedTests UP-TO-DATE
:geode-old-versions:spotlessJavaCheck
:geode-old-versions:spotlessCheck
:geode-old-versions:test UP-TO-DATE
:geode-old-versions:check
:geode-old-versions:build
:geode-old-versions:distributedTest UP-TO-DATE
:geode-old-versions:flakyTest UP-TO-DATE
:geode-old-versions:integrationTest UP-TO-DATE
:geode-pulse:assemble
:geode-pulse:compileTestJavaNote: <https://builds.apache.org/job/Geode-nightly/ws/geode-pulse/src/test/java/org/apache/geode/tools/pulse/tests/ui/PulseBase.java> uses or overrides a deprecated API.
Note: Recompile with -Xlint:deprecation for details.
Note: <https://builds.apache.org/job/Geode-nightly/ws/geode-pulse/src/test/java/org/apache/geode/tools/pulse/controllers/PulseControllerJUnitTest.java> uses unchecked or unsafe operations.
Note: Recompile with -Xlint:unchecked for details.

:geode-pulse:processTestResources
:geode-pulse:testClasses
:geode-pulse:checkMissedTests
:geode-pulse:spotlessJavaCheck
:geode-pulse:spotlessCheck
:geode-pulse:test
:geode-pulse:check
:geode-pulse:build
:geode-pulse:distributedTest
:geode-pulse:flakyTest
:geode-pulse:integrationTest
:geode-rebalancer:assemble
:geode-rebalancer:compileTestJava
:geode-rebalancer:processTestResources UP-TO-DATE
:geode-rebalancer:testClasses
:geode-rebalancer:checkMissedTests
:geode-rebalancer:spotlessJavaCheck
:geode-rebalancer:spotlessCheck
:geode-rebalancer:test
:geode-rebalancer:check
:geode-rebalancer:build
:geode-rebalancer:distributedTest
:geode-rebalancer:flakyTest
:geode-rebalancer:integrationTest
:geode-wan:assemble
:geode-wan:compileTestJavaNote: Some input files use or override a deprecated API.
Note: Recompile with -Xlint:deprecation for details.
Note: Some input files use unchecked or unsafe operations.
Note: Recompile with -Xlint:unchecked for details.

:geode-wan:processTestResources
:geode-wan:testClasses
:geode-wan:checkMissedTests
:geode-wan:spotlessJavaCheck
:geode-wan:spotlessCheck
:geode-wan:test
:geode-wan:check
:geode-wan:build
:geode-wan:distributedTest
:geode-wan:flakyTest
:geode-wan:integrationTest
:geode-web:assemble
:geode-web:compileTestJavaNote: Some input files use or override a deprecated API.
Note: Recompile with -Xlint:deprecation for details.
Note: Some input files use unchecked or unsafe operations.
Note: Recompile with -Xlint:unchecked for details.

:geode-web:processTestResources UP-TO-DATE
:geode-web:testClasses
:geode-web:checkMissedTests
:geode-web:spotlessJavaCheck
:geode-web:spotlessCheck
:geode-web:test
:geode-web:check
:geode-web:build
:geode-web:distributedTest
:geode-web:flakyTest
:geode-web:integrationTest
:geode-web-api:assemble
:geode-web-api:compileTestJava
:geode-web-api:processTestResources UP-TO-DATE
:geode-web-api:testClasses
:geode-web-api:checkMissedTests
:geode-web-api:spotlessJavaCheck
:geode-web-api:spotlessCheck
:geode-web-api:test
:geode-web-api:check
:geode-web-api:build
:geode-web-api:distributedTest
:geode-web-api:flakyTest
:geode-web-api:integrationTest
:combineReports
All test reports at <https://builds.apache.org/job/Geode-nightly/ws/build/reports/combined>
:extensions/geode-modules:precheckin
:extensions/geode-modules-assembly:precheckin
:extensions/geode-modules-session:precheckin
:extensions/geode-modules-session-internal:precheckin
:extensions/geode-modules-tomcat7:precheckin
:extensions/geode-modules-tomcat8:precheckin
:geode-assembly:precheckin
:geode-benchmarks:precheckin
:geode-common:precheckin
:geode-cq:precheckin
:geode-json:precheckin
:geode-junit:precheckin
:geode-lucene:precheckin
:geode-old-client-support:precheckin
:geode-old-versions:precheckin
:geode-pulse:precheckin
:geode-rebalancer:precheckin
:geode-wan:precheckin
:geode-web:precheckin
:geode-web-api:precheckin
:compileJava UP-TO-DATE
:processResources UP-TO-DATE
:classes UP-TO-DATE
:jar
:uploadArchives
:extensions/geode-modules:uploadArchives
:extensions/geode-modules-assembly:uploadArchives SKIPPED
:extensions/geode-modules-session:uploadArchives
:extensions/geode-modules-session-internal:uploadArchives
:extensions/geode-modules-tomcat7:uploadArchives
:extensions/geode-modules-tomcat8:uploadArchives
:geode-assembly:uploadArchives SKIPPED
:geode-benchmarks:uploadArchives SKIPPED
:geode-common:uploadArchives
:geode-core:uploadArchives
:geode-cq:uploadArchives
:geode-json:uploadArchives
:geode-junit:uploadArchives
:geode-lucene:uploadArchives
:geode-old-client-support:uploadArchives
:geode-old-versions:uploadArchives SKIPPED
:geode-pulse:uploadArchives
:geode-rebalancer:uploadArchives
:geode-wan:uploadArchives
:geode-web:uploadArchives
:geode-web-api:uploadArchives

FAILURE: Build failed with an exception.

* What went wrong:
Execution failed for task ':geode-core:integrationTest'.
> There were failing tests. See the report at: file://<https://builds.apache.org/job/Geode-nightly/ws/geode-core/build/reports/integrationTest/index.html>

* Try:
Run with --stacktrace option to get the stack trace. Run with --info or --debug option to get more log output.

BUILD FAILED

Total time: 13 hrs 9 mins 55.571 secs
Build step 'Invoke Gradle script' changed build result to FAILURE
Build step 'Invoke Gradle script' marked build as failure
Archiving artifacts
Compressed 390.49 MB of artifacts by 26.3% relative to #746
Recording test results

Build failed in Jenkins: Geode-nightly #750

Posted by Apache Jenkins Server <je...@builds.apache.org>.
See <https://builds.apache.org/job/Geode-nightly/750/changes>

Changes:

[abaker] Update dockerfile for 1.1.0

[kmiller] Update Geode web page's index.html file to include 1.1.0 binaries and

------------------------------------------
[...truncated 710 lines...]
:geode-json:checkMissedTests UP-TO-DATE
:geode-json:spotlessJavaCheck
:geode-json:spotlessCheck
:geode-json:test UP-TO-DATE
:geode-json:check
:geode-json:build
:geode-json:distributedTest UP-TO-DATE
:geode-json:flakyTest UP-TO-DATE
:geode-json:integrationTest UP-TO-DATE
:geode-junit:javadoc
:geode-junit:javadocJar
:geode-junit:sourcesJar
:geode-junit:signArchives SKIPPED
:geode-junit:assemble
:geode-junit:compileTestJava
:geode-junit:processTestResources UP-TO-DATE
:geode-junit:testClasses
:geode-junit:checkMissedTests
:geode-junit:spotlessJavaCheck
:geode-junit:spotlessCheck
:geode-junit:test
:geode-junit:check
:geode-junit:build
:geode-junit:distributedTest
:geode-junit:flakyTest
:geode-junit:integrationTest
:geode-lucene:assemble
:geode-lucene:compileTestJava
Download https://repo1.maven.org/maven2/org/apache/lucene/lucene-test-framework/6.4.1/lucene-test-framework-6.4.1.pom
Download https://repo1.maven.org/maven2/org/apache/lucene/lucene-codecs/6.4.1/lucene-codecs-6.4.1.pom
Download https://repo1.maven.org/maven2/com/carrotsearch/randomizedtesting/randomizedtesting-runner/2.4.0/randomizedtesting-runner-2.4.0.pom
Download https://repo1.maven.org/maven2/com/carrotsearch/randomizedtesting/randomizedtesting-parent/2.4.0/randomizedtesting-parent-2.4.0.pom
Download https://repo1.maven.org/maven2/org/apache/lucene/lucene-test-framework/6.4.1/lucene-test-framework-6.4.1.jar
Download https://repo1.maven.org/maven2/org/apache/lucene/lucene-codecs/6.4.1/lucene-codecs-6.4.1.jar
Download https://repo1.maven.org/maven2/com/carrotsearch/randomizedtesting/randomizedtesting-runner/2.4.0/randomizedtesting-runner-2.4.0.jar
Note: Some input files use or override a deprecated API.
Note: Recompile with -Xlint:deprecation for details.
Note: Some input files use unchecked or unsafe operations.
Note: Recompile with -Xlint:unchecked for details.
:geode-lucene:processTestResources
:geode-lucene:testClasses
:geode-lucene:checkMissedTests
:geode-lucene:spotlessJavaCheck
:geode-lucene:spotlessCheck
:geode-lucene:test
:geode-lucene:check
:geode-lucene:build
:geode-lucene:distributedTest
:geode-lucene:flakyTest
:geode-lucene:integrationTest
:geode-old-client-support:assemble
:geode-old-client-support:compileTestJava
:geode-old-client-support:processTestResources UP-TO-DATE
:geode-old-client-support:testClasses
:geode-old-client-support:checkMissedTests
:geode-old-client-support:spotlessJavaCheck
:geode-old-client-support:spotlessCheck
:geode-old-client-support:test
:geode-old-client-support:check
:geode-old-client-support:build
:geode-old-client-support:distributedTest
:geode-old-client-support:flakyTest
:geode-old-client-support:integrationTest
:geode-old-versions:javadoc UP-TO-DATE
:geode-old-versions:javadocJar
:geode-old-versions:sourcesJar
:geode-old-versions:signArchives SKIPPED
:geode-old-versions:assemble
:geode-old-versions:compileTestJava UP-TO-DATE
:geode-old-versions:processTestResources UP-TO-DATE
:geode-old-versions:testClasses UP-TO-DATE
:geode-old-versions:checkMissedTests UP-TO-DATE
:geode-old-versions:spotlessJavaCheck
:geode-old-versions:spotlessCheck
:geode-old-versions:test UP-TO-DATE
:geode-old-versions:check
:geode-old-versions:build
:geode-old-versions:distributedTest UP-TO-DATE
:geode-old-versions:flakyTest UP-TO-DATE
:geode-old-versions:integrationTest UP-TO-DATE
:geode-pulse:assemble
:geode-pulse:compileTestJava
Download https://repo1.maven.org/maven2/com/codeborne/phantomjsdriver/1.3.0/phantomjsdriver-1.3.0.pom
Download https://repo1.maven.org/maven2/org/seleniumhq/selenium/selenium-api/3.0.1/selenium-api-3.0.1.pom
Download https://repo1.maven.org/maven2/org/seleniumhq/selenium/selenium-remote-driver/3.0.1/selenium-remote-driver-3.0.1.pom
Download https://repo1.maven.org/maven2/org/seleniumhq/selenium/selenium-support/3.0.1/selenium-support-3.0.1.pom
Download https://repo1.maven.org/maven2/cglib/cglib-nodep/3.2.4/cglib-nodep-3.2.4.pom
Download https://repo1.maven.org/maven2/com/codeborne/phantomjsdriver/1.3.0/phantomjsdriver-1.3.0.jar
Download https://repo1.maven.org/maven2/org/seleniumhq/selenium/selenium-api/3.0.1/selenium-api-3.0.1.jar
Download https://repo1.maven.org/maven2/org/seleniumhq/selenium/selenium-remote-driver/3.0.1/selenium-remote-driver-3.0.1.jar
Download https://repo1.maven.org/maven2/org/seleniumhq/selenium/selenium-support/3.0.1/selenium-support-3.0.1.jar
Download https://repo1.maven.org/maven2/cglib/cglib-nodep/3.2.4/cglib-nodep-3.2.4.jar
Note: <https://builds.apache.org/job/Geode-nightly/ws/geode-pulse/src/test/java/org/apache/geode/tools/pulse/tests/ui/PulseBase.java> uses or overrides a deprecated API.
Note: Recompile with -Xlint:deprecation for details.
Note: <https://builds.apache.org/job/Geode-nightly/ws/geode-pulse/src/test/java/org/apache/geode/tools/pulse/controllers/PulseControllerJUnitTest.java> uses unchecked or unsafe operations.
Note: Recompile with -Xlint:unchecked for details.
:geode-pulse:processTestResources
:geode-pulse:testClasses
:geode-pulse:checkMissedTests
Download https://repo1.maven.org/maven2/com/google/code/gson/gson/2.8.0/gson-2.8.0.pom
Download https://repo1.maven.org/maven2/com/google/code/gson/gson-parent/2.8.0/gson-parent-2.8.0.pom
Download https://repo1.maven.org/maven2/com/google/code/gson/gson/2.8.0/gson-2.8.0.jar
:geode-pulse:spotlessJavaCheck
:geode-pulse:spotlessCheck
:geode-pulse:test
:geode-pulse:check
:geode-pulse:build
:geode-pulse:distributedTest
:geode-pulse:flakyTest
:geode-pulse:integrationTest
:geode-rebalancer:assemble
:geode-rebalancer:compileTestJava
:geode-rebalancer:processTestResources UP-TO-DATE
:geode-rebalancer:testClasses
:geode-rebalancer:checkMissedTests
:geode-rebalancer:spotlessJavaCheck
:geode-rebalancer:spotlessCheck
:geode-rebalancer:test
:geode-rebalancer:check
:geode-rebalancer:build
:geode-rebalancer:distributedTest
:geode-rebalancer:flakyTest
:geode-rebalancer:integrationTest
:geode-wan:assemble
:geode-wan:compileTestJavaNote: Some input files use or override a deprecated API.
Note: Recompile with -Xlint:deprecation for details.
Note: Some input files use unchecked or unsafe operations.
Note: Recompile with -Xlint:unchecked for details.

:geode-wan:processTestResources
:geode-wan:testClasses
:geode-wan:checkMissedTests
:geode-wan:spotlessJavaCheck
:geode-wan:spotlessCheck
:geode-wan:test
:geode-wan:check
:geode-wan:build
:geode-wan:distributedTest
:geode-wan:flakyTest
:geode-wan:integrationTest
:geode-web:assemble
:geode-web:compileTestJavaNote: Some input files use or override a deprecated API.
Note: Recompile with -Xlint:deprecation for details.
Note: Some input files use unchecked or unsafe operations.
Note: Recompile with -Xlint:unchecked for details.

:geode-web:processTestResources UP-TO-DATE
:geode-web:testClasses
:geode-web:checkMissedTests
:geode-web:spotlessJavaCheck
:geode-web:spotlessCheck
:geode-web:test
:geode-web:check
:geode-web:build
:geode-web:distributedTest
:geode-web:flakyTest
:geode-web:integrationTest
:geode-web-api:assemble
:geode-web-api:compileTestJava
:geode-web-api:processTestResources UP-TO-DATE
:geode-web-api:testClasses
:geode-web-api:checkMissedTests
:geode-web-api:spotlessJavaCheck
:geode-web-api:spotlessCheck
:geode-web-api:test
:geode-web-api:check
:geode-web-api:build
:geode-web-api:distributedTest
:geode-web-api:flakyTest
:geode-web-api:integrationTest
:combineReports
All test reports at <https://builds.apache.org/job/Geode-nightly/ws/build/reports/combined>
:extensions/geode-modules:precheckin
:extensions/geode-modules-assembly:precheckin
:extensions/geode-modules-session:precheckin
:extensions/geode-modules-session-internal:precheckin
:extensions/geode-modules-tomcat7:precheckin
:extensions/geode-modules-tomcat8:precheckin
:geode-assembly:precheckin
:geode-benchmarks:precheckin
:geode-common:precheckin
:geode-cq:precheckin
:geode-json:precheckin
:geode-junit:precheckin
:geode-lucene:precheckin
:geode-old-client-support:precheckin
:geode-old-versions:precheckin
:geode-pulse:precheckin
:geode-rebalancer:precheckin
:geode-wan:precheckin
:geode-web:precheckin
:geode-web-api:precheckin
:compileJava UP-TO-DATE
:processResources UP-TO-DATE
:classes UP-TO-DATE
:jar
:uploadArchives
:extensions/geode-modules:uploadArchives
:extensions/geode-modules-assembly:uploadArchives SKIPPED
:extensions/geode-modules-session:uploadArchives
:extensions/geode-modules-session-internal:uploadArchives
:extensions/geode-modules-tomcat7:uploadArchives
:extensions/geode-modules-tomcat8:uploadArchives
:geode-assembly:uploadArchives SKIPPED
:geode-benchmarks:uploadArchives SKIPPED
:geode-common:uploadArchives
:geode-core:uploadArchives
:geode-cq:uploadArchives
:geode-json:uploadArchives
:geode-junit:uploadArchives
:geode-lucene:uploadArchives
:geode-old-client-support:uploadArchives
:geode-old-versions:uploadArchives SKIPPED
:geode-pulse:uploadArchives
:geode-rebalancer:uploadArchives
:geode-wan:uploadArchives
:geode-web:uploadArchives
:geode-web-api:uploadArchives

FAILURE: Build completed with 2 failures.

1: Task failed with an exception.
-----------
* What went wrong:
Execution failed for task ':geode-core:distributedTest'.
> There were failing tests. See the report at: file://<https://builds.apache.org/job/Geode-nightly/ws/geode-core/build/reports/distributedTest/index.html>

* Try:
Run with --stacktrace option to get the stack trace. Run with --info or --debug option to get more log output.
==============================================================================

2: Task failed with an exception.
-----------
* What went wrong:
Execution failed for task ':geode-core:flakyTest'.
> There were failing tests. See the report at: file://<https://builds.apache.org/job/Geode-nightly/ws/geode-core/build/reports/flakyTest/index.html>

* Try:
Run with --stacktrace option to get the stack trace. Run with --info or --debug option to get more log output.
==============================================================================

BUILD FAILED

Total time: 13 hrs 51 mins 11.746 secs
Build step 'Invoke Gradle script' changed build result to FAILURE
Build step 'Invoke Gradle script' marked build as failure
Archiving artifacts
Compressed 357.99 MB of artifacts by 18.7% relative to #746
Recording test results

Re: Build failed in Jenkins: Geode-nightly #749

Posted by Galen M O'Sullivan <go...@pivotal.io>.
Hi Mark,

I'm trying to view the Geode build report at this link:
> There were failing tests. See the report at: file://<
https://builds.apache.org/job/Geode-nightly/ws/geode-core/build/reports/
distributedTest/index.html>

I don't see the geode-core/build/reports directory here:
https://builds.apache.org/job/Geode-nightly/749/artifact/

Thanks,
Galen

On Wed, Feb 15, 2017 at 10:54 AM, Mark Bretl <mb...@apache.org> wrote:

> Hi Galen,
>
> I am able to the console log [1], test report summary [2], and artifacts
> [3] without logging in. Which 'build report' are you trying to view?
>
> --Mark
>
> [1] https://builds.apache.org/job/Geode-nightly/749/console
> [2] https://builds.apache.org/job/Geode-nightly/749/testReport/
> [3] https://builds.apache.org/job/Geode-nightly/749/artifact/
>
> On Wed, Feb 15, 2017 at 9:04 AM, Galen M O'Sullivan <gosullivan@pivotal.io
> >
> wrote:
>
> > I don't seem to have access to see the build report. Is that restricted
> to
> > committers only?
> >
> > Thanks,
> > Galen
> >
> > On Wed, Feb 15, 2017 at 8:08 AM, Apache Jenkins Server <
> > jenkins@builds.apache.org> wrote:
> >
> > > See <https://builds.apache.org/job/Geode-nightly/749/changes>
> > >
> > > Changes:
> > >
> > > [kmiller] GEODE-2479 Remove docs reference to gemstone.com package
> > >
> > > [jiliao] GEODE-2474: mark NetstatDUnitTest as flaky
> > >
> > > [jiliao] refactor ServerStarterRule and LocatorStarterRule so that they
> > > can be
> > >
> > > [gzhou] GEODE-2471: fix the race condition in test code.
> > >
> > > ------------------------------------------
> > > [...truncated 713 lines...]
> > > :geode-cq:build
> > > :geode-cq:distributedTest
> > > :geode-cq:flakyTest
> > > :geode-cq:integrationTest
> > > :geode-json:assemble
> > > :geode-json:compileTestJava UP-TO-DATE
> > > :geode-json:processTestResources UP-TO-DATE
> > > :geode-json:testClasses UP-TO-DATE
> > > :geode-json:checkMissedTests UP-TO-DATE
> > > :geode-json:spotlessJavaCheck
> > > :geode-json:spotlessCheck
> > > :geode-json:test UP-TO-DATE
> > > :geode-json:check
> > > :geode-json:build
> > > :geode-json:distributedTest UP-TO-DATE
> > > :geode-json:flakyTest UP-TO-DATE
> > > :geode-json:integrationTest UP-TO-DATE
> > > :geode-junit:javadoc
> > > :geode-junit:javadocJar
> > > :geode-junit:sourcesJar
> > > :geode-junit:signArchives SKIPPED
> > > :geode-junit:assemble
> > > :geode-junit:compileTestJava
> > > :geode-junit:processTestResources UP-TO-DATE
> > > :geode-junit:testClasses
> > > :geode-junit:checkMissedTests
> > > :geode-junit:spotlessJavaCheck
> > > :geode-junit:spotlessCheck
> > > :geode-junit:test
> > > :geode-junit:check
> > > :geode-junit:build
> > > :geode-junit:distributedTest
> > > :geode-junit:flakyTest
> > > :geode-junit:integrationTest
> > > :geode-lucene:assemble
> > > :geode-lucene:compileTestJava
> > > Download https://repo1.maven.org/maven2/org/apache/lucene/
> > > lucene-test-framework/6.4.1/lucene-test-framework-6.4.1.pom
> > > Download https://repo1.maven.org/maven2/org/apache/lucene/
> > > lucene-codecs/6.4.1/lucene-codecs-6.4.1.pom
> > > Download https://repo1.maven.org/maven2/com/carrotsearch/
> > > randomizedtesting/randomizedtesting-runner/2.4.
> > > 0/randomizedtesting-runner-2.4.0.pom
> > > Download https://repo1.maven.org/maven2/com/carrotsearch/
> > > randomizedtesting/randomizedtesting-parent/2.4.
> > > 0/randomizedtesting-parent-2.4.0.pom
> > > Download https://repo1.maven.org/maven2/org/apache/lucene/
> > > lucene-test-framework/6.4.1/lucene-test-framework-6.4.1.jar
> > > Download https://repo1.maven.org/maven2/org/apache/lucene/
> > > lucene-codecs/6.4.1/lucene-codecs-6.4.1.jar
> > > Download https://repo1.maven.org/maven2/com/carrotsearch/
> > > randomizedtesting/randomizedtesting-runner/2.4.
> > > 0/randomizedtesting-runner-2.4.0.jar
> > > Note: Some input files use or override a deprecated API.
> > > Note: Recompile with -Xlint:deprecation for details.
> > > Note: Some input files use unchecked or unsafe operations.
> > > Note: Recompile with -Xlint:unchecked for details.
> > > :geode-lucene:processTestResources
> > > :geode-lucene:testClasses
> > > :geode-lucene:checkMissedTests
> > > :geode-lucene:spotlessJavaCheck
> > > :geode-lucene:spotlessCheck
> > > :geode-lucene:test
> > > :geode-lucene:check
> > > :geode-lucene:build
> > > :geode-lucene:distributedTest
> > > :geode-lucene:flakyTest
> > > :geode-lucene:integrationTest
> > > :geode-old-client-support:assemble
> > > :geode-old-client-support:compileTestJava
> > > :geode-old-client-support:processTestResources UP-TO-DATE
> > > :geode-old-client-support:testClasses
> > > :geode-old-client-support:checkMissedTests
> > > :geode-old-client-support:spotlessJavaCheck
> > > :geode-old-client-support:spotlessCheck
> > > :geode-old-client-support:test
> > > :geode-old-client-support:check
> > > :geode-old-client-support:build
> > > :geode-old-client-support:distributedTest
> > > :geode-old-client-support:flakyTest
> > > :geode-old-client-support:integrationTest
> > > :geode-old-versions:javadoc UP-TO-DATE
> > > :geode-old-versions:javadocJar
> > > :geode-old-versions:sourcesJar
> > > :geode-old-versions:signArchives SKIPPED
> > > :geode-old-versions:assemble
> > > :geode-old-versions:compileTestJava UP-TO-DATE
> > > :geode-old-versions:processTestResources UP-TO-DATE
> > > :geode-old-versions:testClasses UP-TO-DATE
> > > :geode-old-versions:checkMissedTests UP-TO-DATE
> > > :geode-old-versions:spotlessJavaCheck
> > > :geode-old-versions:spotlessCheck
> > > :geode-old-versions:test UP-TO-DATE
> > > :geode-old-versions:check
> > > :geode-old-versions:build
> > > :geode-old-versions:distributedTest UP-TO-DATE
> > > :geode-old-versions:flakyTest UP-TO-DATE
> > > :geode-old-versions:integrationTest UP-TO-DATE
> > > :geode-pulse:assemble
> > > :geode-pulse:compileTestJava
> > > Download https://repo1.maven.org/maven2/com/codeborne/
> > > phantomjsdriver/1.3.0/phantomjsdriver-1.3.0.pom
> > > Download https://repo1.maven.org/maven2/org/seleniumhq/
> > > selenium/selenium-api/3.0.1/selenium-api-3.0.1.pom
> > > Download https://repo1.maven.org/maven2/org/seleniumhq/
> > > selenium/selenium-remote-driver/3.0.1/selenium-remote-driver-3.0.1.pom
> > > Download https://repo1.maven.org/maven2/org/seleniumhq/
> > > selenium/selenium-support/3.0.1/selenium-support-3.0.1.pom
> > > Download https://repo1.maven.org/maven2/org/apache/
> > > httpcomponents/httpmime/4.5.2/httpmime-4.5.2.pom
> > > Download https://repo1.maven.org/maven2/org/apache/
> > > httpcomponents/httpcore/4.4.4/httpcore-4.4.4.pom
> > > Download https://repo1.maven.org/maven2/org/apache/
> > > httpcomponents/httpcomponents-core/4.4.4/httpcomponents-core-4.4.4.pom
> > > Download https://repo1.maven.org/maven2/cglib/cglib-nodep/3.2.
> > > 4/cglib-nodep-3.2.4.pom
> > > Download https://repo1.maven.org/maven2/com/codeborne/
> > > phantomjsdriver/1.3.0/phantomjsdriver-1.3.0.jar
> > > Download https://repo1.maven.org/maven2/org/seleniumhq/
> > > selenium/selenium-api/3.0.1/selenium-api-3.0.1.jar
> > > Download https://repo1.maven.org/maven2/org/seleniumhq/
> > > selenium/selenium-remote-driver/3.0.1/selenium-remote-driver-3.0.1.jar
> > > Download https://repo1.maven.org/maven2/org/seleniumhq/
> > > selenium/selenium-support/3.0.1/selenium-support-3.0.1.jar
> > > Download https://repo1.maven.org/maven2/org/apache/
> > > httpcomponents/httpmime/4.5.2/httpmime-4.5.2.jar
> > > Download https://repo1.maven.org/maven2/org/apache/
> > > httpcomponents/httpcore/4.4.4/httpcore-4.4.4.jar
> > > Download https://repo1.maven.org/maven2/cglib/cglib-nodep/3.2.
> > > 4/cglib-nodep-3.2.4.jar
> > > Note: <https://builds.apache.org/job/Geode-nightly/ws/geode-
> > > pulse/src/test/java/org/apache/geode/tools/pulse/
> > tests/ui/PulseBase.java>
> > > uses or overrides a deprecated API.
> > > Note: Recompile with -Xlint:deprecation for details.
> > > Note: <https://builds.apache.org/job/Geode-nightly/ws/geode-
> > > pulse/src/test/java/org/apache/geode/tools/pulse/controllers/
> > > PulseControllerJUnitTest.java> uses unchecked or unsafe operations.
> > > Note: Recompile with -Xlint:unchecked for details.
> > > :geode-pulse:processTestResources
> > > :geode-pulse:testClasses
> > > :geode-pulse:checkMissedTests
> > > Download https://repo1.maven.org/maven2/com/google/code/gson/
> > > gson/2.8.0/gson-2.8.0.pom
> > > Download https://repo1.maven.org/maven2/com/google/code/gson/
> > > gson-parent/2.8.0/gson-parent-2.8.0.pom
> > > Download https://repo1.maven.org/maven2/com/google/code/gson/
> > > gson/2.8.0/gson-2.8.0.jar
> > > :geode-pulse:spotlessJavaCheck
> > > :geode-pulse:spotlessCheck
> > > :geode-pulse:test
> > > :geode-pulse:check
> > > :geode-pulse:build
> > > :geode-pulse:distributedTest
> > > :geode-pulse:flakyTest
> > > :geode-pulse:integrationTest
> > > :geode-rebalancer:assemble
> > > :geode-rebalancer:compileTestJava
> > > :geode-rebalancer:processTestResources UP-TO-DATE
> > > :geode-rebalancer:testClasses
> > > :geode-rebalancer:checkMissedTests
> > > :geode-rebalancer:spotlessJavaCheck
> > > :geode-rebalancer:spotlessCheck
> > > :geode-rebalancer:test
> > > :geode-rebalancer:check
> > > :geode-rebalancer:build
> > > :geode-rebalancer:distributedTest
> > > :geode-rebalancer:flakyTest
> > > :geode-rebalancer:integrationTest
> > > :geode-wan:assemble
> > > :geode-wan:compileTestJavaNote: Some input files use or override a
> > > deprecated API.
> > > Note: Recompile with -Xlint:deprecation for details.
> > > Note: Some input files use unchecked or unsafe operations.
> > > Note: Recompile with -Xlint:unchecked for details.
> > >
> > > :geode-wan:processTestResources
> > > :geode-wan:testClasses
> > > :geode-wan:checkMissedTests
> > > :geode-wan:spotlessJavaCheck
> > > :geode-wan:spotlessCheck
> > > :geode-wan:test
> > > :geode-wan:check
> > > :geode-wan:build
> > > :geode-wan:distributedTest
> > > :geode-wan:flakyTest
> > > :geode-wan:integrationTest
> > > :geode-web:assemble
> > > :geode-web:compileTestJavaNote: Some input files use or override a
> > > deprecated API.
> > > Note: Recompile with -Xlint:deprecation for details.
> > > Note: Some input files use unchecked or unsafe operations.
> > > Note: Recompile with -Xlint:unchecked for details.
> > >
> > > :geode-web:processTestResources UP-TO-DATE
> > > :geode-web:testClasses
> > > :geode-web:checkMissedTests
> > > :geode-web:spotlessJavaCheck
> > > :geode-web:spotlessCheck
> > > :geode-web:test
> > > :geode-web:check
> > > :geode-web:build
> > > :geode-web:distributedTest
> > > :geode-web:flakyTest
> > > :geode-web:integrationTest
> > > :geode-web-api:assemble
> > > :geode-web-api:compileTestJava
> > > :geode-web-api:processTestResources UP-TO-DATE
> > > :geode-web-api:testClasses
> > > :geode-web-api:checkMissedTests
> > > :geode-web-api:spotlessJavaCheck
> > > :geode-web-api:spotlessCheck
> > > :geode-web-api:test
> > > :geode-web-api:check
> > > :geode-web-api:build
> > > :geode-web-api:distributedTest
> > > :geode-web-api:flakyTest
> > > :geode-web-api:integrationTest
> > > :combineReports
> > > All test reports at <https://builds.apache.org/
> > job/Geode-nightly/ws/build/
> > > reports/combined>
> > > :extensions/geode-modules:precheckin
> > > :extensions/geode-modules-assembly:precheckin
> > > :extensions/geode-modules-session:precheckin
> > > :extensions/geode-modules-session-internal:precheckin
> > > :extensions/geode-modules-tomcat7:precheckin
> > > :extensions/geode-modules-tomcat8:precheckin
> > > :geode-assembly:precheckin
> > > :geode-benchmarks:precheckin
> > > :geode-common:precheckin
> > > :geode-cq:precheckin
> > > :geode-json:precheckin
> > > :geode-junit:precheckin
> > > :geode-lucene:precheckin
> > > :geode-old-client-support:precheckin
> > > :geode-old-versions:precheckin
> > > :geode-pulse:precheckin
> > > :geode-rebalancer:precheckin
> > > :geode-wan:precheckin
> > > :geode-web:precheckin
> > > :geode-web-api:precheckin
> > > :compileJava UP-TO-DATE
> > > :processResources UP-TO-DATE
> > > :classes UP-TO-DATE
> > > :jar
> > > :uploadArchives
> > > :extensions/geode-modules:uploadArchives
> > > :extensions/geode-modules-assembly:uploadArchives SKIPPED
> > > :extensions/geode-modules-session:uploadArchives
> > > :extensions/geode-modules-session-internal:uploadArchives
> > > :extensions/geode-modules-tomcat7:uploadArchives
> > > :extensions/geode-modules-tomcat8:uploadArchives
> > > :geode-assembly:uploadArchives SKIPPED
> > > :geode-benchmarks:uploadArchives SKIPPED
> > > :geode-common:uploadArchives
> > > :geode-core:uploadArchives
> > > :geode-cq:uploadArchives
> > > :geode-json:uploadArchives
> > > :geode-junit:uploadArchives
> > > :geode-lucene:uploadArchives
> > > :geode-old-client-support:uploadArchives
> > > :geode-old-versions:uploadArchives SKIPPED
> > > :geode-pulse:uploadArchives
> > > :geode-rebalancer:uploadArchives
> > > :geode-wan:uploadArchives
> > > :geode-web:uploadArchives
> > > :geode-web-api:uploadArchives
> > >
> > > FAILURE: Build failed with an exception.
> > >
> > > * What went wrong:
> > > Execution failed for task ':geode-core:distributedTest'.
> > > > There were failing tests. See the report at: file://<
> > > https://builds.apache.org/job/Geode-nightly/ws/geode-core/
> build/reports/
> > > distributedTest/index.html>
> > >
> > > * Try:
> > > Run with --stacktrace option to get the stack trace. Run with --info or
> > > --debug option to get more log output.
> > >
> > > BUILD FAILED
> > >
> > > Total time: 12 hrs 23 mins 32.587 secs
> > > Build step 'Invoke Gradle script' changed build result to FAILURE
> > > Build step 'Invoke Gradle script' marked build as failure
> > > Archiving artifacts
> > > Compressed 357.99 MB of artifacts by 18.7% relative to #746
> > > Recording test results
> > >
> >
>

Re: Build failed in Jenkins: Geode-nightly #749

Posted by Galen M O'Sullivan <go...@pivotal.io>.
ah, thanks Dan. I was looking in the wrong place.

On Wed, Feb 15, 2017 at 11:12 AM, Dan Smith <ds...@pivotal.io> wrote:

> Galen - I'm guessing you might be trying to click on the link below? I'm
> not sure jenkins actually keeps that stuff - I think it's just looking for
> file:/// urls in the console output and translating them to http:// urls.
> You should be able to find the test results by going to the test result
> link Mark sent out.
>
> We might want consider putting a link to the test result or maybe the
> status page in the emails that jenkins sends out.
>
> * What went wrong:
> Execution failed for task ':geode-core:distributedTest'.
> > There were failing tests. See the report at: file://<
> https://builds.apache.org/job/Geode-nightly/ws/geode-core/build/reports/
> distributedTest/index.html>
>
> On Wed, Feb 15, 2017 at 10:54 AM, Mark Bretl <mb...@apache.org> wrote:
>
> > Hi Galen,
> >
> > I am able to the console log [1], test report summary [2], and artifacts
> > [3] without logging in. Which 'build report' are you trying to view?
> >
> > --Mark
> >
> > [1] https://builds.apache.org/job/Geode-nightly/749/console
> > [2] https://builds.apache.org/job/Geode-nightly/749/testReport/
> > [3] https://builds.apache.org/job/Geode-nightly/749/artifact/
> >
> > On Wed, Feb 15, 2017 at 9:04 AM, Galen M O'Sullivan <
> gosullivan@pivotal.io
> > >
> > wrote:
> >
> > > I don't seem to have access to see the build report. Is that restricted
> > to
> > > committers only?
> > >
> > > Thanks,
> > > Galen
> > >
> > > On Wed, Feb 15, 2017 at 8:08 AM, Apache Jenkins Server <
> > > jenkins@builds.apache.org> wrote:
> > >
> > > > See <https://builds.apache.org/job/Geode-nightly/749/changes>
> > > >
> > > > Changes:
> > > >
> > > > [kmiller] GEODE-2479 Remove docs reference to gemstone.com package
> > > >
> > > > [jiliao] GEODE-2474: mark NetstatDUnitTest as flaky
> > > >
> > > > [jiliao] refactor ServerStarterRule and LocatorStarterRule so that
> they
> > > > can be
> > > >
> > > > [gzhou] GEODE-2471: fix the race condition in test code.
> > > >
> > > > ------------------------------------------
> > > > [...truncated 713 lines...]
> > > > :geode-cq:build
> > > > :geode-cq:distributedTest
> > > > :geode-cq:flakyTest
> > > > :geode-cq:integrationTest
> > > > :geode-json:assemble
> > > > :geode-json:compileTestJava UP-TO-DATE
> > > > :geode-json:processTestResources UP-TO-DATE
> > > > :geode-json:testClasses UP-TO-DATE
> > > > :geode-json:checkMissedTests UP-TO-DATE
> > > > :geode-json:spotlessJavaCheck
> > > > :geode-json:spotlessCheck
> > > > :geode-json:test UP-TO-DATE
> > > > :geode-json:check
> > > > :geode-json:build
> > > > :geode-json:distributedTest UP-TO-DATE
> > > > :geode-json:flakyTest UP-TO-DATE
> > > > :geode-json:integrationTest UP-TO-DATE
> > > > :geode-junit:javadoc
> > > > :geode-junit:javadocJar
> > > > :geode-junit:sourcesJar
> > > > :geode-junit:signArchives SKIPPED
> > > > :geode-junit:assemble
> > > > :geode-junit:compileTestJava
> > > > :geode-junit:processTestResources UP-TO-DATE
> > > > :geode-junit:testClasses
> > > > :geode-junit:checkMissedTests
> > > > :geode-junit:spotlessJavaCheck
> > > > :geode-junit:spotlessCheck
> > > > :geode-junit:test
> > > > :geode-junit:check
> > > > :geode-junit:build
> > > > :geode-junit:distributedTest
> > > > :geode-junit:flakyTest
> > > > :geode-junit:integrationTest
> > > > :geode-lucene:assemble
> > > > :geode-lucene:compileTestJava
> > > > Download https://repo1.maven.org/maven2/org/apache/lucene/
> > > > lucene-test-framework/6.4.1/lucene-test-framework-6.4.1.pom
> > > > Download https://repo1.maven.org/maven2/org/apache/lucene/
> > > > lucene-codecs/6.4.1/lucene-codecs-6.4.1.pom
> > > > Download https://repo1.maven.org/maven2/com/carrotsearch/
> > > > randomizedtesting/randomizedtesting-runner/2.4.
> > > > 0/randomizedtesting-runner-2.4.0.pom
> > > > Download https://repo1.maven.org/maven2/com/carrotsearch/
> > > > randomizedtesting/randomizedtesting-parent/2.4.
> > > > 0/randomizedtesting-parent-2.4.0.pom
> > > > Download https://repo1.maven.org/maven2/org/apache/lucene/
> > > > lucene-test-framework/6.4.1/lucene-test-framework-6.4.1.jar
> > > > Download https://repo1.maven.org/maven2/org/apache/lucene/
> > > > lucene-codecs/6.4.1/lucene-codecs-6.4.1.jar
> > > > Download https://repo1.maven.org/maven2/com/carrotsearch/
> > > > randomizedtesting/randomizedtesting-runner/2.4.
> > > > 0/randomizedtesting-runner-2.4.0.jar
> > > > Note: Some input files use or override a deprecated API.
> > > > Note: Recompile with -Xlint:deprecation for details.
> > > > Note: Some input files use unchecked or unsafe operations.
> > > > Note: Recompile with -Xlint:unchecked for details.
> > > > :geode-lucene:processTestResources
> > > > :geode-lucene:testClasses
> > > > :geode-lucene:checkMissedTests
> > > > :geode-lucene:spotlessJavaCheck
> > > > :geode-lucene:spotlessCheck
> > > > :geode-lucene:test
> > > > :geode-lucene:check
> > > > :geode-lucene:build
> > > > :geode-lucene:distributedTest
> > > > :geode-lucene:flakyTest
> > > > :geode-lucene:integrationTest
> > > > :geode-old-client-support:assemble
> > > > :geode-old-client-support:compileTestJava
> > > > :geode-old-client-support:processTestResources UP-TO-DATE
> > > > :geode-old-client-support:testClasses
> > > > :geode-old-client-support:checkMissedTests
> > > > :geode-old-client-support:spotlessJavaCheck
> > > > :geode-old-client-support:spotlessCheck
> > > > :geode-old-client-support:test
> > > > :geode-old-client-support:check
> > > > :geode-old-client-support:build
> > > > :geode-old-client-support:distributedTest
> > > > :geode-old-client-support:flakyTest
> > > > :geode-old-client-support:integrationTest
> > > > :geode-old-versions:javadoc UP-TO-DATE
> > > > :geode-old-versions:javadocJar
> > > > :geode-old-versions:sourcesJar
> > > > :geode-old-versions:signArchives SKIPPED
> > > > :geode-old-versions:assemble
> > > > :geode-old-versions:compileTestJava UP-TO-DATE
> > > > :geode-old-versions:processTestResources UP-TO-DATE
> > > > :geode-old-versions:testClasses UP-TO-DATE
> > > > :geode-old-versions:checkMissedTests UP-TO-DATE
> > > > :geode-old-versions:spotlessJavaCheck
> > > > :geode-old-versions:spotlessCheck
> > > > :geode-old-versions:test UP-TO-DATE
> > > > :geode-old-versions:check
> > > > :geode-old-versions:build
> > > > :geode-old-versions:distributedTest UP-TO-DATE
> > > > :geode-old-versions:flakyTest UP-TO-DATE
> > > > :geode-old-versions:integrationTest UP-TO-DATE
> > > > :geode-pulse:assemble
> > > > :geode-pulse:compileTestJava
> > > > Download https://repo1.maven.org/maven2/com/codeborne/
> > > > phantomjsdriver/1.3.0/phantomjsdriver-1.3.0.pom
> > > > Download https://repo1.maven.org/maven2/org/seleniumhq/
> > > > selenium/selenium-api/3.0.1/selenium-api-3.0.1.pom
> > > > Download https://repo1.maven.org/maven2/org/seleniumhq/
> > > > selenium/selenium-remote-driver/3.0.1/selenium-remote-
> driver-3.0.1.pom
> > > > Download https://repo1.maven.org/maven2/org/seleniumhq/
> > > > selenium/selenium-support/3.0.1/selenium-support-3.0.1.pom
> > > > Download https://repo1.maven.org/maven2/org/apache/
> > > > httpcomponents/httpmime/4.5.2/httpmime-4.5.2.pom
> > > > Download https://repo1.maven.org/maven2/org/apache/
> > > > httpcomponents/httpcore/4.4.4/httpcore-4.4.4.pom
> > > > Download https://repo1.maven.org/maven2/org/apache/
> > > > httpcomponents/httpcomponents-core/4.4.4/httpcomponents-
> core-4.4.4.pom
> > > > Download https://repo1.maven.org/maven2/cglib/cglib-nodep/3.2.
> > > > 4/cglib-nodep-3.2.4.pom
> > > > Download https://repo1.maven.org/maven2/com/codeborne/
> > > > phantomjsdriver/1.3.0/phantomjsdriver-1.3.0.jar
> > > > Download https://repo1.maven.org/maven2/org/seleniumhq/
> > > > selenium/selenium-api/3.0.1/selenium-api-3.0.1.jar
> > > > Download https://repo1.maven.org/maven2/org/seleniumhq/
> > > > selenium/selenium-remote-driver/3.0.1/selenium-remote-
> driver-3.0.1.jar
> > > > Download https://repo1.maven.org/maven2/org/seleniumhq/
> > > > selenium/selenium-support/3.0.1/selenium-support-3.0.1.jar
> > > > Download https://repo1.maven.org/maven2/org/apache/
> > > > httpcomponents/httpmime/4.5.2/httpmime-4.5.2.jar
> > > > Download https://repo1.maven.org/maven2/org/apache/
> > > > httpcomponents/httpcore/4.4.4/httpcore-4.4.4.jar
> > > > Download https://repo1.maven.org/maven2/cglib/cglib-nodep/3.2.
> > > > 4/cglib-nodep-3.2.4.jar
> > > > Note: <https://builds.apache.org/job/Geode-nightly/ws/geode-
> > > > pulse/src/test/java/org/apache/geode/tools/pulse/
> > > tests/ui/PulseBase.java>
> > > > uses or overrides a deprecated API.
> > > > Note: Recompile with -Xlint:deprecation for details.
> > > > Note: <https://builds.apache.org/job/Geode-nightly/ws/geode-
> > > > pulse/src/test/java/org/apache/geode/tools/pulse/controllers/
> > > > PulseControllerJUnitTest.java> uses unchecked or unsafe operations.
> > > > Note: Recompile with -Xlint:unchecked for details.
> > > > :geode-pulse:processTestResources
> > > > :geode-pulse:testClasses
> > > > :geode-pulse:checkMissedTests
> > > > Download https://repo1.maven.org/maven2/com/google/code/gson/
> > > > gson/2.8.0/gson-2.8.0.pom
> > > > Download https://repo1.maven.org/maven2/com/google/code/gson/
> > > > gson-parent/2.8.0/gson-parent-2.8.0.pom
> > > > Download https://repo1.maven.org/maven2/com/google/code/gson/
> > > > gson/2.8.0/gson-2.8.0.jar
> > > > :geode-pulse:spotlessJavaCheck
> > > > :geode-pulse:spotlessCheck
> > > > :geode-pulse:test
> > > > :geode-pulse:check
> > > > :geode-pulse:build
> > > > :geode-pulse:distributedTest
> > > > :geode-pulse:flakyTest
> > > > :geode-pulse:integrationTest
> > > > :geode-rebalancer:assemble
> > > > :geode-rebalancer:compileTestJava
> > > > :geode-rebalancer:processTestResources UP-TO-DATE
> > > > :geode-rebalancer:testClasses
> > > > :geode-rebalancer:checkMissedTests
> > > > :geode-rebalancer:spotlessJavaCheck
> > > > :geode-rebalancer:spotlessCheck
> > > > :geode-rebalancer:test
> > > > :geode-rebalancer:check
> > > > :geode-rebalancer:build
> > > > :geode-rebalancer:distributedTest
> > > > :geode-rebalancer:flakyTest
> > > > :geode-rebalancer:integrationTest
> > > > :geode-wan:assemble
> > > > :geode-wan:compileTestJavaNote: Some input files use or override a
> > > > deprecated API.
> > > > Note: Recompile with -Xlint:deprecation for details.
> > > > Note: Some input files use unchecked or unsafe operations.
> > > > Note: Recompile with -Xlint:unchecked for details.
> > > >
> > > > :geode-wan:processTestResources
> > > > :geode-wan:testClasses
> > > > :geode-wan:checkMissedTests
> > > > :geode-wan:spotlessJavaCheck
> > > > :geode-wan:spotlessCheck
> > > > :geode-wan:test
> > > > :geode-wan:check
> > > > :geode-wan:build
> > > > :geode-wan:distributedTest
> > > > :geode-wan:flakyTest
> > > > :geode-wan:integrationTest
> > > > :geode-web:assemble
> > > > :geode-web:compileTestJavaNote: Some input files use or override a
> > > > deprecated API.
> > > > Note: Recompile with -Xlint:deprecation for details.
> > > > Note: Some input files use unchecked or unsafe operations.
> > > > Note: Recompile with -Xlint:unchecked for details.
> > > >
> > > > :geode-web:processTestResources UP-TO-DATE
> > > > :geode-web:testClasses
> > > > :geode-web:checkMissedTests
> > > > :geode-web:spotlessJavaCheck
> > > > :geode-web:spotlessCheck
> > > > :geode-web:test
> > > > :geode-web:check
> > > > :geode-web:build
> > > > :geode-web:distributedTest
> > > > :geode-web:flakyTest
> > > > :geode-web:integrationTest
> > > > :geode-web-api:assemble
> > > > :geode-web-api:compileTestJava
> > > > :geode-web-api:processTestResources UP-TO-DATE
> > > > :geode-web-api:testClasses
> > > > :geode-web-api:checkMissedTests
> > > > :geode-web-api:spotlessJavaCheck
> > > > :geode-web-api:spotlessCheck
> > > > :geode-web-api:test
> > > > :geode-web-api:check
> > > > :geode-web-api:build
> > > > :geode-web-api:distributedTest
> > > > :geode-web-api:flakyTest
> > > > :geode-web-api:integrationTest
> > > > :combineReports
> > > > All test reports at <https://builds.apache.org/
> > > job/Geode-nightly/ws/build/
> > > > reports/combined>
> > > > :extensions/geode-modules:precheckin
> > > > :extensions/geode-modules-assembly:precheckin
> > > > :extensions/geode-modules-session:precheckin
> > > > :extensions/geode-modules-session-internal:precheckin
> > > > :extensions/geode-modules-tomcat7:precheckin
> > > > :extensions/geode-modules-tomcat8:precheckin
> > > > :geode-assembly:precheckin
> > > > :geode-benchmarks:precheckin
> > > > :geode-common:precheckin
> > > > :geode-cq:precheckin
> > > > :geode-json:precheckin
> > > > :geode-junit:precheckin
> > > > :geode-lucene:precheckin
> > > > :geode-old-client-support:precheckin
> > > > :geode-old-versions:precheckin
> > > > :geode-pulse:precheckin
> > > > :geode-rebalancer:precheckin
> > > > :geode-wan:precheckin
> > > > :geode-web:precheckin
> > > > :geode-web-api:precheckin
> > > > :compileJava UP-TO-DATE
> > > > :processResources UP-TO-DATE
> > > > :classes UP-TO-DATE
> > > > :jar
> > > > :uploadArchives
> > > > :extensions/geode-modules:uploadArchives
> > > > :extensions/geode-modules-assembly:uploadArchives SKIPPED
> > > > :extensions/geode-modules-session:uploadArchives
> > > > :extensions/geode-modules-session-internal:uploadArchives
> > > > :extensions/geode-modules-tomcat7:uploadArchives
> > > > :extensions/geode-modules-tomcat8:uploadArchives
> > > > :geode-assembly:uploadArchives SKIPPED
> > > > :geode-benchmarks:uploadArchives SKIPPED
> > > > :geode-common:uploadArchives
> > > > :geode-core:uploadArchives
> > > > :geode-cq:uploadArchives
> > > > :geode-json:uploadArchives
> > > > :geode-junit:uploadArchives
> > > > :geode-lucene:uploadArchives
> > > > :geode-old-client-support:uploadArchives
> > > > :geode-old-versions:uploadArchives SKIPPED
> > > > :geode-pulse:uploadArchives
> > > > :geode-rebalancer:uploadArchives
> > > > :geode-wan:uploadArchives
> > > > :geode-web:uploadArchives
> > > > :geode-web-api:uploadArchives
> > > >
> > > > FAILURE: Build failed with an exception.
> > > >
> > > > * What went wrong:
> > > > Execution failed for task ':geode-core:distributedTest'.
> > > > > There were failing tests. See the report at: file://<
> > > > https://builds.apache.org/job/Geode-nightly/ws/geode-core/
> > build/reports/
> > > > distributedTest/index.html>
> > > >
> > > > * Try:
> > > > Run with --stacktrace option to get the stack trace. Run with --info
> or
> > > > --debug option to get more log output.
> > > >
> > > > BUILD FAILED
> > > >
> > > > Total time: 12 hrs 23 mins 32.587 secs
> > > > Build step 'Invoke Gradle script' changed build result to FAILURE
> > > > Build step 'Invoke Gradle script' marked build as failure
> > > > Archiving artifacts
> > > > Compressed 357.99 MB of artifacts by 18.7% relative to #746
> > > > Recording test results
> > > >
> > >
> >
>

Re: Build failed in Jenkins: Geode-nightly #749

Posted by Dan Smith <ds...@pivotal.io>.
Galen - I'm guessing you might be trying to click on the link below? I'm
not sure jenkins actually keeps that stuff - I think it's just looking for
file:/// urls in the console output and translating them to http:// urls.
You should be able to find the test results by going to the test result
link Mark sent out.

We might want consider putting a link to the test result or maybe the
status page in the emails that jenkins sends out.

* What went wrong:
Execution failed for task ':geode-core:distributedTest'.
> There were failing tests. See the report at: file://<
https://builds.apache.org/job/Geode-nightly/ws/geode-core/build/reports/
distributedTest/index.html>

On Wed, Feb 15, 2017 at 10:54 AM, Mark Bretl <mb...@apache.org> wrote:

> Hi Galen,
>
> I am able to the console log [1], test report summary [2], and artifacts
> [3] without logging in. Which 'build report' are you trying to view?
>
> --Mark
>
> [1] https://builds.apache.org/job/Geode-nightly/749/console
> [2] https://builds.apache.org/job/Geode-nightly/749/testReport/
> [3] https://builds.apache.org/job/Geode-nightly/749/artifact/
>
> On Wed, Feb 15, 2017 at 9:04 AM, Galen M O'Sullivan <gosullivan@pivotal.io
> >
> wrote:
>
> > I don't seem to have access to see the build report. Is that restricted
> to
> > committers only?
> >
> > Thanks,
> > Galen
> >
> > On Wed, Feb 15, 2017 at 8:08 AM, Apache Jenkins Server <
> > jenkins@builds.apache.org> wrote:
> >
> > > See <https://builds.apache.org/job/Geode-nightly/749/changes>
> > >
> > > Changes:
> > >
> > > [kmiller] GEODE-2479 Remove docs reference to gemstone.com package
> > >
> > > [jiliao] GEODE-2474: mark NetstatDUnitTest as flaky
> > >
> > > [jiliao] refactor ServerStarterRule and LocatorStarterRule so that they
> > > can be
> > >
> > > [gzhou] GEODE-2471: fix the race condition in test code.
> > >
> > > ------------------------------------------
> > > [...truncated 713 lines...]
> > > :geode-cq:build
> > > :geode-cq:distributedTest
> > > :geode-cq:flakyTest
> > > :geode-cq:integrationTest
> > > :geode-json:assemble
> > > :geode-json:compileTestJava UP-TO-DATE
> > > :geode-json:processTestResources UP-TO-DATE
> > > :geode-json:testClasses UP-TO-DATE
> > > :geode-json:checkMissedTests UP-TO-DATE
> > > :geode-json:spotlessJavaCheck
> > > :geode-json:spotlessCheck
> > > :geode-json:test UP-TO-DATE
> > > :geode-json:check
> > > :geode-json:build
> > > :geode-json:distributedTest UP-TO-DATE
> > > :geode-json:flakyTest UP-TO-DATE
> > > :geode-json:integrationTest UP-TO-DATE
> > > :geode-junit:javadoc
> > > :geode-junit:javadocJar
> > > :geode-junit:sourcesJar
> > > :geode-junit:signArchives SKIPPED
> > > :geode-junit:assemble
> > > :geode-junit:compileTestJava
> > > :geode-junit:processTestResources UP-TO-DATE
> > > :geode-junit:testClasses
> > > :geode-junit:checkMissedTests
> > > :geode-junit:spotlessJavaCheck
> > > :geode-junit:spotlessCheck
> > > :geode-junit:test
> > > :geode-junit:check
> > > :geode-junit:build
> > > :geode-junit:distributedTest
> > > :geode-junit:flakyTest
> > > :geode-junit:integrationTest
> > > :geode-lucene:assemble
> > > :geode-lucene:compileTestJava
> > > Download https://repo1.maven.org/maven2/org/apache/lucene/
> > > lucene-test-framework/6.4.1/lucene-test-framework-6.4.1.pom
> > > Download https://repo1.maven.org/maven2/org/apache/lucene/
> > > lucene-codecs/6.4.1/lucene-codecs-6.4.1.pom
> > > Download https://repo1.maven.org/maven2/com/carrotsearch/
> > > randomizedtesting/randomizedtesting-runner/2.4.
> > > 0/randomizedtesting-runner-2.4.0.pom
> > > Download https://repo1.maven.org/maven2/com/carrotsearch/
> > > randomizedtesting/randomizedtesting-parent/2.4.
> > > 0/randomizedtesting-parent-2.4.0.pom
> > > Download https://repo1.maven.org/maven2/org/apache/lucene/
> > > lucene-test-framework/6.4.1/lucene-test-framework-6.4.1.jar
> > > Download https://repo1.maven.org/maven2/org/apache/lucene/
> > > lucene-codecs/6.4.1/lucene-codecs-6.4.1.jar
> > > Download https://repo1.maven.org/maven2/com/carrotsearch/
> > > randomizedtesting/randomizedtesting-runner/2.4.
> > > 0/randomizedtesting-runner-2.4.0.jar
> > > Note: Some input files use or override a deprecated API.
> > > Note: Recompile with -Xlint:deprecation for details.
> > > Note: Some input files use unchecked or unsafe operations.
> > > Note: Recompile with -Xlint:unchecked for details.
> > > :geode-lucene:processTestResources
> > > :geode-lucene:testClasses
> > > :geode-lucene:checkMissedTests
> > > :geode-lucene:spotlessJavaCheck
> > > :geode-lucene:spotlessCheck
> > > :geode-lucene:test
> > > :geode-lucene:check
> > > :geode-lucene:build
> > > :geode-lucene:distributedTest
> > > :geode-lucene:flakyTest
> > > :geode-lucene:integrationTest
> > > :geode-old-client-support:assemble
> > > :geode-old-client-support:compileTestJava
> > > :geode-old-client-support:processTestResources UP-TO-DATE
> > > :geode-old-client-support:testClasses
> > > :geode-old-client-support:checkMissedTests
> > > :geode-old-client-support:spotlessJavaCheck
> > > :geode-old-client-support:spotlessCheck
> > > :geode-old-client-support:test
> > > :geode-old-client-support:check
> > > :geode-old-client-support:build
> > > :geode-old-client-support:distributedTest
> > > :geode-old-client-support:flakyTest
> > > :geode-old-client-support:integrationTest
> > > :geode-old-versions:javadoc UP-TO-DATE
> > > :geode-old-versions:javadocJar
> > > :geode-old-versions:sourcesJar
> > > :geode-old-versions:signArchives SKIPPED
> > > :geode-old-versions:assemble
> > > :geode-old-versions:compileTestJava UP-TO-DATE
> > > :geode-old-versions:processTestResources UP-TO-DATE
> > > :geode-old-versions:testClasses UP-TO-DATE
> > > :geode-old-versions:checkMissedTests UP-TO-DATE
> > > :geode-old-versions:spotlessJavaCheck
> > > :geode-old-versions:spotlessCheck
> > > :geode-old-versions:test UP-TO-DATE
> > > :geode-old-versions:check
> > > :geode-old-versions:build
> > > :geode-old-versions:distributedTest UP-TO-DATE
> > > :geode-old-versions:flakyTest UP-TO-DATE
> > > :geode-old-versions:integrationTest UP-TO-DATE
> > > :geode-pulse:assemble
> > > :geode-pulse:compileTestJava
> > > Download https://repo1.maven.org/maven2/com/codeborne/
> > > phantomjsdriver/1.3.0/phantomjsdriver-1.3.0.pom
> > > Download https://repo1.maven.org/maven2/org/seleniumhq/
> > > selenium/selenium-api/3.0.1/selenium-api-3.0.1.pom
> > > Download https://repo1.maven.org/maven2/org/seleniumhq/
> > > selenium/selenium-remote-driver/3.0.1/selenium-remote-driver-3.0.1.pom
> > > Download https://repo1.maven.org/maven2/org/seleniumhq/
> > > selenium/selenium-support/3.0.1/selenium-support-3.0.1.pom
> > > Download https://repo1.maven.org/maven2/org/apache/
> > > httpcomponents/httpmime/4.5.2/httpmime-4.5.2.pom
> > > Download https://repo1.maven.org/maven2/org/apache/
> > > httpcomponents/httpcore/4.4.4/httpcore-4.4.4.pom
> > > Download https://repo1.maven.org/maven2/org/apache/
> > > httpcomponents/httpcomponents-core/4.4.4/httpcomponents-core-4.4.4.pom
> > > Download https://repo1.maven.org/maven2/cglib/cglib-nodep/3.2.
> > > 4/cglib-nodep-3.2.4.pom
> > > Download https://repo1.maven.org/maven2/com/codeborne/
> > > phantomjsdriver/1.3.0/phantomjsdriver-1.3.0.jar
> > > Download https://repo1.maven.org/maven2/org/seleniumhq/
> > > selenium/selenium-api/3.0.1/selenium-api-3.0.1.jar
> > > Download https://repo1.maven.org/maven2/org/seleniumhq/
> > > selenium/selenium-remote-driver/3.0.1/selenium-remote-driver-3.0.1.jar
> > > Download https://repo1.maven.org/maven2/org/seleniumhq/
> > > selenium/selenium-support/3.0.1/selenium-support-3.0.1.jar
> > > Download https://repo1.maven.org/maven2/org/apache/
> > > httpcomponents/httpmime/4.5.2/httpmime-4.5.2.jar
> > > Download https://repo1.maven.org/maven2/org/apache/
> > > httpcomponents/httpcore/4.4.4/httpcore-4.4.4.jar
> > > Download https://repo1.maven.org/maven2/cglib/cglib-nodep/3.2.
> > > 4/cglib-nodep-3.2.4.jar
> > > Note: <https://builds.apache.org/job/Geode-nightly/ws/geode-
> > > pulse/src/test/java/org/apache/geode/tools/pulse/
> > tests/ui/PulseBase.java>
> > > uses or overrides a deprecated API.
> > > Note: Recompile with -Xlint:deprecation for details.
> > > Note: <https://builds.apache.org/job/Geode-nightly/ws/geode-
> > > pulse/src/test/java/org/apache/geode/tools/pulse/controllers/
> > > PulseControllerJUnitTest.java> uses unchecked or unsafe operations.
> > > Note: Recompile with -Xlint:unchecked for details.
> > > :geode-pulse:processTestResources
> > > :geode-pulse:testClasses
> > > :geode-pulse:checkMissedTests
> > > Download https://repo1.maven.org/maven2/com/google/code/gson/
> > > gson/2.8.0/gson-2.8.0.pom
> > > Download https://repo1.maven.org/maven2/com/google/code/gson/
> > > gson-parent/2.8.0/gson-parent-2.8.0.pom
> > > Download https://repo1.maven.org/maven2/com/google/code/gson/
> > > gson/2.8.0/gson-2.8.0.jar
> > > :geode-pulse:spotlessJavaCheck
> > > :geode-pulse:spotlessCheck
> > > :geode-pulse:test
> > > :geode-pulse:check
> > > :geode-pulse:build
> > > :geode-pulse:distributedTest
> > > :geode-pulse:flakyTest
> > > :geode-pulse:integrationTest
> > > :geode-rebalancer:assemble
> > > :geode-rebalancer:compileTestJava
> > > :geode-rebalancer:processTestResources UP-TO-DATE
> > > :geode-rebalancer:testClasses
> > > :geode-rebalancer:checkMissedTests
> > > :geode-rebalancer:spotlessJavaCheck
> > > :geode-rebalancer:spotlessCheck
> > > :geode-rebalancer:test
> > > :geode-rebalancer:check
> > > :geode-rebalancer:build
> > > :geode-rebalancer:distributedTest
> > > :geode-rebalancer:flakyTest
> > > :geode-rebalancer:integrationTest
> > > :geode-wan:assemble
> > > :geode-wan:compileTestJavaNote: Some input files use or override a
> > > deprecated API.
> > > Note: Recompile with -Xlint:deprecation for details.
> > > Note: Some input files use unchecked or unsafe operations.
> > > Note: Recompile with -Xlint:unchecked for details.
> > >
> > > :geode-wan:processTestResources
> > > :geode-wan:testClasses
> > > :geode-wan:checkMissedTests
> > > :geode-wan:spotlessJavaCheck
> > > :geode-wan:spotlessCheck
> > > :geode-wan:test
> > > :geode-wan:check
> > > :geode-wan:build
> > > :geode-wan:distributedTest
> > > :geode-wan:flakyTest
> > > :geode-wan:integrationTest
> > > :geode-web:assemble
> > > :geode-web:compileTestJavaNote: Some input files use or override a
> > > deprecated API.
> > > Note: Recompile with -Xlint:deprecation for details.
> > > Note: Some input files use unchecked or unsafe operations.
> > > Note: Recompile with -Xlint:unchecked for details.
> > >
> > > :geode-web:processTestResources UP-TO-DATE
> > > :geode-web:testClasses
> > > :geode-web:checkMissedTests
> > > :geode-web:spotlessJavaCheck
> > > :geode-web:spotlessCheck
> > > :geode-web:test
> > > :geode-web:check
> > > :geode-web:build
> > > :geode-web:distributedTest
> > > :geode-web:flakyTest
> > > :geode-web:integrationTest
> > > :geode-web-api:assemble
> > > :geode-web-api:compileTestJava
> > > :geode-web-api:processTestResources UP-TO-DATE
> > > :geode-web-api:testClasses
> > > :geode-web-api:checkMissedTests
> > > :geode-web-api:spotlessJavaCheck
> > > :geode-web-api:spotlessCheck
> > > :geode-web-api:test
> > > :geode-web-api:check
> > > :geode-web-api:build
> > > :geode-web-api:distributedTest
> > > :geode-web-api:flakyTest
> > > :geode-web-api:integrationTest
> > > :combineReports
> > > All test reports at <https://builds.apache.org/
> > job/Geode-nightly/ws/build/
> > > reports/combined>
> > > :extensions/geode-modules:precheckin
> > > :extensions/geode-modules-assembly:precheckin
> > > :extensions/geode-modules-session:precheckin
> > > :extensions/geode-modules-session-internal:precheckin
> > > :extensions/geode-modules-tomcat7:precheckin
> > > :extensions/geode-modules-tomcat8:precheckin
> > > :geode-assembly:precheckin
> > > :geode-benchmarks:precheckin
> > > :geode-common:precheckin
> > > :geode-cq:precheckin
> > > :geode-json:precheckin
> > > :geode-junit:precheckin
> > > :geode-lucene:precheckin
> > > :geode-old-client-support:precheckin
> > > :geode-old-versions:precheckin
> > > :geode-pulse:precheckin
> > > :geode-rebalancer:precheckin
> > > :geode-wan:precheckin
> > > :geode-web:precheckin
> > > :geode-web-api:precheckin
> > > :compileJava UP-TO-DATE
> > > :processResources UP-TO-DATE
> > > :classes UP-TO-DATE
> > > :jar
> > > :uploadArchives
> > > :extensions/geode-modules:uploadArchives
> > > :extensions/geode-modules-assembly:uploadArchives SKIPPED
> > > :extensions/geode-modules-session:uploadArchives
> > > :extensions/geode-modules-session-internal:uploadArchives
> > > :extensions/geode-modules-tomcat7:uploadArchives
> > > :extensions/geode-modules-tomcat8:uploadArchives
> > > :geode-assembly:uploadArchives SKIPPED
> > > :geode-benchmarks:uploadArchives SKIPPED
> > > :geode-common:uploadArchives
> > > :geode-core:uploadArchives
> > > :geode-cq:uploadArchives
> > > :geode-json:uploadArchives
> > > :geode-junit:uploadArchives
> > > :geode-lucene:uploadArchives
> > > :geode-old-client-support:uploadArchives
> > > :geode-old-versions:uploadArchives SKIPPED
> > > :geode-pulse:uploadArchives
> > > :geode-rebalancer:uploadArchives
> > > :geode-wan:uploadArchives
> > > :geode-web:uploadArchives
> > > :geode-web-api:uploadArchives
> > >
> > > FAILURE: Build failed with an exception.
> > >
> > > * What went wrong:
> > > Execution failed for task ':geode-core:distributedTest'.
> > > > There were failing tests. See the report at: file://<
> > > https://builds.apache.org/job/Geode-nightly/ws/geode-core/
> build/reports/
> > > distributedTest/index.html>
> > >
> > > * Try:
> > > Run with --stacktrace option to get the stack trace. Run with --info or
> > > --debug option to get more log output.
> > >
> > > BUILD FAILED
> > >
> > > Total time: 12 hrs 23 mins 32.587 secs
> > > Build step 'Invoke Gradle script' changed build result to FAILURE
> > > Build step 'Invoke Gradle script' marked build as failure
> > > Archiving artifacts
> > > Compressed 357.99 MB of artifacts by 18.7% relative to #746
> > > Recording test results
> > >
> >
>

Re: Build failed in Jenkins: Geode-nightly #749

Posted by Mark Bretl <mb...@apache.org>.
Hi Galen,

I am able to the console log [1], test report summary [2], and artifacts
[3] without logging in. Which 'build report' are you trying to view?

--Mark

[1] https://builds.apache.org/job/Geode-nightly/749/console
[2] https://builds.apache.org/job/Geode-nightly/749/testReport/
[3] https://builds.apache.org/job/Geode-nightly/749/artifact/

On Wed, Feb 15, 2017 at 9:04 AM, Galen M O'Sullivan <go...@pivotal.io>
wrote:

> I don't seem to have access to see the build report. Is that restricted to
> committers only?
>
> Thanks,
> Galen
>
> On Wed, Feb 15, 2017 at 8:08 AM, Apache Jenkins Server <
> jenkins@builds.apache.org> wrote:
>
> > See <https://builds.apache.org/job/Geode-nightly/749/changes>
> >
> > Changes:
> >
> > [kmiller] GEODE-2479 Remove docs reference to gemstone.com package
> >
> > [jiliao] GEODE-2474: mark NetstatDUnitTest as flaky
> >
> > [jiliao] refactor ServerStarterRule and LocatorStarterRule so that they
> > can be
> >
> > [gzhou] GEODE-2471: fix the race condition in test code.
> >
> > ------------------------------------------
> > [...truncated 713 lines...]
> > :geode-cq:build
> > :geode-cq:distributedTest
> > :geode-cq:flakyTest
> > :geode-cq:integrationTest
> > :geode-json:assemble
> > :geode-json:compileTestJava UP-TO-DATE
> > :geode-json:processTestResources UP-TO-DATE
> > :geode-json:testClasses UP-TO-DATE
> > :geode-json:checkMissedTests UP-TO-DATE
> > :geode-json:spotlessJavaCheck
> > :geode-json:spotlessCheck
> > :geode-json:test UP-TO-DATE
> > :geode-json:check
> > :geode-json:build
> > :geode-json:distributedTest UP-TO-DATE
> > :geode-json:flakyTest UP-TO-DATE
> > :geode-json:integrationTest UP-TO-DATE
> > :geode-junit:javadoc
> > :geode-junit:javadocJar
> > :geode-junit:sourcesJar
> > :geode-junit:signArchives SKIPPED
> > :geode-junit:assemble
> > :geode-junit:compileTestJava
> > :geode-junit:processTestResources UP-TO-DATE
> > :geode-junit:testClasses
> > :geode-junit:checkMissedTests
> > :geode-junit:spotlessJavaCheck
> > :geode-junit:spotlessCheck
> > :geode-junit:test
> > :geode-junit:check
> > :geode-junit:build
> > :geode-junit:distributedTest
> > :geode-junit:flakyTest
> > :geode-junit:integrationTest
> > :geode-lucene:assemble
> > :geode-lucene:compileTestJava
> > Download https://repo1.maven.org/maven2/org/apache/lucene/
> > lucene-test-framework/6.4.1/lucene-test-framework-6.4.1.pom
> > Download https://repo1.maven.org/maven2/org/apache/lucene/
> > lucene-codecs/6.4.1/lucene-codecs-6.4.1.pom
> > Download https://repo1.maven.org/maven2/com/carrotsearch/
> > randomizedtesting/randomizedtesting-runner/2.4.
> > 0/randomizedtesting-runner-2.4.0.pom
> > Download https://repo1.maven.org/maven2/com/carrotsearch/
> > randomizedtesting/randomizedtesting-parent/2.4.
> > 0/randomizedtesting-parent-2.4.0.pom
> > Download https://repo1.maven.org/maven2/org/apache/lucene/
> > lucene-test-framework/6.4.1/lucene-test-framework-6.4.1.jar
> > Download https://repo1.maven.org/maven2/org/apache/lucene/
> > lucene-codecs/6.4.1/lucene-codecs-6.4.1.jar
> > Download https://repo1.maven.org/maven2/com/carrotsearch/
> > randomizedtesting/randomizedtesting-runner/2.4.
> > 0/randomizedtesting-runner-2.4.0.jar
> > Note: Some input files use or override a deprecated API.
> > Note: Recompile with -Xlint:deprecation for details.
> > Note: Some input files use unchecked or unsafe operations.
> > Note: Recompile with -Xlint:unchecked for details.
> > :geode-lucene:processTestResources
> > :geode-lucene:testClasses
> > :geode-lucene:checkMissedTests
> > :geode-lucene:spotlessJavaCheck
> > :geode-lucene:spotlessCheck
> > :geode-lucene:test
> > :geode-lucene:check
> > :geode-lucene:build
> > :geode-lucene:distributedTest
> > :geode-lucene:flakyTest
> > :geode-lucene:integrationTest
> > :geode-old-client-support:assemble
> > :geode-old-client-support:compileTestJava
> > :geode-old-client-support:processTestResources UP-TO-DATE
> > :geode-old-client-support:testClasses
> > :geode-old-client-support:checkMissedTests
> > :geode-old-client-support:spotlessJavaCheck
> > :geode-old-client-support:spotlessCheck
> > :geode-old-client-support:test
> > :geode-old-client-support:check
> > :geode-old-client-support:build
> > :geode-old-client-support:distributedTest
> > :geode-old-client-support:flakyTest
> > :geode-old-client-support:integrationTest
> > :geode-old-versions:javadoc UP-TO-DATE
> > :geode-old-versions:javadocJar
> > :geode-old-versions:sourcesJar
> > :geode-old-versions:signArchives SKIPPED
> > :geode-old-versions:assemble
> > :geode-old-versions:compileTestJava UP-TO-DATE
> > :geode-old-versions:processTestResources UP-TO-DATE
> > :geode-old-versions:testClasses UP-TO-DATE
> > :geode-old-versions:checkMissedTests UP-TO-DATE
> > :geode-old-versions:spotlessJavaCheck
> > :geode-old-versions:spotlessCheck
> > :geode-old-versions:test UP-TO-DATE
> > :geode-old-versions:check
> > :geode-old-versions:build
> > :geode-old-versions:distributedTest UP-TO-DATE
> > :geode-old-versions:flakyTest UP-TO-DATE
> > :geode-old-versions:integrationTest UP-TO-DATE
> > :geode-pulse:assemble
> > :geode-pulse:compileTestJava
> > Download https://repo1.maven.org/maven2/com/codeborne/
> > phantomjsdriver/1.3.0/phantomjsdriver-1.3.0.pom
> > Download https://repo1.maven.org/maven2/org/seleniumhq/
> > selenium/selenium-api/3.0.1/selenium-api-3.0.1.pom
> > Download https://repo1.maven.org/maven2/org/seleniumhq/
> > selenium/selenium-remote-driver/3.0.1/selenium-remote-driver-3.0.1.pom
> > Download https://repo1.maven.org/maven2/org/seleniumhq/
> > selenium/selenium-support/3.0.1/selenium-support-3.0.1.pom
> > Download https://repo1.maven.org/maven2/org/apache/
> > httpcomponents/httpmime/4.5.2/httpmime-4.5.2.pom
> > Download https://repo1.maven.org/maven2/org/apache/
> > httpcomponents/httpcore/4.4.4/httpcore-4.4.4.pom
> > Download https://repo1.maven.org/maven2/org/apache/
> > httpcomponents/httpcomponents-core/4.4.4/httpcomponents-core-4.4.4.pom
> > Download https://repo1.maven.org/maven2/cglib/cglib-nodep/3.2.
> > 4/cglib-nodep-3.2.4.pom
> > Download https://repo1.maven.org/maven2/com/codeborne/
> > phantomjsdriver/1.3.0/phantomjsdriver-1.3.0.jar
> > Download https://repo1.maven.org/maven2/org/seleniumhq/
> > selenium/selenium-api/3.0.1/selenium-api-3.0.1.jar
> > Download https://repo1.maven.org/maven2/org/seleniumhq/
> > selenium/selenium-remote-driver/3.0.1/selenium-remote-driver-3.0.1.jar
> > Download https://repo1.maven.org/maven2/org/seleniumhq/
> > selenium/selenium-support/3.0.1/selenium-support-3.0.1.jar
> > Download https://repo1.maven.org/maven2/org/apache/
> > httpcomponents/httpmime/4.5.2/httpmime-4.5.2.jar
> > Download https://repo1.maven.org/maven2/org/apache/
> > httpcomponents/httpcore/4.4.4/httpcore-4.4.4.jar
> > Download https://repo1.maven.org/maven2/cglib/cglib-nodep/3.2.
> > 4/cglib-nodep-3.2.4.jar
> > Note: <https://builds.apache.org/job/Geode-nightly/ws/geode-
> > pulse/src/test/java/org/apache/geode/tools/pulse/
> tests/ui/PulseBase.java>
> > uses or overrides a deprecated API.
> > Note: Recompile with -Xlint:deprecation for details.
> > Note: <https://builds.apache.org/job/Geode-nightly/ws/geode-
> > pulse/src/test/java/org/apache/geode/tools/pulse/controllers/
> > PulseControllerJUnitTest.java> uses unchecked or unsafe operations.
> > Note: Recompile with -Xlint:unchecked for details.
> > :geode-pulse:processTestResources
> > :geode-pulse:testClasses
> > :geode-pulse:checkMissedTests
> > Download https://repo1.maven.org/maven2/com/google/code/gson/
> > gson/2.8.0/gson-2.8.0.pom
> > Download https://repo1.maven.org/maven2/com/google/code/gson/
> > gson-parent/2.8.0/gson-parent-2.8.0.pom
> > Download https://repo1.maven.org/maven2/com/google/code/gson/
> > gson/2.8.0/gson-2.8.0.jar
> > :geode-pulse:spotlessJavaCheck
> > :geode-pulse:spotlessCheck
> > :geode-pulse:test
> > :geode-pulse:check
> > :geode-pulse:build
> > :geode-pulse:distributedTest
> > :geode-pulse:flakyTest
> > :geode-pulse:integrationTest
> > :geode-rebalancer:assemble
> > :geode-rebalancer:compileTestJava
> > :geode-rebalancer:processTestResources UP-TO-DATE
> > :geode-rebalancer:testClasses
> > :geode-rebalancer:checkMissedTests
> > :geode-rebalancer:spotlessJavaCheck
> > :geode-rebalancer:spotlessCheck
> > :geode-rebalancer:test
> > :geode-rebalancer:check
> > :geode-rebalancer:build
> > :geode-rebalancer:distributedTest
> > :geode-rebalancer:flakyTest
> > :geode-rebalancer:integrationTest
> > :geode-wan:assemble
> > :geode-wan:compileTestJavaNote: Some input files use or override a
> > deprecated API.
> > Note: Recompile with -Xlint:deprecation for details.
> > Note: Some input files use unchecked or unsafe operations.
> > Note: Recompile with -Xlint:unchecked for details.
> >
> > :geode-wan:processTestResources
> > :geode-wan:testClasses
> > :geode-wan:checkMissedTests
> > :geode-wan:spotlessJavaCheck
> > :geode-wan:spotlessCheck
> > :geode-wan:test
> > :geode-wan:check
> > :geode-wan:build
> > :geode-wan:distributedTest
> > :geode-wan:flakyTest
> > :geode-wan:integrationTest
> > :geode-web:assemble
> > :geode-web:compileTestJavaNote: Some input files use or override a
> > deprecated API.
> > Note: Recompile with -Xlint:deprecation for details.
> > Note: Some input files use unchecked or unsafe operations.
> > Note: Recompile with -Xlint:unchecked for details.
> >
> > :geode-web:processTestResources UP-TO-DATE
> > :geode-web:testClasses
> > :geode-web:checkMissedTests
> > :geode-web:spotlessJavaCheck
> > :geode-web:spotlessCheck
> > :geode-web:test
> > :geode-web:check
> > :geode-web:build
> > :geode-web:distributedTest
> > :geode-web:flakyTest
> > :geode-web:integrationTest
> > :geode-web-api:assemble
> > :geode-web-api:compileTestJava
> > :geode-web-api:processTestResources UP-TO-DATE
> > :geode-web-api:testClasses
> > :geode-web-api:checkMissedTests
> > :geode-web-api:spotlessJavaCheck
> > :geode-web-api:spotlessCheck
> > :geode-web-api:test
> > :geode-web-api:check
> > :geode-web-api:build
> > :geode-web-api:distributedTest
> > :geode-web-api:flakyTest
> > :geode-web-api:integrationTest
> > :combineReports
> > All test reports at <https://builds.apache.org/
> job/Geode-nightly/ws/build/
> > reports/combined>
> > :extensions/geode-modules:precheckin
> > :extensions/geode-modules-assembly:precheckin
> > :extensions/geode-modules-session:precheckin
> > :extensions/geode-modules-session-internal:precheckin
> > :extensions/geode-modules-tomcat7:precheckin
> > :extensions/geode-modules-tomcat8:precheckin
> > :geode-assembly:precheckin
> > :geode-benchmarks:precheckin
> > :geode-common:precheckin
> > :geode-cq:precheckin
> > :geode-json:precheckin
> > :geode-junit:precheckin
> > :geode-lucene:precheckin
> > :geode-old-client-support:precheckin
> > :geode-old-versions:precheckin
> > :geode-pulse:precheckin
> > :geode-rebalancer:precheckin
> > :geode-wan:precheckin
> > :geode-web:precheckin
> > :geode-web-api:precheckin
> > :compileJava UP-TO-DATE
> > :processResources UP-TO-DATE
> > :classes UP-TO-DATE
> > :jar
> > :uploadArchives
> > :extensions/geode-modules:uploadArchives
> > :extensions/geode-modules-assembly:uploadArchives SKIPPED
> > :extensions/geode-modules-session:uploadArchives
> > :extensions/geode-modules-session-internal:uploadArchives
> > :extensions/geode-modules-tomcat7:uploadArchives
> > :extensions/geode-modules-tomcat8:uploadArchives
> > :geode-assembly:uploadArchives SKIPPED
> > :geode-benchmarks:uploadArchives SKIPPED
> > :geode-common:uploadArchives
> > :geode-core:uploadArchives
> > :geode-cq:uploadArchives
> > :geode-json:uploadArchives
> > :geode-junit:uploadArchives
> > :geode-lucene:uploadArchives
> > :geode-old-client-support:uploadArchives
> > :geode-old-versions:uploadArchives SKIPPED
> > :geode-pulse:uploadArchives
> > :geode-rebalancer:uploadArchives
> > :geode-wan:uploadArchives
> > :geode-web:uploadArchives
> > :geode-web-api:uploadArchives
> >
> > FAILURE: Build failed with an exception.
> >
> > * What went wrong:
> > Execution failed for task ':geode-core:distributedTest'.
> > > There were failing tests. See the report at: file://<
> > https://builds.apache.org/job/Geode-nightly/ws/geode-core/build/reports/
> > distributedTest/index.html>
> >
> > * Try:
> > Run with --stacktrace option to get the stack trace. Run with --info or
> > --debug option to get more log output.
> >
> > BUILD FAILED
> >
> > Total time: 12 hrs 23 mins 32.587 secs
> > Build step 'Invoke Gradle script' changed build result to FAILURE
> > Build step 'Invoke Gradle script' marked build as failure
> > Archiving artifacts
> > Compressed 357.99 MB of artifacts by 18.7% relative to #746
> > Recording test results
> >
>

Re: Build failed in Jenkins: Geode-nightly #749

Posted by Galen M O'Sullivan <go...@pivotal.io>.
I don't seem to have access to see the build report. Is that restricted to
committers only?

Thanks,
Galen

On Wed, Feb 15, 2017 at 8:08 AM, Apache Jenkins Server <
jenkins@builds.apache.org> wrote:

> See <https://builds.apache.org/job/Geode-nightly/749/changes>
>
> Changes:
>
> [kmiller] GEODE-2479 Remove docs reference to gemstone.com package
>
> [jiliao] GEODE-2474: mark NetstatDUnitTest as flaky
>
> [jiliao] refactor ServerStarterRule and LocatorStarterRule so that they
> can be
>
> [gzhou] GEODE-2471: fix the race condition in test code.
>
> ------------------------------------------
> [...truncated 713 lines...]
> :geode-cq:build
> :geode-cq:distributedTest
> :geode-cq:flakyTest
> :geode-cq:integrationTest
> :geode-json:assemble
> :geode-json:compileTestJava UP-TO-DATE
> :geode-json:processTestResources UP-TO-DATE
> :geode-json:testClasses UP-TO-DATE
> :geode-json:checkMissedTests UP-TO-DATE
> :geode-json:spotlessJavaCheck
> :geode-json:spotlessCheck
> :geode-json:test UP-TO-DATE
> :geode-json:check
> :geode-json:build
> :geode-json:distributedTest UP-TO-DATE
> :geode-json:flakyTest UP-TO-DATE
> :geode-json:integrationTest UP-TO-DATE
> :geode-junit:javadoc
> :geode-junit:javadocJar
> :geode-junit:sourcesJar
> :geode-junit:signArchives SKIPPED
> :geode-junit:assemble
> :geode-junit:compileTestJava
> :geode-junit:processTestResources UP-TO-DATE
> :geode-junit:testClasses
> :geode-junit:checkMissedTests
> :geode-junit:spotlessJavaCheck
> :geode-junit:spotlessCheck
> :geode-junit:test
> :geode-junit:check
> :geode-junit:build
> :geode-junit:distributedTest
> :geode-junit:flakyTest
> :geode-junit:integrationTest
> :geode-lucene:assemble
> :geode-lucene:compileTestJava
> Download https://repo1.maven.org/maven2/org/apache/lucene/
> lucene-test-framework/6.4.1/lucene-test-framework-6.4.1.pom
> Download https://repo1.maven.org/maven2/org/apache/lucene/
> lucene-codecs/6.4.1/lucene-codecs-6.4.1.pom
> Download https://repo1.maven.org/maven2/com/carrotsearch/
> randomizedtesting/randomizedtesting-runner/2.4.
> 0/randomizedtesting-runner-2.4.0.pom
> Download https://repo1.maven.org/maven2/com/carrotsearch/
> randomizedtesting/randomizedtesting-parent/2.4.
> 0/randomizedtesting-parent-2.4.0.pom
> Download https://repo1.maven.org/maven2/org/apache/lucene/
> lucene-test-framework/6.4.1/lucene-test-framework-6.4.1.jar
> Download https://repo1.maven.org/maven2/org/apache/lucene/
> lucene-codecs/6.4.1/lucene-codecs-6.4.1.jar
> Download https://repo1.maven.org/maven2/com/carrotsearch/
> randomizedtesting/randomizedtesting-runner/2.4.
> 0/randomizedtesting-runner-2.4.0.jar
> Note: Some input files use or override a deprecated API.
> Note: Recompile with -Xlint:deprecation for details.
> Note: Some input files use unchecked or unsafe operations.
> Note: Recompile with -Xlint:unchecked for details.
> :geode-lucene:processTestResources
> :geode-lucene:testClasses
> :geode-lucene:checkMissedTests
> :geode-lucene:spotlessJavaCheck
> :geode-lucene:spotlessCheck
> :geode-lucene:test
> :geode-lucene:check
> :geode-lucene:build
> :geode-lucene:distributedTest
> :geode-lucene:flakyTest
> :geode-lucene:integrationTest
> :geode-old-client-support:assemble
> :geode-old-client-support:compileTestJava
> :geode-old-client-support:processTestResources UP-TO-DATE
> :geode-old-client-support:testClasses
> :geode-old-client-support:checkMissedTests
> :geode-old-client-support:spotlessJavaCheck
> :geode-old-client-support:spotlessCheck
> :geode-old-client-support:test
> :geode-old-client-support:check
> :geode-old-client-support:build
> :geode-old-client-support:distributedTest
> :geode-old-client-support:flakyTest
> :geode-old-client-support:integrationTest
> :geode-old-versions:javadoc UP-TO-DATE
> :geode-old-versions:javadocJar
> :geode-old-versions:sourcesJar
> :geode-old-versions:signArchives SKIPPED
> :geode-old-versions:assemble
> :geode-old-versions:compileTestJava UP-TO-DATE
> :geode-old-versions:processTestResources UP-TO-DATE
> :geode-old-versions:testClasses UP-TO-DATE
> :geode-old-versions:checkMissedTests UP-TO-DATE
> :geode-old-versions:spotlessJavaCheck
> :geode-old-versions:spotlessCheck
> :geode-old-versions:test UP-TO-DATE
> :geode-old-versions:check
> :geode-old-versions:build
> :geode-old-versions:distributedTest UP-TO-DATE
> :geode-old-versions:flakyTest UP-TO-DATE
> :geode-old-versions:integrationTest UP-TO-DATE
> :geode-pulse:assemble
> :geode-pulse:compileTestJava
> Download https://repo1.maven.org/maven2/com/codeborne/
> phantomjsdriver/1.3.0/phantomjsdriver-1.3.0.pom
> Download https://repo1.maven.org/maven2/org/seleniumhq/
> selenium/selenium-api/3.0.1/selenium-api-3.0.1.pom
> Download https://repo1.maven.org/maven2/org/seleniumhq/
> selenium/selenium-remote-driver/3.0.1/selenium-remote-driver-3.0.1.pom
> Download https://repo1.maven.org/maven2/org/seleniumhq/
> selenium/selenium-support/3.0.1/selenium-support-3.0.1.pom
> Download https://repo1.maven.org/maven2/org/apache/
> httpcomponents/httpmime/4.5.2/httpmime-4.5.2.pom
> Download https://repo1.maven.org/maven2/org/apache/
> httpcomponents/httpcore/4.4.4/httpcore-4.4.4.pom
> Download https://repo1.maven.org/maven2/org/apache/
> httpcomponents/httpcomponents-core/4.4.4/httpcomponents-core-4.4.4.pom
> Download https://repo1.maven.org/maven2/cglib/cglib-nodep/3.2.
> 4/cglib-nodep-3.2.4.pom
> Download https://repo1.maven.org/maven2/com/codeborne/
> phantomjsdriver/1.3.0/phantomjsdriver-1.3.0.jar
> Download https://repo1.maven.org/maven2/org/seleniumhq/
> selenium/selenium-api/3.0.1/selenium-api-3.0.1.jar
> Download https://repo1.maven.org/maven2/org/seleniumhq/
> selenium/selenium-remote-driver/3.0.1/selenium-remote-driver-3.0.1.jar
> Download https://repo1.maven.org/maven2/org/seleniumhq/
> selenium/selenium-support/3.0.1/selenium-support-3.0.1.jar
> Download https://repo1.maven.org/maven2/org/apache/
> httpcomponents/httpmime/4.5.2/httpmime-4.5.2.jar
> Download https://repo1.maven.org/maven2/org/apache/
> httpcomponents/httpcore/4.4.4/httpcore-4.4.4.jar
> Download https://repo1.maven.org/maven2/cglib/cglib-nodep/3.2.
> 4/cglib-nodep-3.2.4.jar
> Note: <https://builds.apache.org/job/Geode-nightly/ws/geode-
> pulse/src/test/java/org/apache/geode/tools/pulse/tests/ui/PulseBase.java>
> uses or overrides a deprecated API.
> Note: Recompile with -Xlint:deprecation for details.
> Note: <https://builds.apache.org/job/Geode-nightly/ws/geode-
> pulse/src/test/java/org/apache/geode/tools/pulse/controllers/
> PulseControllerJUnitTest.java> uses unchecked or unsafe operations.
> Note: Recompile with -Xlint:unchecked for details.
> :geode-pulse:processTestResources
> :geode-pulse:testClasses
> :geode-pulse:checkMissedTests
> Download https://repo1.maven.org/maven2/com/google/code/gson/
> gson/2.8.0/gson-2.8.0.pom
> Download https://repo1.maven.org/maven2/com/google/code/gson/
> gson-parent/2.8.0/gson-parent-2.8.0.pom
> Download https://repo1.maven.org/maven2/com/google/code/gson/
> gson/2.8.0/gson-2.8.0.jar
> :geode-pulse:spotlessJavaCheck
> :geode-pulse:spotlessCheck
> :geode-pulse:test
> :geode-pulse:check
> :geode-pulse:build
> :geode-pulse:distributedTest
> :geode-pulse:flakyTest
> :geode-pulse:integrationTest
> :geode-rebalancer:assemble
> :geode-rebalancer:compileTestJava
> :geode-rebalancer:processTestResources UP-TO-DATE
> :geode-rebalancer:testClasses
> :geode-rebalancer:checkMissedTests
> :geode-rebalancer:spotlessJavaCheck
> :geode-rebalancer:spotlessCheck
> :geode-rebalancer:test
> :geode-rebalancer:check
> :geode-rebalancer:build
> :geode-rebalancer:distributedTest
> :geode-rebalancer:flakyTest
> :geode-rebalancer:integrationTest
> :geode-wan:assemble
> :geode-wan:compileTestJavaNote: Some input files use or override a
> deprecated API.
> Note: Recompile with -Xlint:deprecation for details.
> Note: Some input files use unchecked or unsafe operations.
> Note: Recompile with -Xlint:unchecked for details.
>
> :geode-wan:processTestResources
> :geode-wan:testClasses
> :geode-wan:checkMissedTests
> :geode-wan:spotlessJavaCheck
> :geode-wan:spotlessCheck
> :geode-wan:test
> :geode-wan:check
> :geode-wan:build
> :geode-wan:distributedTest
> :geode-wan:flakyTest
> :geode-wan:integrationTest
> :geode-web:assemble
> :geode-web:compileTestJavaNote: Some input files use or override a
> deprecated API.
> Note: Recompile with -Xlint:deprecation for details.
> Note: Some input files use unchecked or unsafe operations.
> Note: Recompile with -Xlint:unchecked for details.
>
> :geode-web:processTestResources UP-TO-DATE
> :geode-web:testClasses
> :geode-web:checkMissedTests
> :geode-web:spotlessJavaCheck
> :geode-web:spotlessCheck
> :geode-web:test
> :geode-web:check
> :geode-web:build
> :geode-web:distributedTest
> :geode-web:flakyTest
> :geode-web:integrationTest
> :geode-web-api:assemble
> :geode-web-api:compileTestJava
> :geode-web-api:processTestResources UP-TO-DATE
> :geode-web-api:testClasses
> :geode-web-api:checkMissedTests
> :geode-web-api:spotlessJavaCheck
> :geode-web-api:spotlessCheck
> :geode-web-api:test
> :geode-web-api:check
> :geode-web-api:build
> :geode-web-api:distributedTest
> :geode-web-api:flakyTest
> :geode-web-api:integrationTest
> :combineReports
> All test reports at <https://builds.apache.org/job/Geode-nightly/ws/build/
> reports/combined>
> :extensions/geode-modules:precheckin
> :extensions/geode-modules-assembly:precheckin
> :extensions/geode-modules-session:precheckin
> :extensions/geode-modules-session-internal:precheckin
> :extensions/geode-modules-tomcat7:precheckin
> :extensions/geode-modules-tomcat8:precheckin
> :geode-assembly:precheckin
> :geode-benchmarks:precheckin
> :geode-common:precheckin
> :geode-cq:precheckin
> :geode-json:precheckin
> :geode-junit:precheckin
> :geode-lucene:precheckin
> :geode-old-client-support:precheckin
> :geode-old-versions:precheckin
> :geode-pulse:precheckin
> :geode-rebalancer:precheckin
> :geode-wan:precheckin
> :geode-web:precheckin
> :geode-web-api:precheckin
> :compileJava UP-TO-DATE
> :processResources UP-TO-DATE
> :classes UP-TO-DATE
> :jar
> :uploadArchives
> :extensions/geode-modules:uploadArchives
> :extensions/geode-modules-assembly:uploadArchives SKIPPED
> :extensions/geode-modules-session:uploadArchives
> :extensions/geode-modules-session-internal:uploadArchives
> :extensions/geode-modules-tomcat7:uploadArchives
> :extensions/geode-modules-tomcat8:uploadArchives
> :geode-assembly:uploadArchives SKIPPED
> :geode-benchmarks:uploadArchives SKIPPED
> :geode-common:uploadArchives
> :geode-core:uploadArchives
> :geode-cq:uploadArchives
> :geode-json:uploadArchives
> :geode-junit:uploadArchives
> :geode-lucene:uploadArchives
> :geode-old-client-support:uploadArchives
> :geode-old-versions:uploadArchives SKIPPED
> :geode-pulse:uploadArchives
> :geode-rebalancer:uploadArchives
> :geode-wan:uploadArchives
> :geode-web:uploadArchives
> :geode-web-api:uploadArchives
>
> FAILURE: Build failed with an exception.
>
> * What went wrong:
> Execution failed for task ':geode-core:distributedTest'.
> > There were failing tests. See the report at: file://<
> https://builds.apache.org/job/Geode-nightly/ws/geode-core/build/reports/
> distributedTest/index.html>
>
> * Try:
> Run with --stacktrace option to get the stack trace. Run with --info or
> --debug option to get more log output.
>
> BUILD FAILED
>
> Total time: 12 hrs 23 mins 32.587 secs
> Build step 'Invoke Gradle script' changed build result to FAILURE
> Build step 'Invoke Gradle script' marked build as failure
> Archiving artifacts
> Compressed 357.99 MB of artifacts by 18.7% relative to #746
> Recording test results
>

Build failed in Jenkins: Geode-nightly #749

Posted by Apache Jenkins Server <je...@builds.apache.org>.
See <https://builds.apache.org/job/Geode-nightly/749/changes>

Changes:

[kmiller] GEODE-2479 Remove docs reference to gemstone.com package

[jiliao] GEODE-2474: mark NetstatDUnitTest as flaky

[jiliao] refactor ServerStarterRule and LocatorStarterRule so that they can be

[gzhou] GEODE-2471: fix the race condition in test code.

------------------------------------------
[...truncated 713 lines...]
:geode-cq:build
:geode-cq:distributedTest
:geode-cq:flakyTest
:geode-cq:integrationTest
:geode-json:assemble
:geode-json:compileTestJava UP-TO-DATE
:geode-json:processTestResources UP-TO-DATE
:geode-json:testClasses UP-TO-DATE
:geode-json:checkMissedTests UP-TO-DATE
:geode-json:spotlessJavaCheck
:geode-json:spotlessCheck
:geode-json:test UP-TO-DATE
:geode-json:check
:geode-json:build
:geode-json:distributedTest UP-TO-DATE
:geode-json:flakyTest UP-TO-DATE
:geode-json:integrationTest UP-TO-DATE
:geode-junit:javadoc
:geode-junit:javadocJar
:geode-junit:sourcesJar
:geode-junit:signArchives SKIPPED
:geode-junit:assemble
:geode-junit:compileTestJava
:geode-junit:processTestResources UP-TO-DATE
:geode-junit:testClasses
:geode-junit:checkMissedTests
:geode-junit:spotlessJavaCheck
:geode-junit:spotlessCheck
:geode-junit:test
:geode-junit:check
:geode-junit:build
:geode-junit:distributedTest
:geode-junit:flakyTest
:geode-junit:integrationTest
:geode-lucene:assemble
:geode-lucene:compileTestJava
Download https://repo1.maven.org/maven2/org/apache/lucene/lucene-test-framework/6.4.1/lucene-test-framework-6.4.1.pom
Download https://repo1.maven.org/maven2/org/apache/lucene/lucene-codecs/6.4.1/lucene-codecs-6.4.1.pom
Download https://repo1.maven.org/maven2/com/carrotsearch/randomizedtesting/randomizedtesting-runner/2.4.0/randomizedtesting-runner-2.4.0.pom
Download https://repo1.maven.org/maven2/com/carrotsearch/randomizedtesting/randomizedtesting-parent/2.4.0/randomizedtesting-parent-2.4.0.pom
Download https://repo1.maven.org/maven2/org/apache/lucene/lucene-test-framework/6.4.1/lucene-test-framework-6.4.1.jar
Download https://repo1.maven.org/maven2/org/apache/lucene/lucene-codecs/6.4.1/lucene-codecs-6.4.1.jar
Download https://repo1.maven.org/maven2/com/carrotsearch/randomizedtesting/randomizedtesting-runner/2.4.0/randomizedtesting-runner-2.4.0.jar
Note: Some input files use or override a deprecated API.
Note: Recompile with -Xlint:deprecation for details.
Note: Some input files use unchecked or unsafe operations.
Note: Recompile with -Xlint:unchecked for details.
:geode-lucene:processTestResources
:geode-lucene:testClasses
:geode-lucene:checkMissedTests
:geode-lucene:spotlessJavaCheck
:geode-lucene:spotlessCheck
:geode-lucene:test
:geode-lucene:check
:geode-lucene:build
:geode-lucene:distributedTest
:geode-lucene:flakyTest
:geode-lucene:integrationTest
:geode-old-client-support:assemble
:geode-old-client-support:compileTestJava
:geode-old-client-support:processTestResources UP-TO-DATE
:geode-old-client-support:testClasses
:geode-old-client-support:checkMissedTests
:geode-old-client-support:spotlessJavaCheck
:geode-old-client-support:spotlessCheck
:geode-old-client-support:test
:geode-old-client-support:check
:geode-old-client-support:build
:geode-old-client-support:distributedTest
:geode-old-client-support:flakyTest
:geode-old-client-support:integrationTest
:geode-old-versions:javadoc UP-TO-DATE
:geode-old-versions:javadocJar
:geode-old-versions:sourcesJar
:geode-old-versions:signArchives SKIPPED
:geode-old-versions:assemble
:geode-old-versions:compileTestJava UP-TO-DATE
:geode-old-versions:processTestResources UP-TO-DATE
:geode-old-versions:testClasses UP-TO-DATE
:geode-old-versions:checkMissedTests UP-TO-DATE
:geode-old-versions:spotlessJavaCheck
:geode-old-versions:spotlessCheck
:geode-old-versions:test UP-TO-DATE
:geode-old-versions:check
:geode-old-versions:build
:geode-old-versions:distributedTest UP-TO-DATE
:geode-old-versions:flakyTest UP-TO-DATE
:geode-old-versions:integrationTest UP-TO-DATE
:geode-pulse:assemble
:geode-pulse:compileTestJava
Download https://repo1.maven.org/maven2/com/codeborne/phantomjsdriver/1.3.0/phantomjsdriver-1.3.0.pom
Download https://repo1.maven.org/maven2/org/seleniumhq/selenium/selenium-api/3.0.1/selenium-api-3.0.1.pom
Download https://repo1.maven.org/maven2/org/seleniumhq/selenium/selenium-remote-driver/3.0.1/selenium-remote-driver-3.0.1.pom
Download https://repo1.maven.org/maven2/org/seleniumhq/selenium/selenium-support/3.0.1/selenium-support-3.0.1.pom
Download https://repo1.maven.org/maven2/org/apache/httpcomponents/httpmime/4.5.2/httpmime-4.5.2.pom
Download https://repo1.maven.org/maven2/org/apache/httpcomponents/httpcore/4.4.4/httpcore-4.4.4.pom
Download https://repo1.maven.org/maven2/org/apache/httpcomponents/httpcomponents-core/4.4.4/httpcomponents-core-4.4.4.pom
Download https://repo1.maven.org/maven2/cglib/cglib-nodep/3.2.4/cglib-nodep-3.2.4.pom
Download https://repo1.maven.org/maven2/com/codeborne/phantomjsdriver/1.3.0/phantomjsdriver-1.3.0.jar
Download https://repo1.maven.org/maven2/org/seleniumhq/selenium/selenium-api/3.0.1/selenium-api-3.0.1.jar
Download https://repo1.maven.org/maven2/org/seleniumhq/selenium/selenium-remote-driver/3.0.1/selenium-remote-driver-3.0.1.jar
Download https://repo1.maven.org/maven2/org/seleniumhq/selenium/selenium-support/3.0.1/selenium-support-3.0.1.jar
Download https://repo1.maven.org/maven2/org/apache/httpcomponents/httpmime/4.5.2/httpmime-4.5.2.jar
Download https://repo1.maven.org/maven2/org/apache/httpcomponents/httpcore/4.4.4/httpcore-4.4.4.jar
Download https://repo1.maven.org/maven2/cglib/cglib-nodep/3.2.4/cglib-nodep-3.2.4.jar
Note: <https://builds.apache.org/job/Geode-nightly/ws/geode-pulse/src/test/java/org/apache/geode/tools/pulse/tests/ui/PulseBase.java> uses or overrides a deprecated API.
Note: Recompile with -Xlint:deprecation for details.
Note: <https://builds.apache.org/job/Geode-nightly/ws/geode-pulse/src/test/java/org/apache/geode/tools/pulse/controllers/PulseControllerJUnitTest.java> uses unchecked or unsafe operations.
Note: Recompile with -Xlint:unchecked for details.
:geode-pulse:processTestResources
:geode-pulse:testClasses
:geode-pulse:checkMissedTests
Download https://repo1.maven.org/maven2/com/google/code/gson/gson/2.8.0/gson-2.8.0.pom
Download https://repo1.maven.org/maven2/com/google/code/gson/gson-parent/2.8.0/gson-parent-2.8.0.pom
Download https://repo1.maven.org/maven2/com/google/code/gson/gson/2.8.0/gson-2.8.0.jar
:geode-pulse:spotlessJavaCheck
:geode-pulse:spotlessCheck
:geode-pulse:test
:geode-pulse:check
:geode-pulse:build
:geode-pulse:distributedTest
:geode-pulse:flakyTest
:geode-pulse:integrationTest
:geode-rebalancer:assemble
:geode-rebalancer:compileTestJava
:geode-rebalancer:processTestResources UP-TO-DATE
:geode-rebalancer:testClasses
:geode-rebalancer:checkMissedTests
:geode-rebalancer:spotlessJavaCheck
:geode-rebalancer:spotlessCheck
:geode-rebalancer:test
:geode-rebalancer:check
:geode-rebalancer:build
:geode-rebalancer:distributedTest
:geode-rebalancer:flakyTest
:geode-rebalancer:integrationTest
:geode-wan:assemble
:geode-wan:compileTestJavaNote: Some input files use or override a deprecated API.
Note: Recompile with -Xlint:deprecation for details.
Note: Some input files use unchecked or unsafe operations.
Note: Recompile with -Xlint:unchecked for details.

:geode-wan:processTestResources
:geode-wan:testClasses
:geode-wan:checkMissedTests
:geode-wan:spotlessJavaCheck
:geode-wan:spotlessCheck
:geode-wan:test
:geode-wan:check
:geode-wan:build
:geode-wan:distributedTest
:geode-wan:flakyTest
:geode-wan:integrationTest
:geode-web:assemble
:geode-web:compileTestJavaNote: Some input files use or override a deprecated API.
Note: Recompile with -Xlint:deprecation for details.
Note: Some input files use unchecked or unsafe operations.
Note: Recompile with -Xlint:unchecked for details.

:geode-web:processTestResources UP-TO-DATE
:geode-web:testClasses
:geode-web:checkMissedTests
:geode-web:spotlessJavaCheck
:geode-web:spotlessCheck
:geode-web:test
:geode-web:check
:geode-web:build
:geode-web:distributedTest
:geode-web:flakyTest
:geode-web:integrationTest
:geode-web-api:assemble
:geode-web-api:compileTestJava
:geode-web-api:processTestResources UP-TO-DATE
:geode-web-api:testClasses
:geode-web-api:checkMissedTests
:geode-web-api:spotlessJavaCheck
:geode-web-api:spotlessCheck
:geode-web-api:test
:geode-web-api:check
:geode-web-api:build
:geode-web-api:distributedTest
:geode-web-api:flakyTest
:geode-web-api:integrationTest
:combineReports
All test reports at <https://builds.apache.org/job/Geode-nightly/ws/build/reports/combined>
:extensions/geode-modules:precheckin
:extensions/geode-modules-assembly:precheckin
:extensions/geode-modules-session:precheckin
:extensions/geode-modules-session-internal:precheckin
:extensions/geode-modules-tomcat7:precheckin
:extensions/geode-modules-tomcat8:precheckin
:geode-assembly:precheckin
:geode-benchmarks:precheckin
:geode-common:precheckin
:geode-cq:precheckin
:geode-json:precheckin
:geode-junit:precheckin
:geode-lucene:precheckin
:geode-old-client-support:precheckin
:geode-old-versions:precheckin
:geode-pulse:precheckin
:geode-rebalancer:precheckin
:geode-wan:precheckin
:geode-web:precheckin
:geode-web-api:precheckin
:compileJava UP-TO-DATE
:processResources UP-TO-DATE
:classes UP-TO-DATE
:jar
:uploadArchives
:extensions/geode-modules:uploadArchives
:extensions/geode-modules-assembly:uploadArchives SKIPPED
:extensions/geode-modules-session:uploadArchives
:extensions/geode-modules-session-internal:uploadArchives
:extensions/geode-modules-tomcat7:uploadArchives
:extensions/geode-modules-tomcat8:uploadArchives
:geode-assembly:uploadArchives SKIPPED
:geode-benchmarks:uploadArchives SKIPPED
:geode-common:uploadArchives
:geode-core:uploadArchives
:geode-cq:uploadArchives
:geode-json:uploadArchives
:geode-junit:uploadArchives
:geode-lucene:uploadArchives
:geode-old-client-support:uploadArchives
:geode-old-versions:uploadArchives SKIPPED
:geode-pulse:uploadArchives
:geode-rebalancer:uploadArchives
:geode-wan:uploadArchives
:geode-web:uploadArchives
:geode-web-api:uploadArchives

FAILURE: Build failed with an exception.

* What went wrong:
Execution failed for task ':geode-core:distributedTest'.
> There were failing tests. See the report at: file://<https://builds.apache.org/job/Geode-nightly/ws/geode-core/build/reports/distributedTest/index.html>

* Try:
Run with --stacktrace option to get the stack trace. Run with --info or --debug option to get more log output.

BUILD FAILED

Total time: 12 hrs 23 mins 32.587 secs
Build step 'Invoke Gradle script' changed build result to FAILURE
Build step 'Invoke Gradle script' marked build as failure
Archiving artifacts
Compressed 357.99 MB of artifacts by 18.7% relative to #746
Recording test results

Re: Build failed in Jenkins: Geode-nightly #748

Posted by Jinmei Liao <ji...@pivotal.io>.
We have a fix for the integration test failure, and fix for the distributed
tests are in review too. Thanks!

On Tue, Feb 14, 2017 at 8:12 AM, Apache Jenkins Server <
jenkins@builds.apache.org> wrote:

> See <https://builds.apache.org/job/Geode-nightly/748/changes>
>
> Changes:
>
> [klund] GEODE-2460: update dependency versions
>
> [jiliao] GEODE-1716: refactor JMXMBeanDunitTest
>
> [huynhja] GEODE-2475: Upgrade Lucene version to 6.4.1
>
> [khowe] GEODE-2398: Retry oplog channel.write on silent failures
>
> [khowe] GEODE-2398: Updates from review
>
> ------------------------------------------
> [...truncated 874 lines...]
> :geode-json:spotlessCheck
> :geode-json:test UP-TO-DATE
> :geode-json:check
> :geode-json:build
> :geode-json:distributedTest UP-TO-DATE
> :geode-json:flakyTest UP-TO-DATE
> :geode-json:integrationTest UP-TO-DATE
> :geode-junit:javadoc
> :geode-junit:javadocJar
> :geode-junit:sourcesJar
> :geode-junit:signArchives SKIPPED
> :geode-junit:assemble
> :geode-junit:compileTestJava
> :geode-junit:processTestResources UP-TO-DATE
> :geode-junit:testClasses
> :geode-junit:checkMissedTests
> :geode-junit:spotlessJavaCheck
> :geode-junit:spotlessCheck
> :geode-junit:test
> :geode-junit:check
> :geode-junit:build
> :geode-junit:distributedTest
> :geode-junit:flakyTest
> :geode-junit:integrationTest
> :geode-lucene:assemble
> :geode-lucene:compileTestJava
> Download https://repo1.maven.org/maven2/org/apache/lucene/
> lucene-test-framework/6.4.1/lucene-test-framework-6.4.1.pom
> Download https://repo1.maven.org/maven2/org/apache/lucene/
> lucene-codecs/6.4.1/lucene-codecs-6.4.1.pom
> Download https://repo1.maven.org/maven2/com/carrotsearch/
> randomizedtesting/randomizedtesting-runner/2.4.
> 0/randomizedtesting-runner-2.4.0.pom
> Download https://repo1.maven.org/maven2/com/carrotsearch/
> randomizedtesting/randomizedtesting-parent/2.4.
> 0/randomizedtesting-parent-2.4.0.pom
> Download https://repo1.maven.org/maven2/org/apache/lucene/
> lucene-test-framework/6.4.1/lucene-test-framework-6.4.1.jar
> Download https://repo1.maven.org/maven2/org/apache/lucene/
> lucene-codecs/6.4.1/lucene-codecs-6.4.1.jar
> Download https://repo1.maven.org/maven2/com/carrotsearch/
> randomizedtesting/randomizedtesting-runner/2.4.
> 0/randomizedtesting-runner-2.4.0.jar
> Note: Some input files use or override a deprecated API.
> Note: Recompile with -Xlint:deprecation for details.
> Note: Some input files use unchecked or unsafe operations.
> Note: Recompile with -Xlint:unchecked for details.
> :geode-lucene:processTestResources
> :geode-lucene:testClasses
> :geode-lucene:checkMissedTests
> :geode-lucene:spotlessJavaCheck
> :geode-lucene:spotlessCheck
> :geode-lucene:test
> :geode-lucene:check
> :geode-lucene:build
> :geode-lucene:distributedTest
> :geode-lucene:flakyTest
> :geode-lucene:integrationTest
> :geode-old-client-support:assemble
> :geode-old-client-support:compileTestJava
> :geode-old-client-support:processTestResources UP-TO-DATE
> :geode-old-client-support:testClasses
> :geode-old-client-support:checkMissedTests
> :geode-old-client-support:spotlessJavaCheck
> :geode-old-client-support:spotlessCheck
> :geode-old-client-support:test
> :geode-old-client-support:check
> :geode-old-client-support:build
> :geode-old-client-support:distributedTest
> :geode-old-client-support:flakyTest
> :geode-old-client-support:integrationTest
> :geode-old-versions:javadoc UP-TO-DATE
> :geode-old-versions:javadocJar
> :geode-old-versions:sourcesJar
> :geode-old-versions:signArchives SKIPPED
> :geode-old-versions:assemble
> :geode-old-versions:compileTestJava UP-TO-DATE
> :geode-old-versions:processTestResources UP-TO-DATE
> :geode-old-versions:testClasses UP-TO-DATE
> :geode-old-versions:checkMissedTests UP-TO-DATE
> :geode-old-versions:spotlessJavaCheck
> :geode-old-versions:spotlessCheck
> :geode-old-versions:test UP-TO-DATE
> :geode-old-versions:check
> :geode-old-versions:build
> :geode-old-versions:distributedTest UP-TO-DATE
> :geode-old-versions:flakyTest UP-TO-DATE
> :geode-old-versions:integrationTest UP-TO-DATE
> :geode-pulse:assemble
> :geode-pulse:compileTestJava
> Download https://repo1.maven.org/maven2/com/codeborne/
> phantomjsdriver/1.3.0/phantomjsdriver-1.3.0.pom
> Download https://repo1.maven.org/maven2/org/seleniumhq/
> selenium/selenium-api/3.0.1/selenium-api-3.0.1.pom
> Download https://repo1.maven.org/maven2/org/seleniumhq/
> selenium/selenium-remote-driver/3.0.1/selenium-remote-driver-3.0.1.pom
> Download https://repo1.maven.org/maven2/org/seleniumhq/
> selenium/selenium-support/3.0.1/selenium-support-3.0.1.pom
> Download https://repo1.maven.org/maven2/org/apache/
> httpcomponents/httpmime/4.5.2/httpmime-4.5.2.pom
> Download https://repo1.maven.org/maven2/cglib/cglib-nodep/3.2.
> 4/cglib-nodep-3.2.4.pom
> Download https://repo1.maven.org/maven2/com/codeborne/
> phantomjsdriver/1.3.0/phantomjsdriver-1.3.0.jar
> Download https://repo1.maven.org/maven2/org/seleniumhq/
> selenium/selenium-api/3.0.1/selenium-api-3.0.1.jar
> Download https://repo1.maven.org/maven2/org/seleniumhq/
> selenium/selenium-remote-driver/3.0.1/selenium-remote-driver-3.0.1.jar
> Download https://repo1.maven.org/maven2/org/seleniumhq/
> selenium/selenium-support/3.0.1/selenium-support-3.0.1.jar
> Download https://repo1.maven.org/maven2/org/apache/
> httpcomponents/httpmime/4.5.2/httpmime-4.5.2.jar
> Download https://repo1.maven.org/maven2/cglib/cglib-nodep/3.2.
> 4/cglib-nodep-3.2.4.jar
> Note: <https://builds.apache.org/job/Geode-nightly/ws/geode-
> pulse/src/test/java/org/apache/geode/tools/pulse/tests/ui/PulseBase.java>
> uses or overrides a deprecated API.
> Note: Recompile with -Xlint:deprecation for details.
> Note: <https://builds.apache.org/job/Geode-nightly/ws/geode-
> pulse/src/test/java/org/apache/geode/tools/pulse/controllers/
> PulseControllerJUnitTest.java> uses unchecked or unsafe operations.
> Note: Recompile with -Xlint:unchecked for details.
> :geode-pulse:processTestResources
> :geode-pulse:testClasses
> :geode-pulse:checkMissedTests
> Download https://repo1.maven.org/maven2/com/google/code/gson/
> gson/2.8.0/gson-2.8.0.pom
> Download https://repo1.maven.org/maven2/com/google/code/gson/
> gson-parent/2.8.0/gson-parent-2.8.0.pom
> Download https://repo1.maven.org/maven2/com/google/code/gson/
> gson/2.8.0/gson-2.8.0.jar
> :geode-pulse:spotlessJavaCheck
> :geode-pulse:spotlessCheck
> :geode-pulse:test
> :geode-pulse:check
> :geode-pulse:build
> :geode-pulse:distributedTest
> :geode-pulse:flakyTest
> :geode-pulse:integrationTest
> :geode-rebalancer:assemble
> :geode-rebalancer:compileTestJava
> :geode-rebalancer:processTestResources UP-TO-DATE
> :geode-rebalancer:testClasses
> :geode-rebalancer:checkMissedTests
> :geode-rebalancer:spotlessJavaCheck
> :geode-rebalancer:spotlessCheck
> :geode-rebalancer:test
> :geode-rebalancer:check
> :geode-rebalancer:build
> :geode-rebalancer:distributedTest
> :geode-rebalancer:flakyTest
> :geode-rebalancer:integrationTest
> :geode-wan:assemble
> :geode-wan:compileTestJavaNote: Some input files use or override a
> deprecated API.
> Note: Recompile with -Xlint:deprecation for details.
> Note: Some input files use unchecked or unsafe operations.
> Note: Recompile with -Xlint:unchecked for details.
>
> :geode-wan:processTestResources
> :geode-wan:testClasses
> :geode-wan:checkMissedTests
> :geode-wan:spotlessJavaCheck
> :geode-wan:spotlessCheck
> :geode-wan:test
> :geode-wan:check
> :geode-wan:build
> :geode-wan:distributedTest
> :geode-wan:flakyTest
> :geode-wan:integrationTest
> :geode-web:assemble
> :geode-web:compileTestJavaNote: Some input files use or override a
> deprecated API.
> Note: Recompile with -Xlint:deprecation for details.
> Note: Some input files use unchecked or unsafe operations.
> Note: Recompile with -Xlint:unchecked for details.
>
> :geode-web:processTestResources UP-TO-DATE
> :geode-web:testClasses
> :geode-web:checkMissedTests
> :geode-web:spotlessJavaCheck
> :geode-web:spotlessCheck
> :geode-web:test
> :geode-web:check
> :geode-web:build
> :geode-web:distributedTest
> :geode-web:flakyTest
> :geode-web:integrationTest
> :geode-web-api:assemble
> :geode-web-api:compileTestJava
> :geode-web-api:processTestResources UP-TO-DATE
> :geode-web-api:testClasses
> :geode-web-api:checkMissedTests
> :geode-web-api:spotlessJavaCheck
> :geode-web-api:spotlessCheck
> :geode-web-api:test
> :geode-web-api:check
> :geode-web-api:build
> :geode-web-api:distributedTest
> :geode-web-api:flakyTest
> :geode-web-api:integrationTest
> :combineReports
> All test reports at <https://builds.apache.org/job/Geode-nightly/ws/build/
> reports/combined>
> :extensions/geode-modules:precheckin
> :extensions/geode-modules-assembly:precheckin
> :extensions/geode-modules-session:precheckin
> :extensions/geode-modules-session-internal:precheckin
> :extensions/geode-modules-tomcat7:precheckin
> :extensions/geode-modules-tomcat8:precheckin
> :geode-assembly:precheckin
> :geode-benchmarks:precheckin
> :geode-common:precheckin
> :geode-cq:precheckin
> :geode-json:precheckin
> :geode-junit:precheckin
> :geode-lucene:precheckin
> :geode-old-client-support:precheckin
> :geode-old-versions:precheckin
> :geode-pulse:precheckin
> :geode-rebalancer:precheckin
> :geode-wan:precheckin
> :geode-web:precheckin
> :geode-web-api:precheckin
> :compileJava UP-TO-DATE
> :processResources UP-TO-DATE
> :classes UP-TO-DATE
> :jar
> :uploadArchives
> :extensions/geode-modules:uploadArchives
> :extensions/geode-modules-assembly:uploadArchives SKIPPED
> :extensions/geode-modules-session:uploadArchives
> :extensions/geode-modules-session-internal:uploadArchives
> :extensions/geode-modules-tomcat7:uploadArchives
> :extensions/geode-modules-tomcat8:uploadArchives
> :geode-assembly:uploadArchives SKIPPED
> :geode-benchmarks:uploadArchives SKIPPED
> :geode-common:uploadArchives
> :geode-core:uploadArchives
> :geode-cq:uploadArchives
> :geode-json:uploadArchives
> :geode-junit:uploadArchives
> :geode-lucene:uploadArchives
> :geode-old-client-support:uploadArchives
> :geode-old-versions:uploadArchives SKIPPED
> :geode-pulse:uploadArchives
> :geode-rebalancer:uploadArchives
> :geode-wan:uploadArchives
> :geode-web:uploadArchives
> :geode-web-api:uploadArchives
>
> FAILURE: Build completed with 2 failures.
>
> 1: Task failed with an exception.
> -----------
> * What went wrong:
> Execution failed for task ':geode-core:distributedTest'.
> > There were failing tests. See the report at: file://<
> https://builds.apache.org/job/Geode-nightly/ws/geode-core/build/reports/
> distributedTest/index.html>
>
> * Try:
> Run with --stacktrace option to get the stack trace. Run with --info or
> --debug option to get more log output.
> ============================================================
> ==================
>
> 2: Task failed with an exception.
> -----------
> * What went wrong:
> Execution failed for task ':geode-core:integrationTest'.
> > There were failing tests. See the report at: file://<
> https://builds.apache.org/job/Geode-nightly/ws/geode-core/build/reports/
> integrationTest/index.html>
>
> * Try:
> Run with --stacktrace option to get the stack trace. Run with --info or
> --debug option to get more log output.
> ============================================================
> ==================
>
> BUILD FAILED
>
> Total time: 12 hrs 26 mins 23.605 secs
> Build step 'Invoke Gradle script' changed build result to FAILURE
> Build step 'Invoke Gradle script' marked build as failure
> Archiving artifacts
> Compressed 357.99 MB of artifacts by 28.6% relative to #746
> Recording test results
>



-- 
Cheers

Jinmei

Build failed in Jenkins: Geode-nightly #748

Posted by Apache Jenkins Server <je...@builds.apache.org>.
See <https://builds.apache.org/job/Geode-nightly/748/changes>

Changes:

[klund] GEODE-2460: update dependency versions

[jiliao] GEODE-1716: refactor JMXMBeanDunitTest

[huynhja] GEODE-2475: Upgrade Lucene version to 6.4.1

[khowe] GEODE-2398: Retry oplog channel.write on silent failures

[khowe] GEODE-2398: Updates from review

------------------------------------------
[...truncated 874 lines...]
:geode-json:spotlessCheck
:geode-json:test UP-TO-DATE
:geode-json:check
:geode-json:build
:geode-json:distributedTest UP-TO-DATE
:geode-json:flakyTest UP-TO-DATE
:geode-json:integrationTest UP-TO-DATE
:geode-junit:javadoc
:geode-junit:javadocJar
:geode-junit:sourcesJar
:geode-junit:signArchives SKIPPED
:geode-junit:assemble
:geode-junit:compileTestJava
:geode-junit:processTestResources UP-TO-DATE
:geode-junit:testClasses
:geode-junit:checkMissedTests
:geode-junit:spotlessJavaCheck
:geode-junit:spotlessCheck
:geode-junit:test
:geode-junit:check
:geode-junit:build
:geode-junit:distributedTest
:geode-junit:flakyTest
:geode-junit:integrationTest
:geode-lucene:assemble
:geode-lucene:compileTestJava
Download https://repo1.maven.org/maven2/org/apache/lucene/lucene-test-framework/6.4.1/lucene-test-framework-6.4.1.pom
Download https://repo1.maven.org/maven2/org/apache/lucene/lucene-codecs/6.4.1/lucene-codecs-6.4.1.pom
Download https://repo1.maven.org/maven2/com/carrotsearch/randomizedtesting/randomizedtesting-runner/2.4.0/randomizedtesting-runner-2.4.0.pom
Download https://repo1.maven.org/maven2/com/carrotsearch/randomizedtesting/randomizedtesting-parent/2.4.0/randomizedtesting-parent-2.4.0.pom
Download https://repo1.maven.org/maven2/org/apache/lucene/lucene-test-framework/6.4.1/lucene-test-framework-6.4.1.jar
Download https://repo1.maven.org/maven2/org/apache/lucene/lucene-codecs/6.4.1/lucene-codecs-6.4.1.jar
Download https://repo1.maven.org/maven2/com/carrotsearch/randomizedtesting/randomizedtesting-runner/2.4.0/randomizedtesting-runner-2.4.0.jar
Note: Some input files use or override a deprecated API.
Note: Recompile with -Xlint:deprecation for details.
Note: Some input files use unchecked or unsafe operations.
Note: Recompile with -Xlint:unchecked for details.
:geode-lucene:processTestResources
:geode-lucene:testClasses
:geode-lucene:checkMissedTests
:geode-lucene:spotlessJavaCheck
:geode-lucene:spotlessCheck
:geode-lucene:test
:geode-lucene:check
:geode-lucene:build
:geode-lucene:distributedTest
:geode-lucene:flakyTest
:geode-lucene:integrationTest
:geode-old-client-support:assemble
:geode-old-client-support:compileTestJava
:geode-old-client-support:processTestResources UP-TO-DATE
:geode-old-client-support:testClasses
:geode-old-client-support:checkMissedTests
:geode-old-client-support:spotlessJavaCheck
:geode-old-client-support:spotlessCheck
:geode-old-client-support:test
:geode-old-client-support:check
:geode-old-client-support:build
:geode-old-client-support:distributedTest
:geode-old-client-support:flakyTest
:geode-old-client-support:integrationTest
:geode-old-versions:javadoc UP-TO-DATE
:geode-old-versions:javadocJar
:geode-old-versions:sourcesJar
:geode-old-versions:signArchives SKIPPED
:geode-old-versions:assemble
:geode-old-versions:compileTestJava UP-TO-DATE
:geode-old-versions:processTestResources UP-TO-DATE
:geode-old-versions:testClasses UP-TO-DATE
:geode-old-versions:checkMissedTests UP-TO-DATE
:geode-old-versions:spotlessJavaCheck
:geode-old-versions:spotlessCheck
:geode-old-versions:test UP-TO-DATE
:geode-old-versions:check
:geode-old-versions:build
:geode-old-versions:distributedTest UP-TO-DATE
:geode-old-versions:flakyTest UP-TO-DATE
:geode-old-versions:integrationTest UP-TO-DATE
:geode-pulse:assemble
:geode-pulse:compileTestJava
Download https://repo1.maven.org/maven2/com/codeborne/phantomjsdriver/1.3.0/phantomjsdriver-1.3.0.pom
Download https://repo1.maven.org/maven2/org/seleniumhq/selenium/selenium-api/3.0.1/selenium-api-3.0.1.pom
Download https://repo1.maven.org/maven2/org/seleniumhq/selenium/selenium-remote-driver/3.0.1/selenium-remote-driver-3.0.1.pom
Download https://repo1.maven.org/maven2/org/seleniumhq/selenium/selenium-support/3.0.1/selenium-support-3.0.1.pom
Download https://repo1.maven.org/maven2/org/apache/httpcomponents/httpmime/4.5.2/httpmime-4.5.2.pom
Download https://repo1.maven.org/maven2/cglib/cglib-nodep/3.2.4/cglib-nodep-3.2.4.pom
Download https://repo1.maven.org/maven2/com/codeborne/phantomjsdriver/1.3.0/phantomjsdriver-1.3.0.jar
Download https://repo1.maven.org/maven2/org/seleniumhq/selenium/selenium-api/3.0.1/selenium-api-3.0.1.jar
Download https://repo1.maven.org/maven2/org/seleniumhq/selenium/selenium-remote-driver/3.0.1/selenium-remote-driver-3.0.1.jar
Download https://repo1.maven.org/maven2/org/seleniumhq/selenium/selenium-support/3.0.1/selenium-support-3.0.1.jar
Download https://repo1.maven.org/maven2/org/apache/httpcomponents/httpmime/4.5.2/httpmime-4.5.2.jar
Download https://repo1.maven.org/maven2/cglib/cglib-nodep/3.2.4/cglib-nodep-3.2.4.jar
Note: <https://builds.apache.org/job/Geode-nightly/ws/geode-pulse/src/test/java/org/apache/geode/tools/pulse/tests/ui/PulseBase.java> uses or overrides a deprecated API.
Note: Recompile with -Xlint:deprecation for details.
Note: <https://builds.apache.org/job/Geode-nightly/ws/geode-pulse/src/test/java/org/apache/geode/tools/pulse/controllers/PulseControllerJUnitTest.java> uses unchecked or unsafe operations.
Note: Recompile with -Xlint:unchecked for details.
:geode-pulse:processTestResources
:geode-pulse:testClasses
:geode-pulse:checkMissedTests
Download https://repo1.maven.org/maven2/com/google/code/gson/gson/2.8.0/gson-2.8.0.pom
Download https://repo1.maven.org/maven2/com/google/code/gson/gson-parent/2.8.0/gson-parent-2.8.0.pom
Download https://repo1.maven.org/maven2/com/google/code/gson/gson/2.8.0/gson-2.8.0.jar
:geode-pulse:spotlessJavaCheck
:geode-pulse:spotlessCheck
:geode-pulse:test
:geode-pulse:check
:geode-pulse:build
:geode-pulse:distributedTest
:geode-pulse:flakyTest
:geode-pulse:integrationTest
:geode-rebalancer:assemble
:geode-rebalancer:compileTestJava
:geode-rebalancer:processTestResources UP-TO-DATE
:geode-rebalancer:testClasses
:geode-rebalancer:checkMissedTests
:geode-rebalancer:spotlessJavaCheck
:geode-rebalancer:spotlessCheck
:geode-rebalancer:test
:geode-rebalancer:check
:geode-rebalancer:build
:geode-rebalancer:distributedTest
:geode-rebalancer:flakyTest
:geode-rebalancer:integrationTest
:geode-wan:assemble
:geode-wan:compileTestJavaNote: Some input files use or override a deprecated API.
Note: Recompile with -Xlint:deprecation for details.
Note: Some input files use unchecked or unsafe operations.
Note: Recompile with -Xlint:unchecked for details.

:geode-wan:processTestResources
:geode-wan:testClasses
:geode-wan:checkMissedTests
:geode-wan:spotlessJavaCheck
:geode-wan:spotlessCheck
:geode-wan:test
:geode-wan:check
:geode-wan:build
:geode-wan:distributedTest
:geode-wan:flakyTest
:geode-wan:integrationTest
:geode-web:assemble
:geode-web:compileTestJavaNote: Some input files use or override a deprecated API.
Note: Recompile with -Xlint:deprecation for details.
Note: Some input files use unchecked or unsafe operations.
Note: Recompile with -Xlint:unchecked for details.

:geode-web:processTestResources UP-TO-DATE
:geode-web:testClasses
:geode-web:checkMissedTests
:geode-web:spotlessJavaCheck
:geode-web:spotlessCheck
:geode-web:test
:geode-web:check
:geode-web:build
:geode-web:distributedTest
:geode-web:flakyTest
:geode-web:integrationTest
:geode-web-api:assemble
:geode-web-api:compileTestJava
:geode-web-api:processTestResources UP-TO-DATE
:geode-web-api:testClasses
:geode-web-api:checkMissedTests
:geode-web-api:spotlessJavaCheck
:geode-web-api:spotlessCheck
:geode-web-api:test
:geode-web-api:check
:geode-web-api:build
:geode-web-api:distributedTest
:geode-web-api:flakyTest
:geode-web-api:integrationTest
:combineReports
All test reports at <https://builds.apache.org/job/Geode-nightly/ws/build/reports/combined>
:extensions/geode-modules:precheckin
:extensions/geode-modules-assembly:precheckin
:extensions/geode-modules-session:precheckin
:extensions/geode-modules-session-internal:precheckin
:extensions/geode-modules-tomcat7:precheckin
:extensions/geode-modules-tomcat8:precheckin
:geode-assembly:precheckin
:geode-benchmarks:precheckin
:geode-common:precheckin
:geode-cq:precheckin
:geode-json:precheckin
:geode-junit:precheckin
:geode-lucene:precheckin
:geode-old-client-support:precheckin
:geode-old-versions:precheckin
:geode-pulse:precheckin
:geode-rebalancer:precheckin
:geode-wan:precheckin
:geode-web:precheckin
:geode-web-api:precheckin
:compileJava UP-TO-DATE
:processResources UP-TO-DATE
:classes UP-TO-DATE
:jar
:uploadArchives
:extensions/geode-modules:uploadArchives
:extensions/geode-modules-assembly:uploadArchives SKIPPED
:extensions/geode-modules-session:uploadArchives
:extensions/geode-modules-session-internal:uploadArchives
:extensions/geode-modules-tomcat7:uploadArchives
:extensions/geode-modules-tomcat8:uploadArchives
:geode-assembly:uploadArchives SKIPPED
:geode-benchmarks:uploadArchives SKIPPED
:geode-common:uploadArchives
:geode-core:uploadArchives
:geode-cq:uploadArchives
:geode-json:uploadArchives
:geode-junit:uploadArchives
:geode-lucene:uploadArchives
:geode-old-client-support:uploadArchives
:geode-old-versions:uploadArchives SKIPPED
:geode-pulse:uploadArchives
:geode-rebalancer:uploadArchives
:geode-wan:uploadArchives
:geode-web:uploadArchives
:geode-web-api:uploadArchives

FAILURE: Build completed with 2 failures.

1: Task failed with an exception.
-----------
* What went wrong:
Execution failed for task ':geode-core:distributedTest'.
> There were failing tests. See the report at: file://<https://builds.apache.org/job/Geode-nightly/ws/geode-core/build/reports/distributedTest/index.html>

* Try:
Run with --stacktrace option to get the stack trace. Run with --info or --debug option to get more log output.
==============================================================================

2: Task failed with an exception.
-----------
* What went wrong:
Execution failed for task ':geode-core:integrationTest'.
> There were failing tests. See the report at: file://<https://builds.apache.org/job/Geode-nightly/ws/geode-core/build/reports/integrationTest/index.html>

* Try:
Run with --stacktrace option to get the stack trace. Run with --info or --debug option to get more log output.
==============================================================================

BUILD FAILED

Total time: 12 hrs 26 mins 23.605 secs
Build step 'Invoke Gradle script' changed build result to FAILURE
Build step 'Invoke Gradle script' marked build as failure
Archiving artifacts
Compressed 357.99 MB of artifacts by 28.6% relative to #746
Recording test results