You are viewing a plain text version of this content. The canonical link for it is here.
Posted to mapreduce-dev@hadoop.apache.org by Apache Jenkins Server <je...@builds.apache.org> on 2015/03/17 16:34:16 UTC
Hadoop-Mapreduce-trunk - Build # 2085 - Failure
See https://builds.apache.org/job/Hadoop-Mapreduce-trunk/2085/
###################################################################################
########################## LAST 60 LINES OF THE CONSOLE ###########################
[...truncated 31288 lines...]
[INFO] hadoop-mapreduce-client-core ...................... SUCCESS [01:51 min]
[INFO] hadoop-mapreduce-client-common .................... SUCCESS [ 28.728 s]
[INFO] hadoop-mapreduce-client-shuffle ................... SUCCESS [ 4.722 s]
[INFO] hadoop-mapreduce-client-app ....................... SUCCESS [10:09 min]
[INFO] hadoop-mapreduce-client-hs ........................ SUCCESS [05:35 min]
[INFO] hadoop-mapreduce-client-jobclient ................. FAILURE [ 01:49 h]
[INFO] hadoop-mapreduce-client-hs-plugins ................ SKIPPED
[INFO] hadoop-mapreduce-client-nativetask ................ SKIPPED
[INFO] Apache Hadoop MapReduce Examples .................. SKIPPED
[INFO] hadoop-mapreduce .................................. SKIPPED
[INFO] ------------------------------------------------------------------------
[INFO] BUILD FAILURE
[INFO] ------------------------------------------------------------------------
[INFO] Total time: 02:07 h
[INFO] Finished at: 2015-03-17T15:33:45+00:00
[INFO] Final Memory: 35M/724M
[INFO] ------------------------------------------------------------------------
[ERROR] Failed to execute goal org.apache.maven.plugins:maven-surefire-plugin:2.17:test (default-test) on project hadoop-mapreduce-client-jobclient: There was a timeout or other error in the fork -> [Help 1]
[ERROR]
[ERROR] To see the full stack trace of the errors, re-run Maven with the -e switch.
[ERROR] Re-run Maven using the -X switch to enable full debug logging.
[ERROR]
[ERROR] For more information about the errors and possible solutions, please read the following articles:
[ERROR] [Help 1] http://cwiki.apache.org/confluence/display/MAVEN/MojoFailureException
[ERROR]
[ERROR] After correcting the problems, you can resume the build with the command
[ERROR] mvn <goals> -rf :hadoop-mapreduce-client-jobclient
Build step 'Execute shell' marked build as failure
[FINDBUGS] Skipping publisher since build result is FAILURE
Archiving artifacts
Sending artifact delta relative to Hadoop-Mapreduce-trunk #2084
Archived 1 artifacts
Archive block size is 32768
Received 0 blocks and 20316430 bytes
Compression is 0.0%
Took 9.7 sec
Recording test results
Updating HDFS-7886
Updating MAPREDUCE-6105
Updating HADOOP-11638
Updating MAPREDUCE-6100
Updating HADOOP-11692
Updating HADOOP-11720
Updating MAPREDUCE-4653
Updating HDFS-5356
Updating HDFS-7838
Updating YARN-1453
Updating YARN-3197
Updating HADOOP-11714
Updating HADOOP-9477
Updating MAPREDUCE-4414
Updating YARN-3349
Updating YARN-2854
Updating MAPREDUCE-5755
Updating HADOOP-8059
Updating HDFS-2360
Updating YARN-3339
Email was triggered for: Failure
Sending email for trigger: Failure
###################################################################################
############################## FAILED TESTS (if any) ##############################
2 tests failed.
REGRESSION: org.apache.hadoop.mapred.TestReduceFetchFromPartialMem.testReduceFromPartialMem
Error Message:
Job failed!
Stack Trace:
java.io.IOException: Job failed!
at org.apache.hadoop.mapred.JobClient.runJob(JobClient.java:838)
at org.apache.hadoop.mapred.TestReduceFetchFromPartialMem.runJob(TestReduceFetchFromPartialMem.java:300)
at org.apache.hadoop.mapred.TestReduceFetchFromPartialMem.testReduceFromPartialMem(TestReduceFetchFromPartialMem.java:93)
REGRESSION: org.apache.hadoop.mapreduce.security.ssl.TestEncryptedShuffle.encryptedShuffleWithoutClientCerts
Error Message:
null
Stack Trace:
java.lang.AssertionError: null
at org.junit.Assert.fail(Assert.java:86)
at org.junit.Assert.assertTrue(Assert.java:41)
at org.junit.Assert.assertTrue(Assert.java:52)
at org.apache.hadoop.mapreduce.security.ssl.TestEncryptedShuffle.encryptedShuffleWithCerts(TestEncryptedShuffle.java:159)
at org.apache.hadoop.mapreduce.security.ssl.TestEncryptedShuffle.encryptedShuffleWithoutClientCerts(TestEncryptedShuffle.java:172)
Hadoop-Mapreduce-trunk - Build # 2089 - Still Failing
Posted by Apache Jenkins Server <je...@builds.apache.org>.
See https://builds.apache.org/job/Hadoop-Mapreduce-trunk/2089/
###################################################################################
########################## LAST 60 LINES OF THE CONSOLE ###########################
[...truncated 30945 lines...]
[INFO] ------------------------------------------------------------------------
[INFO] Reactor Summary:
[INFO]
[INFO] hadoop-mapreduce-client ........................... SUCCESS [ 2.721 s]
[INFO] hadoop-mapreduce-client-core ...................... SUCCESS [01:43 min]
[INFO] hadoop-mapreduce-client-common .................... SUCCESS [ 27.743 s]
[INFO] hadoop-mapreduce-client-shuffle ................... SUCCESS [ 4.762 s]
[INFO] hadoop-mapreduce-client-app ....................... SUCCESS [09:59 min]
[INFO] hadoop-mapreduce-client-hs ........................ FAILURE [05:49 min]
[INFO] hadoop-mapreduce-client-jobclient ................. SKIPPED
[INFO] hadoop-mapreduce-client-hs-plugins ................ SKIPPED
[INFO] hadoop-mapreduce-client-nativetask ................ SKIPPED
[INFO] Apache Hadoop MapReduce Examples .................. SKIPPED
[INFO] hadoop-mapreduce .................................. SKIPPED
[INFO] ------------------------------------------------------------------------
[INFO] BUILD FAILURE
[INFO] ------------------------------------------------------------------------
[INFO] Total time: 18:09 min
[INFO] Finished at: 2015-03-21T13:44:10+00:00
[INFO] Final Memory: 44M/652M
[INFO] ------------------------------------------------------------------------
[ERROR] Failed to execute goal org.apache.maven.plugins:maven-surefire-plugin:2.17:test (default-test) on project hadoop-mapreduce-client-hs: There are test failures.
[ERROR]
[ERROR] Please refer to /home/jenkins/jenkins-slave/workspace/Hadoop-Mapreduce-trunk/hadoop-mapreduce-project/hadoop-mapreduce-client/hadoop-mapreduce-client-hs/target/surefire-reports for the individual test results.
[ERROR] -> [Help 1]
[ERROR]
[ERROR] To see the full stack trace of the errors, re-run Maven with the -e switch.
[ERROR] Re-run Maven using the -X switch to enable full debug logging.
[ERROR]
[ERROR] For more information about the errors and possible solutions, please read the following articles:
[ERROR] [Help 1] http://cwiki.apache.org/confluence/display/MAVEN/MojoFailureException
[ERROR]
[ERROR] After correcting the problems, you can resume the build with the command
[ERROR] mvn <goals> -rf :hadoop-mapreduce-client-hs
Build step 'Execute shell' marked build as failure
[FINDBUGS] Skipping publisher since build result is FAILURE
Archiving artifacts
Sending artifact delta relative to Hadoop-Mapreduce-trunk #2084
Archived 1 artifacts
Archive block size is 32768
Received 0 blocks and 20324241 bytes
Compression is 0.0%
Took 9.3 sec
Recording test results
Updating YARN-3369
Updating HADOOP-11447
Updating YARN-3269
Updating MAPREDUCE-6282
Updating HDFS-7957
Updating YARN-3350
Updating HDFS-6841
Updating HDFS-7835
Updating HADOOP-11709
Updating YARN-2777
Updating YARN-3345
Updating HDFS-7829
Updating YARN-3356
Email was triggered for: Failure
Sending email for trigger: Failure
###################################################################################
############################## FAILED TESTS (if any) ##############################
1 tests failed.
REGRESSION: org.apache.hadoop.mapreduce.v2.hs.TestJobHistoryParsing.testPartialJob
Error Message:
test timed out after 3000 milliseconds
Stack Trace:
java.lang.Exception: test timed out after 3000 milliseconds
at java.net.PlainDatagramSocketImpl.receive0(Native Method)
at java.net.AbstractPlainDatagramSocketImpl.receive(AbstractPlainDatagramSocketImpl.java:145)
at java.net.DatagramSocket.receive(DatagramSocket.java:786)
at com.sun.jndi.dns.DnsClient.doUdpQuery(DnsClient.java:416)
at com.sun.jndi.dns.DnsClient.query(DnsClient.java:210)
at com.sun.jndi.dns.Resolver.query(Resolver.java:81)
at com.sun.jndi.dns.DnsContext.c_getAttributes(DnsContext.java:430)
at com.sun.jndi.toolkit.ctx.ComponentDirContext.p_getAttributes(ComponentDirContext.java:231)
at com.sun.jndi.toolkit.ctx.PartialCompositeDirContext.getAttributes(PartialCompositeDirContext.java:139)
at com.sun.jndi.toolkit.url.GenericURLDirContext.getAttributes(GenericURLDirContext.java:103)
at sun.security.krb5.KrbServiceLocator.getKerberosService(KrbServiceLocator.java:87)
at sun.security.krb5.Config.checkRealm(Config.java:1295)
at sun.security.krb5.Config.getRealmFromDNS(Config.java:1268)
at sun.security.krb5.Config.getDefaultRealm(Config.java:1162)
at sun.reflect.NativeMethodAccessorImpl.invoke0(Native Method)
at sun.reflect.NativeMethodAccessorImpl.invoke(NativeMethodAccessorImpl.java:57)
at sun.reflect.DelegatingMethodAccessorImpl.invoke(DelegatingMethodAccessorImpl.java:43)
at java.lang.reflect.Method.invoke(Method.java:606)
at org.apache.hadoop.security.authentication.util.KerberosUtil.getDefaultRealm(KerberosUtil.java:84)
at org.apache.hadoop.security.authentication.util.KerberosName.<clinit>(KerberosName.java:86)
at org.apache.hadoop.security.UserGroupInformation.initialize(UserGroupInformation.java:274)
at org.apache.hadoop.security.UserGroupInformation.ensureInitialized(UserGroupInformation.java:261)
at org.apache.hadoop.security.UserGroupInformation.loginUserFromSubject(UserGroupInformation.java:802)
at org.apache.hadoop.security.UserGroupInformation.getLoginUser(UserGroupInformation.java:772)
at org.apache.hadoop.security.UserGroupInformation.getCurrentUser(UserGroupInformation.java:645)
at org.apache.hadoop.mapreduce.v2.hs.TestJobHistoryParsing.testPartialJob(TestJobHistoryParsing.java:829)
Hadoop-Mapreduce-trunk - Build # 2088 - Still Failing
Posted by Apache Jenkins Server <je...@builds.apache.org>.
See https://builds.apache.org/job/Hadoop-Mapreduce-trunk/2088/
###################################################################################
########################## LAST 60 LINES OF THE CONSOLE ###########################
[...truncated 31269 lines...]
TestMRTimelineEventHandling.testMapreduceJobTimelineServiceEnabled:146 ยป IO Jo...
Tests run: 524, Failures: 0, Errors: 1, Skipped: 11
[INFO] ------------------------------------------------------------------------
[INFO] Reactor Summary:
[INFO]
[INFO] hadoop-mapreduce-client ........................... SUCCESS [ 2.821 s]
[INFO] hadoop-mapreduce-client-core ...................... SUCCESS [01:41 min]
[INFO] hadoop-mapreduce-client-common .................... SUCCESS [ 30.102 s]
[INFO] hadoop-mapreduce-client-shuffle ................... SUCCESS [ 4.665 s]
[INFO] hadoop-mapreduce-client-app ....................... SUCCESS [10:07 min]
[INFO] hadoop-mapreduce-client-hs ........................ SUCCESS [05:52 min]
[INFO] hadoop-mapreduce-client-jobclient ................. FAILURE [ 01:41 h]
[INFO] hadoop-mapreduce-client-hs-plugins ................ SKIPPED
[INFO] hadoop-mapreduce-client-nativetask ................ SKIPPED
[INFO] Apache Hadoop MapReduce Examples .................. SKIPPED
[INFO] hadoop-mapreduce .................................. SKIPPED
[INFO] ------------------------------------------------------------------------
[INFO] BUILD FAILURE
[INFO] ------------------------------------------------------------------------
[INFO] Total time: 01:59 h
[INFO] Finished at: 2015-03-20T15:26:53+00:00
[INFO] Final Memory: 33M/623M
[INFO] ------------------------------------------------------------------------
[ERROR] Failed to execute goal org.apache.maven.plugins:maven-surefire-plugin:2.17:test (default-test) on project hadoop-mapreduce-client-jobclient: There are test failures.
[ERROR]
[ERROR] Please refer to /home/jenkins/jenkins-slave/workspace/Hadoop-Mapreduce-trunk/hadoop-mapreduce-project/hadoop-mapreduce-client/hadoop-mapreduce-client-jobclient/target/surefire-reports for the individual test results.
[ERROR] -> [Help 1]
[ERROR]
[ERROR] To see the full stack trace of the errors, re-run Maven with the -e switch.
[ERROR] Re-run Maven using the -X switch to enable full debug logging.
[ERROR]
[ERROR] For more information about the errors and possible solutions, please read the following articles:
[ERROR] [Help 1] http://cwiki.apache.org/confluence/display/MAVEN/MojoFailureException
[ERROR]
[ERROR] After correcting the problems, you can resume the build with the command
[ERROR] mvn <goals> -rf :hadoop-mapreduce-client-jobclient
Build step 'Execute shell' marked build as failure
[FINDBUGS] Skipping publisher since build result is FAILURE
Archiving artifacts
Sending artifact delta relative to Hadoop-Mapreduce-trunk #2084
Archived 1 artifacts
Archive block size is 32768
Received 0 blocks and 20323666 bytes
Compression is 0.0%
Took 11 sec
Recording test results
Updating HADOOP-11729
Updating MAPREDUCE-4424
Updating YARN-3379
Updating HDFS-7962
Updating MAPREDUCE-6275
Updating HDFS-7930
Updating HDFS-7816
Updating MAPREDUCE-6281
Updating HDFS-7932
Email was triggered for: Failure
Sending email for trigger: Failure
###################################################################################
############################## FAILED TESTS (if any) ##############################
1 tests failed.
REGRESSION: org.apache.hadoop.mapred.TestMRTimelineEventHandling.testMapreduceJobTimelineServiceEnabled
Error Message:
Job didn't finish in 30 seconds
Stack Trace:
java.io.IOException: Job didn't finish in 30 seconds
at org.apache.hadoop.mapred.UtilsForTests.runJobSucceed(UtilsForTests.java:622)
at org.apache.hadoop.mapred.TestMRTimelineEventHandling.testMapreduceJobTimelineServiceEnabled(TestMRTimelineEventHandling.java:146)
Hadoop-Mapreduce-trunk - Build # 2087 - Still Failing
Posted by Apache Jenkins Server <je...@builds.apache.org>.
See https://builds.apache.org/job/Hadoop-Mapreduce-trunk/2087/
###################################################################################
########################## LAST 60 LINES OF THE CONSOLE ###########################
[...truncated 31571 lines...]
[INFO] hadoop-mapreduce-client-shuffle ................... SUCCESS [ 5.072 s]
[INFO] hadoop-mapreduce-client-app ....................... SUCCESS [12:14 min]
[INFO] hadoop-mapreduce-client-hs ........................ SUCCESS [06:27 min]
[INFO] hadoop-mapreduce-client-jobclient ................. FAILURE [ 01:34 h]
[INFO] hadoop-mapreduce-client-hs-plugins ................ SKIPPED
[INFO] hadoop-mapreduce-client-nativetask ................ SKIPPED
[INFO] Apache Hadoop MapReduce Examples .................. SKIPPED
[INFO] hadoop-mapreduce .................................. SKIPPED
[INFO] ------------------------------------------------------------------------
[INFO] BUILD FAILURE
[INFO] ------------------------------------------------------------------------
[INFO] Total time: 01:56 h
[INFO] Finished at: 2015-03-19T15:22:38+00:00
[INFO] Final Memory: 42M/1017M
[INFO] ------------------------------------------------------------------------
[ERROR] Failed to execute goal org.apache.maven.plugins:maven-surefire-plugin:2.17:test (default-test) on project hadoop-mapreduce-client-jobclient: There are test failures.
[ERROR]
[ERROR] Please refer to /home/jenkins/jenkins-slave/workspace/Hadoop-Mapreduce-trunk/hadoop-mapreduce-project/hadoop-mapreduce-client/hadoop-mapreduce-client-jobclient/target/surefire-reports for the individual test results.
[ERROR] -> [Help 1]
[ERROR]
[ERROR] To see the full stack trace of the errors, re-run Maven with the -e switch.
[ERROR] Re-run Maven using the -X switch to enable full debug logging.
[ERROR]
[ERROR] For more information about the errors and possible solutions, please read the following articles:
[ERROR] [Help 1] http://cwiki.apache.org/confluence/display/MAVEN/MojoFailureException
[ERROR]
[ERROR] After correcting the problems, you can resume the build with the command
[ERROR] mvn <goals> -rf :hadoop-mapreduce-client-jobclient
Build step 'Execute shell' marked build as failure
[FINDBUGS] Skipping publisher since build result is FAILURE
Archiving artifacts
Sending artifact delta relative to Hadoop-Mapreduce-trunk #2084
Archived 1 artifacts
Archive block size is 32768
Received 0 blocks and 20319740 bytes
Compression is 0.0%
Took 8.6 sec
Recording test results
Updating HDFS-7929
Updating HDFS-7948
Updating HDFS-7953
Updating HDFS-7951
Updating HDFS-7950
Updating HDFS-7914
Updating HADOOP-10703
Updating MAPREDUCE-6277
Updating HDFS-7054
Updating HDFS-7943
Updating HADOOP-9329
Updating HDFS-7945
Updating HDFS-7869
Updating HDFS-7722
Updating YARN-3351
Updating HDFS-7587
Updating HDFS-7697
Updating HDFS-7867
Updating YARN-3357
Email was triggered for: Failure
Sending email for trigger: Failure
###################################################################################
############################## FAILED TESTS (if any) ##############################
14 tests failed.
REGRESSION: org.apache.hadoop.mapreduce.security.TestJHSSecurity.testDelegationToken
Error Message:
org/apache/hadoop/service/ServiceOperations
Stack Trace:
java.lang.NoClassDefFoundError: org/apache/hadoop/service/ServiceOperations
at java.net.URLClassLoader$1.run(URLClassLoader.java:366)
at java.net.URLClassLoader$1.run(URLClassLoader.java:355)
at java.security.AccessController.doPrivileged(Native Method)
at java.net.URLClassLoader.findClass(URLClassLoader.java:354)
at java.lang.ClassLoader.loadClass(ClassLoader.java:425)
at sun.misc.Launcher$AppClassLoader.loadClass(Launcher.java:308)
at java.lang.ClassLoader.loadClass(ClassLoader.java:358)
at org.apache.hadoop.service.CompositeService.stop(CompositeService.java:157)
at org.apache.hadoop.service.CompositeService.serviceStop(CompositeService.java:131)
at org.apache.hadoop.mapreduce.v2.hs.JobHistoryServer.serviceStop(JobHistoryServer.java:201)
at org.apache.hadoop.service.AbstractService.stop(AbstractService.java:221)
at org.apache.hadoop.mapreduce.security.TestJHSSecurity.testDelegationToken(TestJHSSecurity.java:225)
REGRESSION: org.apache.hadoop.mapreduce.security.TestMRCredentials.test
Error Message:
org/apache/hadoop/hdfs/DistributedFileSystem$21
Stack Trace:
java.lang.NoClassDefFoundError: org/apache/hadoop/hdfs/DistributedFileSystem$21
at java.net.URLClassLoader$1.run(URLClassLoader.java:366)
at java.net.URLClassLoader$1.run(URLClassLoader.java:355)
at java.security.AccessController.doPrivileged(Native Method)
at java.net.URLClassLoader.findClass(URLClassLoader.java:354)
at java.lang.ClassLoader.loadClass(ClassLoader.java:425)
at sun.misc.Launcher$AppClassLoader.loadClass(Launcher.java:308)
at java.lang.ClassLoader.loadClass(ClassLoader.java:358)
at org.apache.hadoop.hdfs.DistributedFileSystem.mkdirsInternal(DistributedFileSystem.java:1043)
at org.apache.hadoop.hdfs.DistributedFileSystem.mkdirs(DistributedFileSystem.java:1036)
at org.apache.hadoop.mapreduce.JobSubmissionFiles.getStagingDir(JobSubmissionFiles.java:133)
at org.apache.hadoop.mapreduce.JobSubmitter.submitJobInternal(JobSubmitter.java:148)
at org.apache.hadoop.mapreduce.Job$10.run(Job.java:1290)
at org.apache.hadoop.mapreduce.Job$10.run(Job.java:1287)
at java.security.AccessController.doPrivileged(Native Method)
at javax.security.auth.Subject.doAs(Subject.java:415)
at org.apache.hadoop.security.UserGroupInformation.doAs(UserGroupInformation.java:1669)
at org.apache.hadoop.mapreduce.Job.submit(Job.java:1287)
at org.apache.hadoop.mapreduce.Job.waitForCompletion(Job.java:1308)
at org.apache.hadoop.mapreduce.security.CredentialsTestJob.run(CredentialsTestJob.java:139)
at org.apache.hadoop.util.ToolRunner.run(ToolRunner.java:70)
at org.apache.hadoop.mapreduce.security.TestMRCredentials.test(TestMRCredentials.java:129)
FAILED: org.apache.hadoop.mapreduce.security.TestMRCredentials.org.apache.hadoop.mapreduce.security.TestMRCredentials
Error Message:
org/apache/hadoop/hdfs/server/namenode/JournalSet$5
Stack Trace:
java.lang.NoClassDefFoundError: org/apache/hadoop/hdfs/server/namenode/JournalSet$5
at org.apache.hadoop.hdfs.server.namenode.JournalSet.close(JournalSet.java:243)
at org.apache.hadoop.hdfs.server.namenode.FSEditLog.close(FSEditLog.java:368)
at org.apache.hadoop.hdfs.server.namenode.FSNamesystem.stopActiveServices(FSNamesystem.java:1217)
at org.apache.hadoop.hdfs.server.namenode.FSNamesystem.close(FSNamesystem.java:1548)
at org.apache.hadoop.hdfs.server.namenode.NameNode.stopCommonServices(NameNode.java:704)
at org.apache.hadoop.hdfs.server.namenode.NameNode.stop(NameNode.java:870)
at org.apache.hadoop.hdfs.MiniDFSCluster.shutdown(MiniDFSCluster.java:1742)
at org.apache.hadoop.hdfs.MiniDFSCluster.shutdown(MiniDFSCluster.java:1711)
at org.apache.hadoop.hdfs.MiniDFSCluster.shutdown(MiniDFSCluster.java:1704)
at org.apache.hadoop.mapreduce.security.TestMRCredentials.tearDown(TestMRCredentials.java:75)
REGRESSION: org.apache.hadoop.mapreduce.v2.TestMRJobs.testDistributedCache
Error Message:
org/apache/hadoop/yarn/client/ClientRMProxy
Stack Trace:
java.lang.NoClassDefFoundError: org/apache/hadoop/yarn/client/ClientRMProxy
at java.net.URLClassLoader$1.run(URLClassLoader.java:366)
at java.net.URLClassLoader$1.run(URLClassLoader.java:355)
at java.security.AccessController.doPrivileged(Native Method)
at java.net.URLClassLoader.findClass(URLClassLoader.java:354)
at java.lang.ClassLoader.loadClass(ClassLoader.java:425)
at sun.misc.Launcher$AppClassLoader.loadClass(Launcher.java:308)
at java.lang.ClassLoader.loadClass(ClassLoader.java:358)
at org.apache.hadoop.yarn.client.api.impl.YarnClientImpl.serviceStart(YarnClientImpl.java:187)
at org.apache.hadoop.service.AbstractService.start(AbstractService.java:193)
at org.apache.hadoop.mapred.ResourceMgrDelegate.serviceStart(ResourceMgrDelegate.java:108)
at org.apache.hadoop.service.AbstractService.start(AbstractService.java:193)
at org.apache.hadoop.mapred.ResourceMgrDelegate.<init>(ResourceMgrDelegate.java:97)
at org.apache.hadoop.mapred.YARNRunner.<init>(YARNRunner.java:112)
at org.apache.hadoop.mapred.YarnClientProtocolProvider.create(YarnClientProtocolProvider.java:34)
at org.apache.hadoop.mapreduce.Cluster.initialize(Cluster.java:95)
at org.apache.hadoop.mapreduce.Cluster.<init>(Cluster.java:82)
at org.apache.hadoop.mapreduce.Cluster.<init>(Cluster.java:75)
at org.apache.hadoop.mapreduce.Job$9.run(Job.java:1260)
at org.apache.hadoop.mapreduce.Job$9.run(Job.java:1256)
at java.security.AccessController.doPrivileged(Native Method)
at javax.security.auth.Subject.doAs(Subject.java:415)
at org.apache.hadoop.security.UserGroupInformation.doAs(UserGroupInformation.java:1669)
at org.apache.hadoop.mapreduce.Job.connect(Job.java:1255)
at org.apache.hadoop.mapreduce.Job.submit(Job.java:1284)
at org.apache.hadoop.mapreduce.v2.TestMRJobs._testDistributedCache(TestMRJobs.java:903)
at org.apache.hadoop.mapreduce.v2.TestMRJobs.testDistributedCache(TestMRJobs.java:916)
REGRESSION: org.apache.hadoop.mapreduce.v2.TestMRJobs.testSleepJobWithRemoteJar
Error Message:
org/apache/hadoop/yarn/client/ClientRMProxy
Stack Trace:
java.lang.NoClassDefFoundError: org/apache/hadoop/yarn/client/ClientRMProxy
at org.apache.hadoop.yarn.client.api.impl.YarnClientImpl.serviceStart(YarnClientImpl.java:187)
at org.apache.hadoop.service.AbstractService.start(AbstractService.java:193)
at org.apache.hadoop.mapred.ResourceMgrDelegate.serviceStart(ResourceMgrDelegate.java:108)
at org.apache.hadoop.service.AbstractService.start(AbstractService.java:193)
at org.apache.hadoop.mapred.ResourceMgrDelegate.<init>(ResourceMgrDelegate.java:97)
at org.apache.hadoop.mapred.YARNRunner.<init>(YARNRunner.java:112)
at org.apache.hadoop.mapred.YarnClientProtocolProvider.create(YarnClientProtocolProvider.java:34)
at org.apache.hadoop.mapreduce.Cluster.initialize(Cluster.java:95)
at org.apache.hadoop.mapreduce.Cluster.<init>(Cluster.java:82)
at org.apache.hadoop.mapreduce.Cluster.<init>(Cluster.java:75)
at org.apache.hadoop.mapreduce.Job$9.run(Job.java:1260)
at org.apache.hadoop.mapreduce.Job$9.run(Job.java:1256)
at java.security.AccessController.doPrivileged(Native Method)
at javax.security.auth.Subject.doAs(Subject.java:415)
at org.apache.hadoop.security.UserGroupInformation.doAs(UserGroupInformation.java:1669)
at org.apache.hadoop.mapreduce.Job.connect(Job.java:1255)
at org.apache.hadoop.mapreduce.Job.submit(Job.java:1284)
at org.apache.hadoop.mapreduce.v2.TestMRJobs.testSleepJobInternal(TestMRJobs.java:229)
at org.apache.hadoop.mapreduce.v2.TestMRJobs.testSleepJobWithRemoteJar(TestMRJobs.java:196)
REGRESSION: org.apache.hadoop.mapreduce.v2.TestMRJobs.testConfVerificationWithJobClient
Error Message:
org/apache/hadoop/yarn/client/ClientRMProxy
Stack Trace:
java.lang.NoClassDefFoundError: org/apache/hadoop/yarn/client/ClientRMProxy
at org.apache.hadoop.yarn.client.api.impl.YarnClientImpl.serviceStart(YarnClientImpl.java:187)
at org.apache.hadoop.service.AbstractService.start(AbstractService.java:193)
at org.apache.hadoop.mapred.ResourceMgrDelegate.serviceStart(ResourceMgrDelegate.java:108)
at org.apache.hadoop.service.AbstractService.start(AbstractService.java:193)
at org.apache.hadoop.mapred.ResourceMgrDelegate.<init>(ResourceMgrDelegate.java:97)
at org.apache.hadoop.mapred.YARNRunner.<init>(YARNRunner.java:112)
at org.apache.hadoop.mapred.YarnClientProtocolProvider.create(YarnClientProtocolProvider.java:34)
at org.apache.hadoop.mapreduce.Cluster.initialize(Cluster.java:95)
at org.apache.hadoop.mapreduce.Cluster.<init>(Cluster.java:82)
at org.apache.hadoop.mapreduce.Cluster.<init>(Cluster.java:75)
at org.apache.hadoop.mapred.JobClient.init(JobClient.java:470)
at org.apache.hadoop.mapred.JobClient.<init>(JobClient.java:460)
at org.apache.hadoop.mapreduce.v2.TestMRJobs.testConfVerification(TestMRJobs.java:292)
at org.apache.hadoop.mapreduce.v2.TestMRJobs.testConfVerificationWithJobClient(TestMRJobs.java:263)
REGRESSION: org.apache.hadoop.mapreduce.v2.TestMRJobs.testFailingMapper
Error Message:
org/apache/hadoop/yarn/client/ClientRMProxy
Stack Trace:
java.lang.NoClassDefFoundError: org/apache/hadoop/yarn/client/ClientRMProxy
at org.apache.hadoop.yarn.client.api.impl.YarnClientImpl.serviceStart(YarnClientImpl.java:187)
at org.apache.hadoop.service.AbstractService.start(AbstractService.java:193)
at org.apache.hadoop.mapred.ResourceMgrDelegate.serviceStart(ResourceMgrDelegate.java:108)
at org.apache.hadoop.service.AbstractService.start(AbstractService.java:193)
at org.apache.hadoop.mapred.ResourceMgrDelegate.<init>(ResourceMgrDelegate.java:97)
at org.apache.hadoop.mapred.YARNRunner.<init>(YARNRunner.java:112)
at org.apache.hadoop.mapred.YarnClientProtocolProvider.create(YarnClientProtocolProvider.java:34)
at org.apache.hadoop.mapreduce.Cluster.initialize(Cluster.java:95)
at org.apache.hadoop.mapreduce.Cluster.<init>(Cluster.java:82)
at org.apache.hadoop.mapreduce.Cluster.<init>(Cluster.java:75)
at org.apache.hadoop.mapreduce.Job$9.run(Job.java:1260)
at org.apache.hadoop.mapreduce.Job$9.run(Job.java:1256)
at java.security.AccessController.doPrivileged(Native Method)
at javax.security.auth.Subject.doAs(Subject.java:415)
at org.apache.hadoop.security.UserGroupInformation.doAs(UserGroupInformation.java:1669)
at org.apache.hadoop.mapreduce.Job.connect(Job.java:1255)
at org.apache.hadoop.mapreduce.Job.submit(Job.java:1284)
at org.apache.hadoop.mapreduce.v2.TestMRJobs.runFailingMapperJob(TestMRJobs.java:564)
at org.apache.hadoop.mapreduce.v2.TestMRJobs.testFailingMapper(TestMRJobs.java:505)
REGRESSION: org.apache.hadoop.mapreduce.v2.TestMRJobs.testConfVerificationWithClassloaderCustomClasses
Error Message:
org/apache/hadoop/yarn/client/ClientRMProxy
Stack Trace:
java.lang.NoClassDefFoundError: org/apache/hadoop/yarn/client/ClientRMProxy
at org.apache.hadoop.yarn.client.api.impl.YarnClientImpl.serviceStart(YarnClientImpl.java:187)
at org.apache.hadoop.service.AbstractService.start(AbstractService.java:193)
at org.apache.hadoop.mapred.ResourceMgrDelegate.serviceStart(ResourceMgrDelegate.java:108)
at org.apache.hadoop.service.AbstractService.start(AbstractService.java:193)
at org.apache.hadoop.mapred.ResourceMgrDelegate.<init>(ResourceMgrDelegate.java:97)
at org.apache.hadoop.mapred.YARNRunner.<init>(YARNRunner.java:112)
at org.apache.hadoop.mapred.YarnClientProtocolProvider.create(YarnClientProtocolProvider.java:34)
at org.apache.hadoop.mapreduce.Cluster.initialize(Cluster.java:95)
at org.apache.hadoop.mapreduce.Cluster.<init>(Cluster.java:82)
at org.apache.hadoop.mapreduce.Cluster.<init>(Cluster.java:75)
at org.apache.hadoop.mapred.JobClient.init(JobClient.java:470)
at org.apache.hadoop.mapred.JobClient.<init>(JobClient.java:460)
at org.apache.hadoop.mapreduce.v2.TestMRJobs.testConfVerification(TestMRJobs.java:292)
at org.apache.hadoop.mapreduce.v2.TestMRJobs.testConfVerificationWithClassloaderCustomClasses(TestMRJobs.java:253)
REGRESSION: org.apache.hadoop.mapreduce.v2.TestMRJobs.testSleepJob
Error Message:
org/apache/hadoop/yarn/client/ClientRMProxy
Stack Trace:
java.lang.NoClassDefFoundError: org/apache/hadoop/yarn/client/ClientRMProxy
at org.apache.hadoop.yarn.client.api.impl.YarnClientImpl.serviceStart(YarnClientImpl.java:187)
at org.apache.hadoop.service.AbstractService.start(AbstractService.java:193)
at org.apache.hadoop.mapred.ResourceMgrDelegate.serviceStart(ResourceMgrDelegate.java:108)
at org.apache.hadoop.service.AbstractService.start(AbstractService.java:193)
at org.apache.hadoop.mapred.ResourceMgrDelegate.<init>(ResourceMgrDelegate.java:97)
at org.apache.hadoop.mapred.YARNRunner.<init>(YARNRunner.java:112)
at org.apache.hadoop.mapred.YarnClientProtocolProvider.create(YarnClientProtocolProvider.java:34)
at org.apache.hadoop.mapreduce.Cluster.initialize(Cluster.java:95)
at org.apache.hadoop.mapreduce.Cluster.<init>(Cluster.java:82)
at org.apache.hadoop.mapreduce.Cluster.<init>(Cluster.java:75)
at org.apache.hadoop.mapreduce.Job$9.run(Job.java:1260)
at org.apache.hadoop.mapreduce.Job$9.run(Job.java:1256)
at java.security.AccessController.doPrivileged(Native Method)
at javax.security.auth.Subject.doAs(Subject.java:415)
at org.apache.hadoop.security.UserGroupInformation.doAs(UserGroupInformation.java:1669)
at org.apache.hadoop.mapreduce.Job.connect(Job.java:1255)
at org.apache.hadoop.mapreduce.Job.submit(Job.java:1284)
at org.apache.hadoop.mapreduce.v2.TestMRJobs.testSleepJobInternal(TestMRJobs.java:229)
at org.apache.hadoop.mapreduce.v2.TestMRJobs.testSleepJob(TestMRJobs.java:191)
REGRESSION: org.apache.hadoop.mapreduce.v2.TestMRJobs.testConfVerificationWithOutClassloader
Error Message:
org/apache/hadoop/yarn/client/ClientRMProxy
Stack Trace:
java.lang.NoClassDefFoundError: org/apache/hadoop/yarn/client/ClientRMProxy
at org.apache.hadoop.yarn.client.api.impl.YarnClientImpl.serviceStart(YarnClientImpl.java:187)
at org.apache.hadoop.service.AbstractService.start(AbstractService.java:193)
at org.apache.hadoop.mapred.ResourceMgrDelegate.serviceStart(ResourceMgrDelegate.java:108)
at org.apache.hadoop.service.AbstractService.start(AbstractService.java:193)
at org.apache.hadoop.mapred.ResourceMgrDelegate.<init>(ResourceMgrDelegate.java:97)
at org.apache.hadoop.mapred.YARNRunner.<init>(YARNRunner.java:112)
at org.apache.hadoop.mapred.YarnClientProtocolProvider.create(YarnClientProtocolProvider.java:34)
at org.apache.hadoop.mapreduce.Cluster.initialize(Cluster.java:95)
at org.apache.hadoop.mapreduce.Cluster.<init>(Cluster.java:82)
at org.apache.hadoop.mapreduce.Cluster.<init>(Cluster.java:75)
at org.apache.hadoop.mapred.JobClient.init(JobClient.java:470)
at org.apache.hadoop.mapred.JobClient.<init>(JobClient.java:460)
at org.apache.hadoop.mapreduce.v2.TestMRJobs.testConfVerification(TestMRJobs.java:292)
at org.apache.hadoop.mapreduce.v2.TestMRJobs.testConfVerificationWithOutClassloader(TestMRJobs.java:258)
REGRESSION: org.apache.hadoop.mapreduce.v2.TestMRJobs.testRandomWriter
Error Message:
org/apache/hadoop/yarn/client/ClientRMProxy
Stack Trace:
java.lang.NoClassDefFoundError: org/apache/hadoop/yarn/client/ClientRMProxy
at org.apache.hadoop.yarn.client.api.impl.YarnClientImpl.serviceStart(YarnClientImpl.java:187)
at org.apache.hadoop.service.AbstractService.start(AbstractService.java:193)
at org.apache.hadoop.mapred.ResourceMgrDelegate.serviceStart(ResourceMgrDelegate.java:108)
at org.apache.hadoop.service.AbstractService.start(AbstractService.java:193)
at org.apache.hadoop.mapred.ResourceMgrDelegate.<init>(ResourceMgrDelegate.java:97)
at org.apache.hadoop.mapred.YARNRunner.<init>(YARNRunner.java:112)
at org.apache.hadoop.mapred.YarnClientProtocolProvider.create(YarnClientProtocolProvider.java:34)
at org.apache.hadoop.mapreduce.Cluster.initialize(Cluster.java:95)
at org.apache.hadoop.mapreduce.Cluster.<init>(Cluster.java:82)
at org.apache.hadoop.mapreduce.Cluster.<init>(Cluster.java:75)
at org.apache.hadoop.mapreduce.Job$9.run(Job.java:1260)
at org.apache.hadoop.mapreduce.Job$9.run(Job.java:1256)
at java.security.AccessController.doPrivileged(Native Method)
at javax.security.auth.Subject.doAs(Subject.java:415)
at org.apache.hadoop.security.UserGroupInformation.doAs(UserGroupInformation.java:1669)
at org.apache.hadoop.mapreduce.Job.connect(Job.java:1255)
at org.apache.hadoop.mapreduce.Job.submit(Job.java:1284)
at org.apache.hadoop.mapreduce.v2.TestMRJobs.testRandomWriter(TestMRJobs.java:452)
REGRESSION: org.apache.hadoop.mapreduce.v2.TestMRJobs.testContainerRollingLog
Error Message:
org/apache/hadoop/yarn/client/ClientRMProxy
Stack Trace:
java.lang.NoClassDefFoundError: org/apache/hadoop/yarn/client/ClientRMProxy
at org.apache.hadoop.yarn.client.api.impl.YarnClientImpl.serviceStart(YarnClientImpl.java:187)
at org.apache.hadoop.service.AbstractService.start(AbstractService.java:193)
at org.apache.hadoop.mapred.ResourceMgrDelegate.serviceStart(ResourceMgrDelegate.java:108)
at org.apache.hadoop.service.AbstractService.start(AbstractService.java:193)
at org.apache.hadoop.mapred.ResourceMgrDelegate.<init>(ResourceMgrDelegate.java:97)
at org.apache.hadoop.mapred.YARNRunner.<init>(YARNRunner.java:112)
at org.apache.hadoop.mapred.YarnClientProtocolProvider.create(YarnClientProtocolProvider.java:34)
at org.apache.hadoop.mapreduce.Cluster.initialize(Cluster.java:95)
at org.apache.hadoop.mapreduce.Cluster.<init>(Cluster.java:82)
at org.apache.hadoop.mapreduce.Cluster.<init>(Cluster.java:75)
at org.apache.hadoop.mapreduce.Job$9.run(Job.java:1260)
at org.apache.hadoop.mapreduce.Job$9.run(Job.java:1256)
at java.security.AccessController.doPrivileged(Native Method)
at javax.security.auth.Subject.doAs(Subject.java:415)
at org.apache.hadoop.security.UserGroupInformation.doAs(UserGroupInformation.java:1669)
at org.apache.hadoop.mapreduce.Job.connect(Job.java:1255)
at org.apache.hadoop.mapreduce.Job.submit(Job.java:1284)
at org.apache.hadoop.mapreduce.Job.waitForCompletion(Job.java:1308)
at org.apache.hadoop.mapreduce.v2.TestMRJobs.testContainerRollingLog(TestMRJobs.java:652)
REGRESSION: org.apache.hadoop.mapreduce.v2.TestMRJobs.testConfVerificationWithJobClientLocal
Error Message:
org/apache/hadoop/yarn/util/Apps
Stack Trace:
java.lang.NoClassDefFoundError: org/apache/hadoop/yarn/util/Apps
at java.net.URLClassLoader$1.run(URLClassLoader.java:366)
at java.net.URLClassLoader$1.run(URLClassLoader.java:355)
at java.security.AccessController.doPrivileged(Native Method)
at java.net.URLClassLoader.findClass(URLClassLoader.java:354)
at java.lang.ClassLoader.loadClass(ClassLoader.java:425)
at sun.misc.Launcher$AppClassLoader.loadClass(Launcher.java:308)
at java.lang.ClassLoader.loadClass(ClassLoader.java:358)
at java.lang.ClassLoader.defineClass1(Native Method)
at java.lang.ClassLoader.defineClass(ClassLoader.java:800)
at java.security.SecureClassLoader.defineClass(SecureClassLoader.java:142)
at java.net.URLClassLoader.defineClass(URLClassLoader.java:449)
at java.net.URLClassLoader.access$100(URLClassLoader.java:71)
at java.net.URLClassLoader$1.run(URLClassLoader.java:361)
at java.net.URLClassLoader$1.run(URLClassLoader.java:355)
at java.security.AccessController.doPrivileged(Native Method)
at java.net.URLClassLoader.findClass(URLClassLoader.java:354)
at java.lang.ClassLoader.loadClass(ClassLoader.java:425)
at sun.misc.Launcher$AppClassLoader.loadClass(Launcher.java:308)
at java.lang.ClassLoader.loadClass(ClassLoader.java:358)
at org.apache.hadoop.mapred.LocalDistributedCacheManager.setup(LocalDistributedCacheManager.java:93)
at org.apache.hadoop.mapred.LocalJobRunner$Job.<init>(LocalJobRunner.java:164)
at org.apache.hadoop.mapred.LocalJobRunner.submitJob(LocalJobRunner.java:759)
at org.apache.hadoop.mapreduce.JobSubmitter.submitJobInternal(JobSubmitter.java:245)
at org.apache.hadoop.mapreduce.Job$10.run(Job.java:1290)
at org.apache.hadoop.mapreduce.Job$10.run(Job.java:1287)
at java.security.AccessController.doPrivileged(Native Method)
at javax.security.auth.Subject.doAs(Subject.java:415)
at org.apache.hadoop.security.UserGroupInformation.doAs(UserGroupInformation.java:1669)
at org.apache.hadoop.mapreduce.Job.submit(Job.java:1287)
at org.apache.hadoop.mapreduce.v2.TestMRJobs.testConfVerification(TestMRJobs.java:332)
at org.apache.hadoop.mapreduce.v2.TestMRJobs.testConfVerificationWithJobClientLocal(TestMRJobs.java:268)
REGRESSION: org.apache.hadoop.mapreduce.v2.TestMRJobs.testConfVerificationWithClassloader
Error Message:
org/apache/hadoop/yarn/client/ClientRMProxy
Stack Trace:
java.lang.NoClassDefFoundError: org/apache/hadoop/yarn/client/ClientRMProxy
at org.apache.hadoop.yarn.client.api.impl.YarnClientImpl.serviceStart(YarnClientImpl.java:187)
at org.apache.hadoop.service.AbstractService.start(AbstractService.java:193)
at org.apache.hadoop.mapred.ResourceMgrDelegate.serviceStart(ResourceMgrDelegate.java:108)
at org.apache.hadoop.service.AbstractService.start(AbstractService.java:193)
at org.apache.hadoop.mapred.ResourceMgrDelegate.<init>(ResourceMgrDelegate.java:97)
at org.apache.hadoop.mapred.YARNRunner.<init>(YARNRunner.java:112)
at org.apache.hadoop.mapred.YarnClientProtocolProvider.create(YarnClientProtocolProvider.java:34)
at org.apache.hadoop.mapreduce.Cluster.initialize(Cluster.java:95)
at org.apache.hadoop.mapreduce.Cluster.<init>(Cluster.java:82)
at org.apache.hadoop.mapreduce.Cluster.<init>(Cluster.java:75)
at org.apache.hadoop.mapred.JobClient.init(JobClient.java:470)
at org.apache.hadoop.mapred.JobClient.<init>(JobClient.java:460)
at org.apache.hadoop.mapreduce.v2.TestMRJobs.testConfVerification(TestMRJobs.java:292)
at org.apache.hadoop.mapreduce.v2.TestMRJobs.testConfVerificationWithClassloader(TestMRJobs.java:247)
Hadoop-Mapreduce-trunk - Build # 2086 - Still Failing
Posted by Apache Jenkins Server <je...@builds.apache.org>.
See https://builds.apache.org/job/Hadoop-Mapreduce-trunk/2086/
###################################################################################
########################## LAST 60 LINES OF THE CONSOLE ###########################
[...truncated 31269 lines...]
Tests run: 523, Failures: 0, Errors: 2, Skipped: 11
[INFO] ------------------------------------------------------------------------
[INFO] Reactor Summary:
[INFO]
[INFO] hadoop-mapreduce-client ........................... SUCCESS [ 2.813 s]
[INFO] hadoop-mapreduce-client-core ...................... SUCCESS [01:41 min]
[INFO] hadoop-mapreduce-client-common .................... SUCCESS [ 32.999 s]
[INFO] hadoop-mapreduce-client-shuffle ................... SUCCESS [ 4.667 s]
[INFO] hadoop-mapreduce-client-app ....................... SUCCESS [10:44 min]
[INFO] hadoop-mapreduce-client-hs ........................ SUCCESS [05:53 min]
[INFO] hadoop-mapreduce-client-jobclient ................. FAILURE [ 01:41 h]
[INFO] hadoop-mapreduce-client-hs-plugins ................ SKIPPED
[INFO] hadoop-mapreduce-client-nativetask ................ SKIPPED
[INFO] Apache Hadoop MapReduce Examples .................. SKIPPED
[INFO] hadoop-mapreduce .................................. SKIPPED
[INFO] ------------------------------------------------------------------------
[INFO] BUILD FAILURE
[INFO] ------------------------------------------------------------------------
[INFO] Total time: 02:00 h
[INFO] Finished at: 2015-03-18T15:26:57+00:00
[INFO] Final Memory: 34M/760M
[INFO] ------------------------------------------------------------------------
[ERROR] Failed to execute goal org.apache.maven.plugins:maven-surefire-plugin:2.17:test (default-test) on project hadoop-mapreduce-client-jobclient: There are test failures.
[ERROR]
[ERROR] Please refer to /home/jenkins/jenkins-slave/workspace/Hadoop-Mapreduce-trunk/hadoop-mapreduce-project/hadoop-mapreduce-client/hadoop-mapreduce-client-jobclient/target/surefire-reports for the individual test results.
[ERROR] -> [Help 1]
[ERROR]
[ERROR] To see the full stack trace of the errors, re-run Maven with the -e switch.
[ERROR] Re-run Maven using the -X switch to enable full debug logging.
[ERROR]
[ERROR] For more information about the errors and possible solutions, please read the following articles:
[ERROR] [Help 1] http://cwiki.apache.org/confluence/display/MAVEN/MojoFailureException
[ERROR]
[ERROR] After correcting the problems, you can resume the build with the command
[ERROR] mvn <goals> -rf :hadoop-mapreduce-client-jobclient
Build step 'Execute shell' marked build as failure
[FINDBUGS] Skipping publisher since build result is FAILURE
Archiving artifacts
Sending artifact delta relative to Hadoop-Mapreduce-trunk #2084
Archived 1 artifacts
Archive block size is 32768
Received 0 blocks and 20319645 bytes
Compression is 0.0%
Took 7 sec
Recording test results
Updating HDFS-7946
Updating YARN-3181
Updating YARN-3305
Updating YARN-3243
Updating YARN-3273
Updating YARN-3205
Updating HADOOP-11721
Updating HADOOP-11659
Updating HADOOP-11722
Updating HDFS-7940
Updating MAPREDUCE-5807
Email was triggered for: Failure
Sending email for trigger: Failure
###################################################################################
############################## FAILED TESTS (if any) ##############################
2 tests failed.
REGRESSION: org.apache.hadoop.mapred.TestMRTimelineEventHandling.testMRTimelineEventHandling
Error Message:
Job didn't finish in 30 seconds
Stack Trace:
java.io.IOException: Job didn't finish in 30 seconds
at org.apache.hadoop.mapred.UtilsForTests.runJobSucceed(UtilsForTests.java:622)
at org.apache.hadoop.mapred.TestMRTimelineEventHandling.testMRTimelineEventHandling(TestMRTimelineEventHandling.java:53)
REGRESSION: org.apache.hadoop.mapred.TestMRTimelineEventHandling.testMapreduceJobTimelineServiceEnabled
Error Message:
Job didn't finish in 30 seconds
Stack Trace:
java.io.IOException: Job didn't finish in 30 seconds
at org.apache.hadoop.mapred.UtilsForTests.runJobSucceed(UtilsForTests.java:622)
at org.apache.hadoop.mapred.TestMRTimelineEventHandling.testMapreduceJobTimelineServiceEnabled(TestMRTimelineEventHandling.java:146)