You are viewing a plain text version of this content. The canonical link for it is here.
Posted to commits@tomee.apache.org by Apache Jenkins Server <je...@builds.apache.org> on 2022/03/21 18:06:24 UTC
Build failed in Jenkins: TomEE » master-owasp-check #152
See <https://ci-builds.apache.org/job/Tomee/job/master-owasp-check/152/display/redirect?page=changes>
Changes:
[Richard Zowalla] Minor: Regenerated BOMs for 39f55c1fa22ffdd8e4adadb323192801f6743904
[Richard Zowalla] TOMEE-3858: Upgrade OpenJPA to 3.2.2
------------------------------------------
[...truncated 2.07 MB...]
[INFO] Checking for updates
[INFO] Skipping NVD check since last check was within 4 hours.
[INFO] Skipping RetireJS update since last update was within 24 hours.
[INFO] Check for updates complete (49 ms)
[INFO]
Dependency-Check is an open source tool performing a best effort analysis of 3rd party dependencies; false positives and false negatives may exist in the analysis performed by the tool. Use of the tool and the reporting provided constitutes acceptance for use in an AS IS condition, and there are NO warranties, implied or otherwise, with regard to the analysis or its use. Any use of the tool and the reporting provided is at the user?s risk. In no event shall the copyright holder or OWASP be held liable for any damages whatsoever arising out of or in connection with the use of this tool, the analysis performed, or the resulting report.
About ODC: https://jeremylong.github.io/DependencyCheck/general/internals.html
False Positives: https://jeremylong.github.io/DependencyCheck/general/suppression.html
? Sponsor: https://github.com/sponsors/jeremylong
[INFO] Analysis Started
[INFO] Finished Archive Analyzer (0 seconds)
[INFO] Finished File Name Analyzer (0 seconds)
[INFO] Finished Jar Analyzer (0 seconds)
[INFO] Finished Dependency Merging Analyzer (0 seconds)
[INFO] Finished Version Filter Analyzer (0 seconds)
[INFO] Finished Hint Analyzer (0 seconds)
[INFO] Created CPE Index (2 seconds)
[INFO] Finished CPE Analyzer (3 seconds)
[INFO] Finished False Positive Analyzer (0 seconds)
[INFO] Finished NVD CVE Analyzer (0 seconds)
[INFO] Finished Sonatype OSS Index Analyzer (0 seconds)
[INFO] Finished Vulnerability Suppression Analyzer (0 seconds)
[INFO] Finished Dependency Bundling Analyzer (0 seconds)
[INFO] Analysis Complete (3 seconds)
[INFO] Writing report to: <https://ci-builds.apache.org/job/Tomee/job/master-owasp-check/ws/tck/microprofile-tck/health/target/dependency-check-report.html>
[INFO]
[INFO] --- maven-install-plugin:2.5.2:install (default-install) @ microprofile-health-tck ---
[INFO] Installing <https://ci-builds.apache.org/job/Tomee/job/master-owasp-check/ws/tck/microprofile-tck/health/target/microprofile-health-tck-8.0.11-SNAPSHOT.jar> to /home/jenkins/.m2/repository/org/apache/tomee/microprofile-health-tck/8.0.11-SNAPSHOT/microprofile-health-tck-8.0.11-SNAPSHOT.jar
[INFO] Installing <https://ci-builds.apache.org/job/Tomee/job/master-owasp-check/ws/tck/microprofile-tck/health/pom.xml> to /home/jenkins/.m2/repository/org/apache/tomee/microprofile-health-tck/8.0.11-SNAPSHOT/microprofile-health-tck-8.0.11-SNAPSHOT.pom
[INFO]
[INFO] -------------< org.apache.tomee:microprofile-metrics-tck >--------------
[INFO] Building TomEE :: TCK :: MicroProfile Metrics TCK 8.0.11-SNAPSHOT [121/142]
[INFO] --------------------------------[ jar ]---------------------------------
[INFO]
[INFO] --- maven-clean-plugin:3.1.0:clean (default-clean) @ microprofile-metrics-tck ---
[INFO]
[INFO] --- maven-enforcer-plugin:1.4.1:enforce (enforce-maven-version) @ microprofile-metrics-tck ---
[INFO]
[INFO] --- maven-remote-resources-plugin:1.5:process (process-resource-bundles) @ microprofile-metrics-tck ---
[INFO]
[INFO] --- maven-resources-plugin:3.0.2:resources (default-resources) @ microprofile-metrics-tck ---
[INFO] Using 'UTF-8' encoding to copy filtered resources.
[INFO] skip non existing resourceDirectory <https://ci-builds.apache.org/job/Tomee/job/master-owasp-check/ws/tck/microprofile-tck/metrics/src/main/resources>
[INFO] Copying 3 resources
[INFO]
[INFO] --- maven-compiler-plugin:3.6.2:compile (default-compile) @ microprofile-metrics-tck ---
[INFO] No sources to compile
[INFO]
[INFO] --- dependency-report-plugin:1.0.2:report (default) @ microprofile-metrics-tck ---
[INFO] No dependencies to report
[INFO]
[INFO] --- maven-bundle-plugin:3.3.0:manifest (bundle-manifest) @ microprofile-metrics-tck ---
[WARNING] Manifest org.apache.tomee:microprofile-metrics-tck:jar:8.0.11-SNAPSHOT : Unused Export-Package instructions: [org.apache.tomee*]
[INFO]
[INFO] --- maven-resources-plugin:3.0.2:testResources (default-testResources) @ microprofile-metrics-tck ---
[INFO] Using 'UTF-8' encoding to copy filtered resources.
[INFO] Copying 2 resources
[INFO] Copying 3 resources
[INFO]
[INFO] --- maven-compiler-plugin:3.6.2:testCompile (default-testCompile) @ microprofile-metrics-tck ---
[INFO] Changes detected - recompiling the module!
[INFO] Compiling 4 source files to <https://ci-builds.apache.org/job/Tomee/job/master-owasp-check/ws/tck/microprofile-tck/metrics/target/test-classes>
[INFO]
[INFO] --- maven-surefire-plugin:2.22.0:test (default-test) @ microprofile-metrics-tck ---
[INFO] Tests are skipped.
[INFO]
[INFO] --- maven-jar-plugin:3.0.2:jar (default-jar) @ microprofile-metrics-tck ---
[INFO] Building jar: <https://ci-builds.apache.org/job/Tomee/job/master-owasp-check/ws/tck/microprofile-tck/metrics/target/microprofile-metrics-tck-8.0.11-SNAPSHOT.jar>
[INFO]
[INFO] --- maven-site-plugin:3.7.1:attach-descriptor (attach-descriptor) @ microprofile-metrics-tck ---
[INFO] Skipping because packaging 'jar' is not pom.
[INFO]
[INFO] --- dependency-check-maven:6.5.3:aggregate (default) @ microprofile-metrics-tck ---
[INFO] Checking for updates
[INFO] Skipping NVD check since last check was within 4 hours.
[INFO] Skipping RetireJS update since last update was within 24 hours.
[INFO] Check for updates complete (43 ms)
[INFO]
Dependency-Check is an open source tool performing a best effort analysis of 3rd party dependencies; false positives and false negatives may exist in the analysis performed by the tool. Use of the tool and the reporting provided constitutes acceptance for use in an AS IS condition, and there are NO warranties, implied or otherwise, with regard to the analysis or its use. Any use of the tool and the reporting provided is at the user?s risk. In no event shall the copyright holder or OWASP be held liable for any damages whatsoever arising out of or in connection with the use of this tool, the analysis performed, or the resulting report.
About ODC: https://jeremylong.github.io/DependencyCheck/general/internals.html
False Positives: https://jeremylong.github.io/DependencyCheck/general/suppression.html
? Sponsor: https://github.com/sponsors/jeremylong
[INFO] Analysis Started
[INFO] Finished File Name Analyzer (0 seconds)
[INFO] Finished Dependency Merging Analyzer (0 seconds)
[INFO] Finished Version Filter Analyzer (0 seconds)
[INFO] Finished Hint Analyzer (0 seconds)
[INFO] Created CPE Index (1 seconds)
[INFO] Finished CPE Analyzer (1 seconds)
[INFO] Finished False Positive Analyzer (0 seconds)
[INFO] Finished NVD CVE Analyzer (0 seconds)
[INFO] Finished Sonatype OSS Index Analyzer (0 seconds)
[INFO] Finished Vulnerability Suppression Analyzer (0 seconds)
[INFO] Finished Dependency Bundling Analyzer (0 seconds)
[INFO] Analysis Complete (1 seconds)
[INFO] Writing report to: <https://ci-builds.apache.org/job/Tomee/job/master-owasp-check/ws/tck/microprofile-tck/metrics/target/dependency-check-report.html>
[INFO]
[INFO] --- maven-install-plugin:2.5.2:install (default-install) @ microprofile-metrics-tck ---
[INFO] Installing <https://ci-builds.apache.org/job/Tomee/job/master-owasp-check/ws/tck/microprofile-tck/metrics/target/microprofile-metrics-tck-8.0.11-SNAPSHOT.jar> to /home/jenkins/.m2/repository/org/apache/tomee/microprofile-metrics-tck/8.0.11-SNAPSHOT/microprofile-metrics-tck-8.0.11-SNAPSHOT.jar
[INFO] Installing <https://ci-builds.apache.org/job/Tomee/job/master-owasp-check/ws/tck/microprofile-tck/metrics/pom.xml> to /home/jenkins/.m2/repository/org/apache/tomee/microprofile-metrics-tck/8.0.11-SNAPSHOT/microprofile-metrics-tck-8.0.11-SNAPSHOT.pom
[INFO]
[INFO] -----------< org.apache.tomee:microprofile-rest-client-tck >------------
[INFO] Building TomEE :: TCK :: MicroProfile Rest Client TCK 8.0.11-SNAPSHOT [122/142]
[INFO] --------------------------------[ jar ]---------------------------------
[INFO]
[INFO] --- maven-clean-plugin:3.1.0:clean (default-clean) @ microprofile-rest-client-tck ---
[INFO]
[INFO] --- maven-enforcer-plugin:1.4.1:enforce (enforce-maven-version) @ microprofile-rest-client-tck ---
[INFO]
[INFO] --- maven-remote-resources-plugin:1.5:process (process-resource-bundles) @ microprofile-rest-client-tck ---
[INFO]
[INFO] --- maven-resources-plugin:3.0.2:resources (default-resources) @ microprofile-rest-client-tck ---
[INFO] Using 'UTF-8' encoding to copy filtered resources.
[INFO] skip non existing resourceDirectory <https://ci-builds.apache.org/job/Tomee/job/master-owasp-check/ws/tck/microprofile-tck/rest-client/src/main/resources>
[INFO] Copying 3 resources
[INFO]
[INFO] --- maven-compiler-plugin:3.6.2:compile (default-compile) @ microprofile-rest-client-tck ---
[INFO] No sources to compile
[INFO]
[INFO] --- dependency-report-plugin:1.0.2:report (default) @ microprofile-rest-client-tck ---
[INFO] No dependencies to report
[INFO]
[INFO] --- maven-bundle-plugin:3.3.0:manifest (bundle-manifest) @ microprofile-rest-client-tck ---
[WARNING] Manifest org.apache.tomee:microprofile-rest-client-tck:jar:8.0.11-SNAPSHOT : Unused Export-Package instructions: [org.apache.tomee*]
[INFO]
[INFO] --- wiremock-maven-plugin:3.0.0:run (start-wiremock) @ microprofile-rest-client-tck ---
[INFO] Starting WireMock with following params: --root-dir=<https://ci-builds.apache.org/job/Tomee/job/master-owasp-check/ws/tck/microprofile-tck/rest-client/target/classes> --port=8765 --verbose
2022-03-21 18:06:19.777 Verbose logging enabled
[INFO] Logging initialized @2875299ms
2022-03-21 18:06:20.036 Verbose logging enabled
[INFO] jetty-9.2.24.v20180105
[INFO] Started o.e.j.s.ServletContextHandler@4c501d09{/__admin,null,AVAILABLE}
[INFO] Started o.e.j.s.ServletContextHandler@32eeeaca{/,null,AVAILABLE}
[WARNING] FAILED NetworkTrafficServerConnector@3822a4c2{HTTP/1.1}{0.0.0.0:8765}: java.net.BindException: Address already in use
java.net.BindException: Address already in use
at sun.nio.ch.Net.bind0 (Native Method)
at sun.nio.ch.Net.bind (Net.java:438)
at sun.nio.ch.Net.bind (Net.java:430)
at sun.nio.ch.ServerSocketChannelImpl.bind (ServerSocketChannelImpl.java:225)
at sun.nio.ch.ServerSocketAdaptor.bind (ServerSocketAdaptor.java:74)
at org.eclipse.jetty.server.ServerConnector.open (ServerConnector.java:321)
at org.eclipse.jetty.server.AbstractNetworkConnector.doStart (AbstractNetworkConnector.java:80)
at org.eclipse.jetty.server.ServerConnector.doStart (ServerConnector.java:236)
at org.eclipse.jetty.util.component.AbstractLifeCycle.start (AbstractLifeCycle.java:68)
at org.eclipse.jetty.server.Server.doStart (Server.java:366)
at org.eclipse.jetty.util.component.AbstractLifeCycle.start (AbstractLifeCycle.java:68)
at com.github.tomakehurst.wiremock.jetty9.JettyHttpServer.start (JettyHttpServer.java:174)
at com.github.tomakehurst.wiremock.WireMockServer.start (WireMockServer.java:145)
at com.github.tomakehurst.wiremock.standalone.WireMockServerRunner.run (WireMockServerRunner.java:76)
at uk.co.automatictester.wiremock.maven.plugin.server.WireMockServer$.run (WireMockServer.scala:10)
at uk.co.automatictester.wiremock.maven.plugin.mojo.WireMockRunMojo.execute (SWireMockRunMojo.scala:19)
at org.apache.maven.plugin.DefaultBuildPluginManager.executeMojo (DefaultBuildPluginManager.java:137)
at org.apache.maven.lifecycle.internal.MojoExecutor.execute (MojoExecutor.java:210)
at org.apache.maven.lifecycle.internal.MojoExecutor.execute (MojoExecutor.java:156)
at org.apache.maven.lifecycle.internal.MojoExecutor.execute (MojoExecutor.java:148)
at org.apache.maven.lifecycle.internal.LifecycleModuleBuilder.buildProject (LifecycleModuleBuilder.java:117)
at org.apache.maven.lifecycle.internal.LifecycleModuleBuilder.buildProject (LifecycleModuleBuilder.java:81)
at org.apache.maven.lifecycle.internal.builder.singlethreaded.SingleThreadedBuilder.build (SingleThreadedBuilder.java:56)
at org.apache.maven.lifecycle.internal.LifecycleStarter.execute (LifecycleStarter.java:128)
at org.apache.maven.DefaultMaven.doExecute (DefaultMaven.java:305)
at org.apache.maven.DefaultMaven.doExecute (DefaultMaven.java:192)
at org.apache.maven.DefaultMaven.execute (DefaultMaven.java:105)
at org.jvnet.hudson.maven3.launcher.Maven35Launcher.main (Maven35Launcher.java:130)
at sun.reflect.NativeMethodAccessorImpl.invoke0 (Native Method)
at sun.reflect.NativeMethodAccessorImpl.invoke (NativeMethodAccessorImpl.java:62)
at sun.reflect.DelegatingMethodAccessorImpl.invoke (DelegatingMethodAccessorImpl.java:43)
at java.lang.reflect.Method.invoke (Method.java:498)
at org.codehaus.plexus.classworlds.launcher.Launcher.launchEnhanced (Launcher.java:282)
at org.codehaus.plexus.classworlds.launcher.Launcher.launch (Launcher.java:225)
at jenkins.maven3.agent.Maven35Main.launch (Maven35Main.java:178)
at sun.reflect.NativeMethodAccessorImpl.invoke0 (Native Method)
at sun.reflect.NativeMethodAccessorImpl.invoke (NativeMethodAccessorImpl.java:62)
at sun.reflect.DelegatingMethodAccessorImpl.invoke (DelegatingMethodAccessorImpl.java:43)
at java.lang.reflect.Method.invoke (Method.java:498)
at hudson.maven.Maven3Builder.call (Maven3Builder.java:139)
at hudson.maven.Maven3Builder.call (Maven3Builder.java:70)
at hudson.remoting.UserRequest.perform (UserRequest.java:211)
at hudson.remoting.UserRequest.perform (UserRequest.java:54)
at hudson.remoting.Request$2.run (Request.java:376)
at hudson.remoting.InterceptingExecutorService.lambda$wrap$0 (InterceptingExecutorService.java:78)
at java.util.concurrent.FutureTask.run (FutureTask.java:266)
at java.util.concurrent.ThreadPoolExecutor.runWorker (ThreadPoolExecutor.java:1149)
at java.util.concurrent.ThreadPoolExecutor$Worker.run (ThreadPoolExecutor.java:624)
at java.lang.Thread.run (Thread.java:748)
[WARNING] FAILED org.eclipse.jetty.server.Server@141fda9b: java.net.BindException: Address already in use
java.net.BindException: Address already in use
at sun.nio.ch.Net.bind0 (Native Method)
at sun.nio.ch.Net.bind (Net.java:438)
at sun.nio.ch.Net.bind (Net.java:430)
at sun.nio.ch.ServerSocketChannelImpl.bind (ServerSocketChannelImpl.java:225)
at sun.nio.ch.ServerSocketAdaptor.bind (ServerSocketAdaptor.java:74)
at org.eclipse.jetty.server.ServerConnector.open (ServerConnector.java:321)
at org.eclipse.jetty.server.AbstractNetworkConnector.doStart (AbstractNetworkConnector.java:80)
at org.eclipse.jetty.server.ServerConnector.doStart (ServerConnector.java:236)
at org.eclipse.jetty.util.component.AbstractLifeCycle.start (AbstractLifeCycle.java:68)
at org.eclipse.jetty.server.Server.doStart (Server.java:366)
at org.eclipse.jetty.util.component.AbstractLifeCycle.start (AbstractLifeCycle.java:68)
at com.github.tomakehurst.wiremock.jetty9.JettyHttpServer.start (JettyHttpServer.java:174)
at com.github.tomakehurst.wiremock.WireMockServer.start (WireMockServer.java:145)
at com.github.tomakehurst.wiremock.standalone.WireMockServerRunner.run (WireMockServerRunner.java:76)
at uk.co.automatictester.wiremock.maven.plugin.server.WireMockServer$.run (WireMockServer.scala:10)
at uk.co.automatictester.wiremock.maven.plugin.mojo.WireMockRunMojo.execute (SWireMockRunMojo.scala:19)
at org.apache.maven.plugin.DefaultBuildPluginManager.executeMojo (DefaultBuildPluginManager.java:137)
at org.apache.maven.lifecycle.internal.MojoExecutor.execute (MojoExecutor.java:210)
at org.apache.maven.lifecycle.internal.MojoExecutor.execute (MojoExecutor.java:156)
at org.apache.maven.lifecycle.internal.MojoExecutor.execute (MojoExecutor.java:148)
at org.apache.maven.lifecycle.internal.LifecycleModuleBuilder.buildProject (LifecycleModuleBuilder.java:117)
at org.apache.maven.lifecycle.internal.LifecycleModuleBuilder.buildProject (LifecycleModuleBuilder.java:81)
at org.apache.maven.lifecycle.internal.builder.singlethreaded.SingleThreadedBuilder.build (SingleThreadedBuilder.java:56)
at org.apache.maven.lifecycle.internal.LifecycleStarter.execute (LifecycleStarter.java:128)
at org.apache.maven.DefaultMaven.doExecute (DefaultMaven.java:305)
at org.apache.maven.DefaultMaven.doExecute (DefaultMaven.java:192)
at org.apache.maven.DefaultMaven.execute (DefaultMaven.java:105)
at org.jvnet.hudson.maven3.launcher.Maven35Launcher.main (Maven35Launcher.java:130)
at sun.reflect.NativeMethodAccessorImpl.invoke0 (Native Method)
at sun.reflect.NativeMethodAccessorImpl.invoke (NativeMethodAccessorImpl.java:62)
at sun.reflect.DelegatingMethodAccessorImpl.invoke (DelegatingMethodAccessorImpl.java:43)
at java.lang.reflect.Method.invoke (Method.java:498)
at org.codehaus.plexus.classworlds.launcher.Launcher.launchEnhanced (Launcher.java:282)
at org.codehaus.plexus.classworlds.launcher.Launcher.launch (Launcher.java:225)
at jenkins.maven3.agent.Maven35Main.launch (Maven35Main.java:178)
at sun.reflect.NativeMethodAccessorImpl.invoke0 (Native Method)
at sun.reflect.NativeMethodAccessorImpl.invoke (NativeMethodAccessorImpl.java:62)
at sun.reflect.DelegatingMethodAccessorImpl.invoke (DelegatingMethodAccessorImpl.java:43)
at java.lang.reflect.Method.invoke (Method.java:498)
at hudson.maven.Maven3Builder.call (Maven3Builder.java:139)
at hudson.maven.Maven3Builder.call (Maven3Builder.java:70)
at hudson.remoting.UserRequest.perform (UserRequest.java:211)
at hudson.remoting.UserRequest.perform (UserRequest.java:54)
at hudson.remoting.Request$2.run (Request.java:376)
at hudson.remoting.InterceptingExecutorService.lambda$wrap$0 (InterceptingExecutorService.java:78)
at java.util.concurrent.FutureTask.run (FutureTask.java:266)
at java.util.concurrent.ThreadPoolExecutor.runWorker (ThreadPoolExecutor.java:1149)
at java.util.concurrent.ThreadPoolExecutor$Worker.run (ThreadPoolExecutor.java:624)
at java.lang.Thread.run (Thread.java:748)
java.lang.RuntimeException: java.net.BindException: Address already in use
ERROR: Maven JVM terminated unexpectedly with exit code 1