You are viewing a plain text version of this content. The canonical link for it is here.
Posted to builds@cassandra.apache.org by Apache Jenkins Server <je...@builds.apache.org> on 2023/07/14 05:38:04 UTC

Build complete: Cassandra-4.1 #377 [UNSTABLE] 17afd5e6be90eff955bbaa8ccff20d4a05f494eb

-------------------------------------------------------------------------------
Build Cassandra-4.1 #377 Still Unstable
URL: https://ci-cassandra.apache.org/job/Cassandra-4.1/377/
-------------------------------------------------------------------------------
Changes:
[Jacek Lewandowski] Moved jflex from runtime to build dependencies


-------------------------------------------------------------------------------
Failed Tests:
7 tests failed.
FAILED:  dtest-novnode.cqlsh_tests.test_cqlsh_copy.TestCqlshCopy.test_bulk_round_trip_with_timeouts
FAILED:  dtest-novnode.cqlsh_tests.test_cqlsh_copy.TestCqlshCopy.test_bulk_round_trip_with_timeouts
FAILED:  dtest-offheap.materialized_views_test.TestMaterializedViews.test_no_base_column_in_view_pk_complex_timestamp_with_flush
FAILED:  org.apache.cassandra.distributed.upgrade.UpgradeTest.simpleUpgradeWithNetworkAndGossipTest
FAILED:  org.apache.cassandra.tools.TopPartitionsTest.testServiceTopPartitionsSingleTable-cdc
FAILED:  org.apache.cassandra.tools.TopPartitionsTest.testServiceTopPartitionsSingleTable-compression
FAILED:  org.apache.cassandra.distributed.upgrade.MixedModeReadTest.mixedModeReadColumnSubsetDigestCheck

-------------------------------------------------------------------------------
For complete test report and logs see https://nightlies.apache.org/cassandra/Cassandra-4.1/377/