You are viewing a plain text version of this content. The canonical link for it is here.
Posted to builds@beam.apache.org by Apache Jenkins Server <je...@builds.apache.org> on 2019/07/15 16:37:52 UTC

Build failed in Jenkins: beam_PostCommit_Python3_Verify #1361

See <https://builds.apache.org/job/beam_PostCommit_Python3_Verify/1361/display/redirect?page=changes>

Changes:

[sniemitz] Done notifications for BigtableIO.Write

------------------------------------------
[...truncated 198.69 KB...]

> Task :sdks:python:test-suites:dataflow:py37:postCommitIT
<https://builds.apache.org/job/beam_PostCommit_Python3_Verify/ws/src/sdks/python/apache_beam/io/gcp/bigquery.py>:1140: BeamDeprecationWarning: options is deprecated since First stable release. References to <pipeline>.options will not be supported
Found: https://console.cloud.google.com/dataflow/jobsDetail/locations/us-central1/jobs/2019-07-15_08_39_28-7973151318630692071?project=apache-beam-testing.
  method_to_use = self._compute_method(p, p.options)
Found: https://console.cloud.google.com/dataflow/jobsDetail/locations/us-central1/jobs/2019-07-15_08_54_38-7539609813435840761?project=apache-beam-testing.
Found: https://console.cloud.google.com/dataflow/jobsDetail/locations/us-central1/jobs/2019-07-15_09_04_45-3661441213100783552?project=apache-beam-testing.
Found: https://console.cloud.google.com/dataflow/jobsDetail/locations/us-central1/jobs/2019-07-15_09_14_00-2659355088192359417?project=apache-beam-testing.
Found: https://console.cloud.google.com/dataflow/jobsDetail/locations/us-central1/jobs/2019-07-15_08_39_25-11915872753485760340?project=apache-beam-testing.
<https://builds.apache.org/job/beam_PostCommit_Python3_Verify/ws/src/sdks/python/apache_beam/runners/dataflow/dataflow_runner.py>:686: BeamDeprecationWarning: BigQuerySink is deprecated since 2.11.0. Use WriteToBigQuery instead.
  kms_key=transform.kms_key))
Found: https://console.cloud.google.com/dataflow/jobsDetail/locations/us-central1/jobs/2019-07-15_09_02_23-1101623748587262880?project=apache-beam-testing.
Found: https://console.cloud.google.com/dataflow/jobsDetail/locations/us-central1/jobs/2019-07-15_09_12_19-15198537418241914571?project=apache-beam-testing.
Found: https://console.cloud.google.com/dataflow/jobsDetail/locations/us-central1/jobs/2019-07-15_09_22_23-15023163240812500348?project=apache-beam-testing.
Found: https://console.cloud.google.com/dataflow/jobsDetail/locations/us-central1/jobs/2019-07-15_08_39_30-2476723056697805811?project=apache-beam-testing.
<https://builds.apache.org/job/beam_PostCommit_Python3_Verify/ws/src/sdks/python/apache_beam/io/gcp/bigquery.py>:1140: BeamDeprecationWarning: options is deprecated since First stable release. References to <pipeline>.options will not be supported
  method_to_use = self._compute_method(p, p.options)
Found: https://console.cloud.google.com/dataflow/jobsDetail/locations/us-central1/jobs/2019-07-15_08_53_33-15294347687592994682?project=apache-beam-testing.
Found: https://console.cloud.google.com/dataflow/jobsDetail/locations/us-central1/jobs/2019-07-15_09_03_11-15664987590232236955?project=apache-beam-testing.
Found: https://console.cloud.google.com/dataflow/jobsDetail/locations/us-central1/jobs/2019-07-15_09_12_38-5878640024187493221?project=apache-beam-testing.
Found: https://console.cloud.google.com/dataflow/jobsDetail/locations/us-central1/jobs/2019-07-15_08_39_25-7656113420966728241?project=apache-beam-testing.
<https://builds.apache.org/job/beam_PostCommit_Python3_Verify/ws/src/sdks/python/apache_beam/io/fileio_test.py>:232: FutureWarning: MatchAll is experimental.
  | 'GetPath' >> beam.Map(lambda metadata: metadata.path))
Found: https://console.cloud.google.com/dataflow/jobsDetail/locations/us-central1/jobs/2019-07-15_09_03_18-18420226177967961123?project=apache-beam-testing.
<https://builds.apache.org/job/beam_PostCommit_Python3_Verify/ws/src/sdks/python/apache_beam/io/fileio_test.py>:243: FutureWarning: MatchAll is experimental.
Found: https://console.cloud.google.com/dataflow/jobsDetail/locations/us-central1/jobs/2019-07-15_09_13_33-6648998514920557081?project=apache-beam-testing.
Found: https://console.cloud.google.com/dataflow/jobsDetail/locations/us-central1/jobs/2019-07-15_09_22_49-13497137247006250370?project=apache-beam-testing.
  | 'Checksums' >> beam.Map(compute_hash))
<https://builds.apache.org/job/beam_PostCommit_Python3_Verify/ws/src/sdks/python/apache_beam/io/fileio_test.py>:243: FutureWarning: ReadMatches is experimental.
  | 'Checksums' >> beam.Map(compute_hash))
Found: https://console.cloud.google.com/dataflow/jobsDetail/locations/us-central1/jobs/2019-07-15_08_39_25-13032682991633632200?project=apache-beam-testing.
<https://builds.apache.org/job/beam_PostCommit_Python3_Verify/ws/src/sdks/python/apache_beam/io/gcp/bigquery.py>:1140: BeamDeprecationWarning: options is deprecated since First stable release. References to <pipeline>.options will not be supported
Found: https://console.cloud.google.com/dataflow/jobsDetail/locations/us-central1/jobs/2019-07-15_08_49_16-17718030658201877586?project=apache-beam-testing.
  method_to_use = self._compute_method(p, p.options)
Found: https://console.cloud.google.com/dataflow/jobsDetail/locations/us-central1/jobs/2019-07-15_08_58_49-7868636597389023854?project=apache-beam-testing.
<https://builds.apache.org/job/beam_PostCommit_Python3_Verify/ws/src/sdks/python/apache_beam/io/gcp/bigquery_file_loads.py>:557: BeamDeprecationWarning: options is deprecated since First stable release. References to <pipeline>.options will not be supported
Found: https://console.cloud.google.com/dataflow/jobsDetail/locations/us-central1/jobs/2019-07-15_09_08_58-19374889693928201?project=apache-beam-testing.
  temp_location = p.options.view_as(GoogleCloudOptions).temp_location
Found: https://console.cloud.google.com/dataflow/jobsDetail/locations/us-central1/jobs/2019-07-15_08_39_24-6605501706818698241?project=apache-beam-testing.
<https://builds.apache.org/job/beam_PostCommit_Python3_Verify/ws/src/sdks/python/apache_beam/runners/dataflow/dataflow_runner.py>:686: BeamDeprecationWarning: BigQuerySink is deprecated since 2.11.0. Use WriteToBigQuery instead.
  kms_key=transform.kms_key))
<https://builds.apache.org/job/beam_PostCommit_Python3_Verify/ws/src/sdks/python/apache_beam/io/gcp/big_query_query_to_table_pipeline.py>:73: BeamDeprecationWarning: BigQuerySink is deprecated since 2.11.0. Use WriteToBigQuery instead.
Found: https://console.cloud.google.com/dataflow/jobsDetail/locations/us-central1/jobs/2019-07-15_08_50_16-14549970895991805072?project=apache-beam-testing.
  kms_key=kms_key))
Found: https://console.cloud.google.com/dataflow/jobsDetail/locations/us-central1/jobs/2019-07-15_08_59_19-11340114977764552586?project=apache-beam-testing.
Found: https://console.cloud.google.com/dataflow/jobsDetail/locations/us-central1/jobs/2019-07-15_09_08_50-6710719669036555664?project=apache-beam-testing.
Found: https://console.cloud.google.com/dataflow/jobsDetail/locations/us-central1/jobs/2019-07-15_09_18_17-14586045194937389845?project=apache-beam-testing.
Found: https://console.cloud.google.com/dataflow/jobsDetail/locations/us-central1/jobs/2019-07-15_08_39_29-16421264227630985441?project=apache-beam-testing.
Found: https://console.cloud.google.com/dataflow/jobsDetail/locations/us-central1/jobs/2019-07-15_08_51_20-13124239450005222817?project=apache-beam-testing.
Found: https://console.cloud.google.com/dataflow/jobsDetail/locations/us-central1/jobs/2019-07-15_09_02_27-14580598629766100643?project=apache-beam-testing.
Found: https://console.cloud.google.com/dataflow/jobsDetail/locations/us-central1/jobs/2019-07-15_09_13_09-9470081434722467901?project=apache-beam-testing.
<https://builds.apache.org/job/beam_PostCommit_Python3_Verify/ws/src/sdks/python/apache_beam/io/gcp/bigquery.py>:1140: BeamDeprecationWarning: options is deprecated since First stable release. References to <pipeline>.options will not be supported
  method_to_use = self._compute_method(p, p.options)
<https://builds.apache.org/job/beam_PostCommit_Python3_Verify/ws/src/sdks/python/apache_beam/io/gcp/bigquery_file_loads.py>:557: BeamDeprecationWarning: options is deprecated since First stable release. References to <pipeline>.options will not be supported
  temp_location = p.options.view_as(GoogleCloudOptions).temp_location
Found: https://console.cloud.google.com/dataflow/jobsDetail/locations/us-central1/jobs/2019-07-15_08_39_26-14390777062513949875?project=apache-beam-testing.
Found: https://console.cloud.google.com/dataflow/jobsDetail/locations/us-central1/jobs/2019-07-15_08_49_52-2487553999743279010?project=apache-beam-testing.
Found: https://console.cloud.google.com/dataflow/jobsDetail/locations/us-central1/jobs/2019-07-15_08_58_08-15621539944775809247?project=apache-beam-testing.
Found: https://console.cloud.google.com/dataflow/jobsDetail/locations/us-central1/jobs/2019-07-15_09_08_19-10052020848799385628?project=apache-beam-testing.
Found: https://console.cloud.google.com/dataflow/jobsDetail/locations/us-central1/jobs/2019-07-15_09_18_15-268312838784163026?project=apache-beam-testing.
Found: https://console.cloud.google.com/dataflow/jobsDetail/locations/us-central1/jobs/2019-07-15_09_27_40-16325936211110853977?project=apache-beam-testing.
test_datastore_wordcount_it (apache_beam.examples.cookbook.datastore_wordcount_it_test.DatastoreWordCountIT) ... SKIP: This test still needs to be fixed on Python 3TODO: BEAM-4543
test_avro_it (apache_beam.examples.fastavro_it_test.FastavroIT) ... SKIP: Due to a known issue in avro-python3 package, thistest is skipped until BEAM-6522 is addressed. 
test_autocomplete_it (apache_beam.examples.complete.autocomplete_test.AutocompleteTest) ... ok
test_wordcount_fnapi_it (apache_beam.examples.wordcount_it_test.WordCountIT) ... ok
test_bigquery_tornadoes_it (apache_beam.examples.cookbook.bigquery_tornadoes_it_test.BigqueryTornadoesIT) ... ok
test_streaming_wordcount_it (apache_beam.examples.streaming_wordcount_it_test.StreamingWordCountIT) ... ok
test_leader_board_it (apache_beam.examples.complete.game.leader_board_it_test.LeaderBoardIT) ... ok
test_game_stats_it (apache_beam.examples.complete.game.game_stats_it_test.GameStatsIT) ... ok
test_wordcount_it (apache_beam.examples.wordcount_it_test.WordCountIT) ... ok
test_hourly_team_score_it (apache_beam.examples.complete.game.hourly_team_score_it_test.HourlyTeamScoreIT) ... ok
test_user_score_it (apache_beam.examples.complete.game.user_score_it_test.UserScoreIT) ... ok
test_datastore_write_limit (apache_beam.io.gcp.datastore_write_it_test.DatastoreWriteIT) ... SKIP: This test still needs to be fixed on Python 3TODO: BEAM-4543
test_bigquery_read_1M_python (apache_beam.io.gcp.bigquery_io_read_it_test.BigqueryIOReadIT) ... ok
test_copy (apache_beam.io.gcp.gcsio_integration_test.GcsIOIntegrationTest) ... ok
test_copy_batch (apache_beam.io.gcp.gcsio_integration_test.GcsIOIntegrationTest) ... ok
test_copy_batch_kms (apache_beam.io.gcp.gcsio_integration_test.GcsIOIntegrationTest) ... ok
test_copy_batch_rewrite_token (apache_beam.io.gcp.gcsio_integration_test.GcsIOIntegrationTest) ... ok
test_copy_kms (apache_beam.io.gcp.gcsio_integration_test.GcsIOIntegrationTest) ... ok
test_copy_rewrite_token (apache_beam.io.gcp.gcsio_integration_test.GcsIOIntegrationTest) ... ok
test_multiple_destinations_transform (apache_beam.io.gcp.bigquery_file_loads_test.BigQueryFileLoadsIT) ... ok
test_one_job_fails_all_jobs_fail (apache_beam.io.gcp.bigquery_file_loads_test.BigQueryFileLoadsIT) ... ok
test_transform_on_gcs (apache_beam.io.fileio_test.MatchIntegrationTest) ... ok
test_big_query_read (apache_beam.io.gcp.bigquery_read_it_test.BigQueryReadIntegrationTests) ... ok
test_big_query_read_new_types (apache_beam.io.gcp.bigquery_read_it_test.BigQueryReadIntegrationTests) ... ok
test_multiple_destinations_transform (apache_beam.io.gcp.bigquery_test.BigQueryStreamingInsertTransformIntegrationTests) ... ok
test_multiple_destinations_transform_streaming (apache_beam.io.gcp.bigquery_test.BigQueryStreamingInsertTransformIntegrationTests) ... SKIP: TestStream is not supported on TestDataflowRunner
test_value_provider_transform (apache_beam.io.gcp.bigquery_test.BigQueryStreamingInsertTransformIntegrationTests) ... ok
test_streaming_data_only (apache_beam.io.gcp.pubsub_integration_test.PubSubIntegrationTest) ... ok
test_streaming_with_attributes (apache_beam.io.gcp.pubsub_integration_test.PubSubIntegrationTest) ... ok
test_parquetio_it (apache_beam.io.parquetio_it_test.TestParquetIT) ... ok
test_job_python_from_python_it (apache_beam.transforms.external_test_it.ExternalTransformIT) ... ok
test_big_query_legacy_sql (apache_beam.io.gcp.big_query_query_to_table_it_test.BigQueryQueryToTableIT) ... ok
test_big_query_new_types (apache_beam.io.gcp.big_query_query_to_table_it_test.BigQueryQueryToTableIT) ... ok
test_big_query_standard_sql (apache_beam.io.gcp.big_query_query_to_table_it_test.BigQueryQueryToTableIT) ... ok
test_big_query_standard_sql_kms_key_native (apache_beam.io.gcp.big_query_query_to_table_it_test.BigQueryQueryToTableIT) ... ok
test_big_query_write (apache_beam.io.gcp.bigquery_write_it_test.BigQueryWriteIntegrationTests) ... ok
test_big_query_write_new_types (apache_beam.io.gcp.bigquery_write_it_test.BigQueryWriteIntegrationTests) ... ok
test_big_query_write_schema_autodetect (apache_beam.io.gcp.bigquery_write_it_test.BigQueryWriteIntegrationTests) ... SKIP: DataflowRunner does not support schema autodetection
test_big_query_write_without_schema (apache_beam.io.gcp.bigquery_write_it_test.BigQueryWriteIntegrationTests) ... ok
test_metrics_fnapi_it (apache_beam.runners.dataflow.dataflow_exercise_metrics_pipeline_test.ExerciseMetricsPipelineTest) ... ok
test_metrics_it (apache_beam.runners.dataflow.dataflow_exercise_metrics_pipeline_test.ExerciseMetricsPipelineTest) ... ok
test_datastore_write_limit (apache_beam.io.gcp.datastore.v1new.datastore_write_it_test.DatastoreWriteIT) ... ok

----------------------------------------------------------------------
XML: <https://builds.apache.org/job/beam_PostCommit_Python3_Verify/ws/src/sdks/python/nosetests.xml>
----------------------------------------------------------------------
Ran 42 tests in 3469.591s

OK (SKIP=5)

> Task :sdks:python:test-suites:dataflow:py35:postCommitIT
Found: https://console.cloud.google.com/dataflow/jobsDetail/locations/us-central1/jobs/2019-07-15_08_39_45-14657460772576025890?project=apache-beam-testing.
<https://builds.apache.org/job/beam_PostCommit_Python3_Verify/ws/src/sdks/python/apache_beam/io/gcp/bigquery.py>:1140: BeamDeprecationWarning: options is deprecated since First stable release. References to <pipeline>.options will not be supported
  method_to_use = self._compute_method(p, p.options)
Found: https://console.cloud.google.com/dataflow/jobsDetail/locations/us-central1/jobs/2019-07-15_08_56_13-17816405295905961248?project=apache-beam-testing.
Found: https://console.cloud.google.com/dataflow/jobsDetail/locations/us-central1/jobs/2019-07-15_09_06_05-15705975305112569222?project=apache-beam-testing.
Found: https://console.cloud.google.com/dataflow/jobsDetail/locations/us-central1/jobs/2019-07-15_09_15_31-619540928461540892?project=apache-beam-testing.
Found: https://console.cloud.google.com/dataflow/jobsDetail/locations/us-central1/jobs/2019-07-15_08_39_48-15860806688697685513?project=apache-beam-testing.
Found: https://console.cloud.google.com/dataflow/jobsDetail/locations/us-central1/jobs/2019-07-15_09_04_05-14462834205695262243?project=apache-beam-testing.
Found: https://console.cloud.google.com/dataflow/jobsDetail/locations/us-central1/jobs/2019-07-15_09_13_24-8804803600205276917?project=apache-beam-testing.
<https://builds.apache.org/job/beam_PostCommit_Python3_Verify/ws/src/sdks/python/apache_beam/runners/dataflow/dataflow_runner.py>:686: BeamDeprecationWarning: BigQuerySink is deprecated since 2.11.0. Use WriteToBigQuery instead.
Found: https://console.cloud.google.com/dataflow/jobsDetail/locations/us-central1/jobs/2019-07-15_09_23_24-1239732900953296973?project=apache-beam-testing.
  kms_key=transform.kms_key))
Found: https://console.cloud.google.com/dataflow/jobsDetail/locations/us-central1/jobs/2019-07-15_08_39_48-12851095966492679946?project=apache-beam-testing.
Found: https://console.cloud.google.com/dataflow/jobsDetail/locations/us-central1/jobs/2019-07-15_08_54_27-3590458136291967264?project=apache-beam-testing.
Found: https://console.cloud.google.com/dataflow/jobsDetail/locations/us-central1/jobs/2019-07-15_09_04_35-8270717682785246309?project=apache-beam-testing.
<https://builds.apache.org/job/beam_PostCommit_Python3_Verify/ws/src/sdks/python/apache_beam/io/gcp/bigquery.py>:1140: BeamDeprecationWarning: options is deprecated since First stable release. References to <pipeline>.options will not be supported
Found: https://console.cloud.google.com/dataflow/jobsDetail/locations/us-central1/jobs/2019-07-15_09_15_35-9043904957340773846?project=apache-beam-testing.
  method_to_use = self._compute_method(p, p.options)
Found: https://console.cloud.google.com/dataflow/jobsDetail/locations/us-central1/jobs/2019-07-15_08_39_44-12228816517582853015?project=apache-beam-testing.
<https://builds.apache.org/job/beam_PostCommit_Python3_Verify/ws/src/sdks/python/apache_beam/io/fileio_test.py>:232: FutureWarning: MatchAll is experimental.
  | 'GetPath' >> beam.Map(lambda metadata: metadata.path))
Found: https://console.cloud.google.com/dataflow/jobsDetail/locations/us-central1/jobs/2019-07-15_09_04_45-4647476320503736992?project=apache-beam-testing.
<https://builds.apache.org/job/beam_PostCommit_Python3_Verify/ws/src/sdks/python/apache_beam/io/fileio_test.py>:243: FutureWarning: MatchAll is experimental.
Found: https://console.cloud.google.com/dataflow/jobsDetail/locations/us-central1/jobs/2019-07-15_09_14_29-14121153586236427478?project=apache-beam-testing.
  | 'Checksums' >> beam.Map(compute_hash))
Found: https://console.cloud.google.com/dataflow/jobsDetail/locations/us-central1/jobs/2019-07-15_09_23_13-18300741893090478016?project=apache-beam-testing.
<https://builds.apache.org/job/beam_PostCommit_Python3_Verify/ws/src/sdks/python/apache_beam/io/fileio_test.py>:243: FutureWarning: ReadMatches is experimental.
  | 'Checksums' >> beam.Map(compute_hash))
Found: https://console.cloud.google.com/dataflow/jobsDetail/locations/us-central1/jobs/2019-07-15_08_39_46-14971738245850728274?project=apache-beam-testing.
<https://builds.apache.org/job/beam_PostCommit_Python3_Verify/ws/src/sdks/python/apache_beam/io/gcp/bigquery.py>:1140: BeamDeprecationWarning: options is deprecated since First stable release. References to <pipeline>.options will not be supported
Found: https://console.cloud.google.com/dataflow/jobsDetail/locations/us-central1/jobs/2019-07-15_08_49_24-3413573244519099454?project=apache-beam-testing.
Found: https://console.cloud.google.com/dataflow/jobsDetail/locations/us-central1/jobs/2019-07-15_08_58_34-15493373179828974183?project=apache-beam-testing.
  method_to_use = self._compute_method(p, p.options)
Found: https://console.cloud.google.com/dataflow/jobsDetail/locations/us-central1/jobs/2019-07-15_09_08_01-1226884499142665168?project=apache-beam-testing.
<https://builds.apache.org/job/beam_PostCommit_Python3_Verify/ws/src/sdks/python/apache_beam/io/gcp/bigquery_file_loads.py>:557: BeamDeprecationWarning: options is deprecated since First stable release. References to <pipeline>.options will not be supported
  temp_location = p.options.view_as(GoogleCloudOptions).temp_location
Found: https://console.cloud.google.com/dataflow/jobsDetail/locations/us-central1/jobs/2019-07-15_08_39_44-13368746840069658008?project=apache-beam-testing.
Found: https://console.cloud.google.com/dataflow/jobsDetail/locations/us-central1/jobs/2019-07-15_08_49_53-5360226214152429055?project=apache-beam-testing.
Found: https://console.cloud.google.com/dataflow/jobsDetail/locations/us-central1/jobs/2019-07-15_08_58_53-17137135845676878938?project=apache-beam-testing.
<https://builds.apache.org/job/beam_PostCommit_Python3_Verify/ws/src/sdks/python/apache_beam/runners/dataflow/dataflow_runner.py>:686: BeamDeprecationWarning: BigQuerySink is deprecated since 2.11.0. Use WriteToBigQuery instead.
Found: https://console.cloud.google.com/dataflow/jobsDetail/locations/us-central1/jobs/2019-07-15_09_08_06-13208234530140544768?project=apache-beam-testing.
  kms_key=transform.kms_key))
Found: https://console.cloud.google.com/dataflow/jobsDetail/locations/us-central1/jobs/2019-07-15_09_18_04-7738892516937018246?project=apache-beam-testing.
Found: https://console.cloud.google.com/dataflow/jobsDetail/locations/us-central1/jobs/2019-07-15_09_29_07-17530502477301688628?project=apache-beam-testing.
Found: https://console.cloud.google.com/dataflow/jobsDetail/locations/us-central1/jobs/2019-07-15_08_39_46-9015493127370607150?project=apache-beam-testing.
Found: https://console.cloud.google.com/dataflow/jobsDetail/locations/us-central1/jobs/2019-07-15_08_50_20-772989962053383264?project=apache-beam-testing.
<https://builds.apache.org/job/beam_PostCommit_Python3_Verify/ws/src/sdks/python/apache_beam/runners/dataflow/dataflow_runner.py>:686: BeamDeprecationWarning: BigQuerySink is deprecated since 2.11.0. Use WriteToBigQuery instead.
  kms_key=transform.kms_key))
Found: https://console.cloud.google.com/dataflow/jobsDetail/locations/us-central1/jobs/2019-07-15_09_00_00-1712476632473433387?project=apache-beam-testing.
<https://builds.apache.org/job/beam_PostCommit_Python3_Verify/ws/src/sdks/python/apache_beam/io/gcp/big_query_query_to_table_pipeline.py>:73: BeamDeprecationWarning: BigQuerySink is deprecated since 2.11.0. Use WriteToBigQuery instead.
  kms_key=kms_key))
Found: https://console.cloud.google.com/dataflow/jobsDetail/locations/us-central1/jobs/2019-07-15_09_09_14-3750170032384634815?project=apache-beam-testing.
Found: https://console.cloud.google.com/dataflow/jobsDetail/locations/us-central1/jobs/2019-07-15_09_18_04-5704316384129337932?project=apache-beam-testing.
Found: https://console.cloud.google.com/dataflow/jobsDetail/locations/us-central1/jobs/2019-07-15_08_39_46-16978469717013744761?project=apache-beam-testing.
<https://builds.apache.org/job/beam_PostCommit_Python3_Verify/ws/src/sdks/python/apache_beam/io/gcp/bigquery.py>:1140: BeamDeprecationWarning: options is deprecated since First stable release. References to <pipeline>.options will not be supported
  method_to_use = self._compute_method(p, p.options)
Found: https://console.cloud.google.com/dataflow/jobsDetail/locations/us-central1/jobs/2019-07-15_08_50_25-1329704633557790729?project=apache-beam-testing.
Found: https://console.cloud.google.com/dataflow/jobsDetail/locations/us-central1/jobs/2019-07-15_09_01_35-6624134447112080519?project=apache-beam-testing.
Found: https://console.cloud.google.com/dataflow/jobsDetail/locations/us-central1/jobs/2019-07-15_09_12_40-332182195715176442?project=apache-beam-testing.
<https://builds.apache.org/job/beam_PostCommit_Python3_Verify/ws/src/sdks/python/apache_beam/io/gcp/bigquery_file_loads.py>:557: BeamDeprecationWarning: options is deprecated since First stable release. References to <pipeline>.options will not be supported
  temp_location = p.options.view_as(GoogleCloudOptions).temp_location
test_datastore_wordcount_it (apache_beam.examples.cookbook.datastore_wordcount_it_test.DatastoreWordCountIT) ... SKIP: This test still needs to be fixed on Python 3TODO: BEAM-4543
test_avro_it (apache_beam.examples.fastavro_it_test.FastavroIT) ... SKIP: Due to a known issue in avro-python3 package, thistest is skipped until BEAM-6522 is addressed. 
test_autocomplete_it (apache_beam.examples.complete.autocomplete_test.AutocompleteTest) ... ok
test_bigquery_tornadoes_it (apache_beam.examples.cookbook.bigquery_tornadoes_it_test.BigqueryTornadoesIT) ... ok
test_streaming_wordcount_it (apache_beam.examples.streaming_wordcount_it_test.StreamingWordCountIT) ... ok
test_wordcount_fnapi_it (apache_beam.examples.wordcount_it_test.WordCountIT) ... ok
test_leader_board_it (apache_beam.examples.complete.game.leader_board_it_test.LeaderBoardIT) ... ok
test_game_stats_it (apache_beam.examples.complete.game.game_stats_it_test.GameStatsIT) ... ok
test_wordcount_it (apache_beam.examples.wordcount_it_test.WordCountIT) ... ok
test_hourly_team_score_it (apache_beam.examples.complete.game.hourly_team_score_it_test.HourlyTeamScoreIT) ... ok
test_user_score_it (apache_beam.examples.complete.game.user_score_it_test.UserScoreIT) ... ok
test_datastore_write_limit (apache_beam.io.gcp.datastore_write_it_test.DatastoreWriteIT) ... SKIP: This test still needs to be fixed on Python 3TODO: BEAM-4543
test_bigquery_read_1M_python (apache_beam.io.gcp.bigquery_io_read_it_test.BigqueryIOReadIT) ... ok
test_copy (apache_beam.io.gcp.gcsio_integration_test.GcsIOIntegrationTest) ... ok
test_copy_batch (apache_beam.io.gcp.gcsio_integration_test.GcsIOIntegrationTest) ... ok
test_copy_batch_kms (apache_beam.io.gcp.gcsio_integration_test.GcsIOIntegrationTest) ... ok
test_copy_batch_rewrite_token (apache_beam.io.gcp.gcsio_integration_test.GcsIOIntegrationTest) ... ok
test_copy_kms (apache_beam.io.gcp.gcsio_integration_test.GcsIOIntegrationTest) ... ok
test_copy_rewrite_token (apache_beam.io.gcp.gcsio_integration_test.GcsIOIntegrationTest) ... ok
test_multiple_destinations_transform (apache_beam.io.gcp.bigquery_file_loads_test.BigQueryFileLoadsIT) ... ok
test_one_job_fails_all_jobs_fail (apache_beam.io.gcp.bigquery_file_loads_test.BigQueryFileLoadsIT) ... ok
test_transform_on_gcs (apache_beam.io.fileio_test.MatchIntegrationTest) ... ok
test_big_query_read (apache_beam.io.gcp.bigquery_read_it_test.BigQueryReadIntegrationTests) ... ok
test_big_query_read_new_types (apache_beam.io.gcp.bigquery_read_it_test.BigQueryReadIntegrationTests) ... ok
test_multiple_destinations_transform (apache_beam.io.gcp.bigquery_test.BigQueryStreamingInsertTransformIntegrationTests) ... ok
test_multiple_destinations_transform_streaming (apache_beam.io.gcp.bigquery_test.BigQueryStreamingInsertTransformIntegrationTests) ... SKIP: TestStream is not supported on TestDataflowRunner
test_value_provider_transform (apache_beam.io.gcp.bigquery_test.BigQueryStreamingInsertTransformIntegrationTests) ... ok
test_streaming_data_only (apache_beam.io.gcp.pubsub_integration_test.PubSubIntegrationTest) ... ok
test_streaming_with_attributes (apache_beam.io.gcp.pubsub_integration_test.PubSubIntegrationTest) ... ok
test_job_python_from_python_it (apache_beam.transforms.external_test_it.ExternalTransformIT) ... ok
test_parquetio_it (apache_beam.io.parquetio_it_test.TestParquetIT) ... ok
test_big_query_legacy_sql (apache_beam.io.gcp.big_query_query_to_table_it_test.BigQueryQueryToTableIT) ... ok
test_big_query_new_types (apache_beam.io.gcp.big_query_query_to_table_it_test.BigQueryQueryToTableIT) ... ok
test_big_query_standard_sql (apache_beam.io.gcp.big_query_query_to_table_it_test.BigQueryQueryToTableIT) ... ok
test_big_query_standard_sql_kms_key_native (apache_beam.io.gcp.big_query_query_to_table_it_test.BigQueryQueryToTableIT) ... ok
test_metrics_fnapi_it (apache_beam.runners.dataflow.dataflow_exercise_metrics_pipeline_test.ExerciseMetricsPipelineTest) ... ok
test_metrics_it (apache_beam.runners.dataflow.dataflow_exercise_metrics_pipeline_test.ExerciseMetricsPipelineTest) ... ok
test_big_query_write (apache_beam.io.gcp.bigquery_write_it_test.BigQueryWriteIntegrationTests) ... ok
test_big_query_write_new_types (apache_beam.io.gcp.bigquery_write_it_test.BigQueryWriteIntegrationTests) ... ok
test_big_query_write_schema_autodetect (apache_beam.io.gcp.bigquery_write_it_test.BigQueryWriteIntegrationTests) ... SKIP: DataflowRunner does not support schema autodetection
test_big_query_write_without_schema (apache_beam.io.gcp.bigquery_write_it_test.BigQueryWriteIntegrationTests) ... ok
test_datastore_write_limit (apache_beam.io.gcp.datastore.v1new.datastore_write_it_test.DatastoreWriteIT) ... ok

----------------------------------------------------------------------
XML: <https://builds.apache.org/job/beam_PostCommit_Python3_Verify/ws/src/sdks/python/nosetests.xml>
----------------------------------------------------------------------
Ran 42 tests in 3521.301s

OK (SKIP=5)

FAILURE: Build failed with an exception.

* Where:
Build file '<https://builds.apache.org/job/beam_PostCommit_Python3_Verify/ws/src/sdks/python/test-suites/direct/py37/build.gradle'> line: 48

* What went wrong:
Execution failed for task ':sdks:python:test-suites:direct:py37:postCommitIT'.
> Process 'command 'sh'' finished with non-zero exit value 1

* Try:
Run with --stacktrace option to get the stack trace. Run with --info or --debug option to get more log output. Run with --scan to get full insights.

* Get more help at https://help.gradle.org

Deprecated Gradle features were used in this build, making it incompatible with Gradle 6.0.
Use '--warning-mode all' to show the individual deprecation warnings.
See https://docs.gradle.org/5.2.1/userguide/command_line_interface.html#sec:command_line_warnings

BUILD FAILED in 59m 38s
77 actionable tasks: 60 executed, 17 from cache

Publishing build scan...
https://gradle.com/s/aqprofhybgc3g

Build step 'Invoke Gradle script' changed build result to FAILURE
Build step 'Invoke Gradle script' marked build as failure

---------------------------------------------------------------------
To unsubscribe, e-mail: builds-unsubscribe@beam.apache.org
For additional commands, e-mail: builds-help@beam.apache.org


Jenkins build is back to normal : beam_PostCommit_Python3_Verify #1365

Posted by Apache Jenkins Server <je...@builds.apache.org>.
See <https://builds.apache.org/job/beam_PostCommit_Python3_Verify/1365/display/redirect?page=changes>


---------------------------------------------------------------------
To unsubscribe, e-mail: builds-unsubscribe@beam.apache.org
For additional commands, e-mail: builds-help@beam.apache.org


Build failed in Jenkins: beam_PostCommit_Python3_Verify #1364

Posted by Apache Jenkins Server <je...@builds.apache.org>.
See <https://builds.apache.org/job/beam_PostCommit_Python3_Verify/1364/display/redirect?page=changes>

Changes:

[ankurgoenka] [BEAM-7546] Increasing environment cache to avoid chances of recreating

------------------------------------------
[...truncated 699.11 KB...]
    "code": 503,
    "message": "Deadline exceeded",
    "status": "UNAVAILABLE"
  }
}
>
--------------------- >> end captured logging << ---------------------
Found: https://console.cloud.google.com/dataflow/jobsDetail/locations/us-central1/jobs/2019-07-15_13_34_13-2748330969440849272?project=apache-beam-testing.
<https://builds.apache.org/job/beam_PostCommit_Python3_Verify/ws/src/sdks/python/apache_beam/io/gcp/bigquery.py>:1140: BeamDeprecationWarning: options is deprecated since First stable release. References to <pipeline>.options will not be supported
Found: https://console.cloud.google.com/dataflow/jobsDetail/locations/us-central1/jobs/2019-07-15_13_49_28-4087992693309800046?project=apache-beam-testing.
Found: https://console.cloud.google.com/dataflow/jobsDetail/locations/us-central1/jobs/2019-07-15_13_59_24-11174598040377849037?project=apache-beam-testing.
  method_to_use = self._compute_method(p, p.options)
Exception in thread Thread-8:
Traceback (most recent call last):
  File "/usr/lib/python3.6/threading.py", line 916, in _bootstrap_inner
    self.run()
Found: https://console.cloud.google.com/dataflow/jobsDetail/locations/us-central1/jobs/2019-07-15_14_04_38-615844699770333321?project=apache-beam-testing.
  File "/usr/lib/python3.6/threading.py", line 864, in run
    self._target(*self._args, **self._kwargs)
  File "<https://builds.apache.org/job/beam_PostCommit_Python3_Verify/ws/src/sdks/python/apache_beam/runners/dataflow/dataflow_runner.py",> line 157, in poll_for_job_completion
    response = runner.dataflow_client.get_job(job_id)
  File "<https://builds.apache.org/job/beam_PostCommit_Python3_Verify/ws/src/sdks/python/apache_beam/utils/retry.py",> line 197, in wrapper
    return fun(*args, **kwargs)
  File "<https://builds.apache.org/job/beam_PostCommit_Python3_Verify/ws/src/sdks/python/apache_beam/runners/dataflow/internal/apiclient.py",> line 663, in get_job
    response = self._client.projects_locations_jobs.Get(request)
  File "<https://builds.apache.org/job/beam_PostCommit_Python3_Verify/ws/src/sdks/python/apache_beam/runners/dataflow/internal/clients/dataflow/dataflow_v1b3_client.py",> line 689, in Get
    config, request, global_params=global_params)
  File "<https://builds.apache.org/job/beam_PostCommit_Python3_Verify/ws/src/build/gradleenv/-1734967053/lib/python3.6/site-packages/apitools/base/py/base_api.py",> line 731, in _RunMethod
    return self.ProcessHttpResponse(method_config, http_response, request)
  File "<https://builds.apache.org/job/beam_PostCommit_Python3_Verify/ws/src/build/gradleenv/-1734967053/lib/python3.6/site-packages/apitools/base/py/base_api.py",> line 737, in ProcessHttpResponse
    self.__ProcessHttpResponse(method_config, http_response, request))
  File "<https://builds.apache.org/job/beam_PostCommit_Python3_Verify/ws/src/build/gradleenv/-1734967053/lib/python3.6/site-packages/apitools/base/py/base_api.py",> line 604, in __ProcessHttpResponse
    http_response, method_config=method_config, request=request)
apitools.base.py.exceptions.HttpNotFoundError: HttpError accessing <https://dataflow.googleapis.com/v1b3/projects/apache-beam-testing/locations/us-central1/jobs/2019-07-15_13_59_24-11174598040377849037?alt=json>: response: <{'vary': 'Origin, X-Origin, Referer', 'content-type': 'application/json; charset=UTF-8', 'date': 'Mon, 15 Jul 2019 21:00:21 GMT', 'server': 'ESF', 'cache-control': 'private', 'x-xss-protection': '0', 'x-frame-options': 'SAMEORIGIN', 'x-content-type-options': 'nosniff', 'transfer-encoding': 'chunked', 'status': '404', 'content-length': '280', '-content-encoding': 'gzip'}>, content <{
  "error": {
    "code": 404,
    "message": "(fe25c0403e5eea40): Information about job 2019-07-15_13_59_24-11174598040377849037 could not be found in our system. Please double check the id is correct. If it is please contact customer support.",
    "status": "NOT_FOUND"
  }
}
>

Found: https://console.cloud.google.com/dataflow/jobsDetail/locations/us-central1/jobs/2019-07-15_13_34_10-10596417930770503803?project=apache-beam-testing.
<https://builds.apache.org/job/beam_PostCommit_Python3_Verify/ws/src/sdks/python/apache_beam/runners/dataflow/dataflow_runner.py>:686: BeamDeprecationWarning: BigQuerySink is deprecated since 2.11.0. Use WriteToBigQuery instead.
  kms_key=transform.kms_key))
Found: https://console.cloud.google.com/dataflow/jobsDetail/locations/us-central1/jobs/2019-07-15_14_00_04-7277965286047133199?project=apache-beam-testing.
<https://builds.apache.org/job/beam_PostCommit_Python3_Verify/ws/src/sdks/python/apache_beam/io/fileio_test.py>:232: FutureWarning: MatchAll is experimental.
Found: https://console.cloud.google.com/dataflow/jobsDetail/locations/us-central1/jobs/2019-07-15_14_05_12-17751360663461478196?project=apache-beam-testing.
  | 'GetPath' >> beam.Map(lambda metadata: metadata.path))
Found: https://console.cloud.google.com/dataflow/jobsDetail/locations/us-central1/jobs/2019-07-15_14_14_42-1748767667365391987?project=apache-beam-testing.
<https://builds.apache.org/job/beam_PostCommit_Python3_Verify/ws/src/sdks/python/apache_beam/io/fileio_test.py>:243: FutureWarning: MatchAll is experimental.
  | 'Checksums' >> beam.Map(compute_hash))
<https://builds.apache.org/job/beam_PostCommit_Python3_Verify/ws/src/sdks/python/apache_beam/io/fileio_test.py>:243: FutureWarning: ReadMatches is experimental.
  | 'Checksums' >> beam.Map(compute_hash))
Exception in thread Thread-2:
Traceback (most recent call last):
  File "/usr/lib/python3.6/threading.py", line 916, in _bootstrap_inner
    self.run()
  File "/usr/lib/python3.6/threading.py", line 864, in run
    self._target(*self._args, **self._kwargs)
  File "<https://builds.apache.org/job/beam_PostCommit_Python3_Verify/ws/src/sdks/python/apache_beam/runners/dataflow/dataflow_runner.py",> line 157, in poll_for_job_completion
    response = runner.dataflow_client.get_job(job_id)
  File "<https://builds.apache.org/job/beam_PostCommit_Python3_Verify/ws/src/sdks/python/apache_beam/utils/retry.py",> line 197, in wrapper
    return fun(*args, **kwargs)
  File "<https://builds.apache.org/job/beam_PostCommit_Python3_Verify/ws/src/sdks/python/apache_beam/runners/dataflow/internal/apiclient.py",> line 663, in get_job
    response = self._client.projects_locations_jobs.Get(request)
  File "<https://builds.apache.org/job/beam_PostCommit_Python3_Verify/ws/src/sdks/python/apache_beam/runners/dataflow/internal/clients/dataflow/dataflow_v1b3_client.py",> line 689, in Get
    config, request, global_params=global_params)
  File "<https://builds.apache.org/job/beam_PostCommit_Python3_Verify/ws/src/build/gradleenv/-1734967053/lib/python3.6/site-packages/apitools/base/py/base_api.py",> line 731, in _RunMethod
    return self.ProcessHttpResponse(method_config, http_response, request)
  File "<https://builds.apache.org/job/beam_PostCommit_Python3_Verify/ws/src/build/gradleenv/-1734967053/lib/python3.6/site-packages/apitools/base/py/base_api.py",> line 737, in ProcessHttpResponse
    self.__ProcessHttpResponse(method_config, http_response, request))
  File "<https://builds.apache.org/job/beam_PostCommit_Python3_Verify/ws/src/build/gradleenv/-1734967053/lib/python3.6/site-packages/apitools/base/py/base_api.py",> line 604, in __ProcessHttpResponse
    http_response, method_config=method_config, request=request)
apitools.base.py.exceptions.HttpNotFoundError: HttpError accessing <https://dataflow.googleapis.com/v1b3/projects/apache-beam-testing/locations/us-central1/jobs/2019-07-15_14_00_04-7277965286047133199?alt=json>: response: <{'vary': 'Origin, X-Origin, Referer', 'content-type': 'application/json; charset=UTF-8', 'date': 'Mon, 15 Jul 2019 21:01:48 GMT', 'server': 'ESF', 'cache-control': 'private', 'x-xss-protection': '0', 'x-frame-options': 'SAMEORIGIN', 'x-content-type-options': 'nosniff', 'transfer-encoding': 'chunked', 'status': '404', 'content-length': '279', '-content-encoding': 'gzip'}>, content <{
  "error": {
    "code": 404,
    "message": "(2105b0c88aab7081): Information about job 2019-07-15_14_00_04-7277965286047133199 could not be found in our system. Please double check the id is correct. If it is please contact customer support.",
    "status": "NOT_FOUND"
  }
}
>

Found: https://console.cloud.google.com/dataflow/jobsDetail/locations/us-central1/jobs/2019-07-15_13_34_09-4074325465559482877?project=apache-beam-testing.
<https://builds.apache.org/job/beam_PostCommit_Python3_Verify/ws/src/sdks/python/apache_beam/io/gcp/bigquery.py>:1140: BeamDeprecationWarning: options is deprecated since First stable release. References to <pipeline>.options will not be supported
Found: https://console.cloud.google.com/dataflow/jobsDetail/locations/us-central1/jobs/2019-07-15_13_48_55-15304949438228004625?project=apache-beam-testing.
  method_to_use = self._compute_method(p, p.options)
Exception in thread Thread-13:
Traceback (most recent call last):
Found: https://console.cloud.google.com/dataflow/jobsDetail/locations/us-central1/jobs/2019-07-15_13_58_17-13906717044814748560?project=apache-beam-testing.
  File "/usr/lib/python3.6/threading.py", line 916, in _bootstrap_inner
    self.run()
Found: https://console.cloud.google.com/dataflow/jobsDetail/locations/us-central1/jobs/2019-07-15_14_07_27-12126685002566637518?project=apache-beam-testing.
  File "/usr/lib/python3.6/threading.py", line 864, in run
    self._target(*self._args, **self._kwargs)
  File "<https://builds.apache.org/job/beam_PostCommit_Python3_Verify/ws/src/sdks/python/apache_beam/runners/dataflow/dataflow_runner.py",> line 157, in poll_for_job_completion
    response = runner.dataflow_client.get_job(job_id)
  File "<https://builds.apache.org/job/beam_PostCommit_Python3_Verify/ws/src/sdks/python/apache_beam/utils/retry.py",> line 197, in wrapper
    return fun(*args, **kwargs)
  File "<https://builds.apache.org/job/beam_PostCommit_Python3_Verify/ws/src/sdks/python/apache_beam/runners/dataflow/internal/apiclient.py",> line 663, in get_job
    response = self._client.projects_locations_jobs.Get(request)
  File "<https://builds.apache.org/job/beam_PostCommit_Python3_Verify/ws/src/sdks/python/apache_beam/runners/dataflow/internal/clients/dataflow/dataflow_v1b3_client.py",> line 689, in Get
    config, request, global_params=global_params)
  File "<https://builds.apache.org/job/beam_PostCommit_Python3_Verify/ws/src/build/gradleenv/-1734967053/lib/python3.6/site-packages/apitools/base/py/base_api.py",> line 731, in _RunMethod
    return self.ProcessHttpResponse(method_config, http_response, request)
  File "<https://builds.apache.org/job/beam_PostCommit_Python3_Verify/ws/src/build/gradleenv/-1734967053/lib/python3.6/site-packages/apitools/base/py/base_api.py",> line 737, in ProcessHttpResponse
    self.__ProcessHttpResponse(method_config, http_response, request))
  File "<https://builds.apache.org/job/beam_PostCommit_Python3_Verify/ws/src/build/gradleenv/-1734967053/lib/python3.6/site-packages/apitools/base/py/base_api.py",> line 604, in __ProcessHttpResponse
    http_response, method_config=method_config, request=request)
apitools.base.py.exceptions.HttpNotFoundError: HttpError accessing <https://dataflow.googleapis.com/v1b3/projects/apache-beam-testing/locations/us-central1/jobs/2019-07-15_13_58_17-13906717044814748560?alt=json>: response: <{'vary': 'Origin, X-Origin, Referer', 'content-type': 'application/json; charset=UTF-8', 'date': 'Mon, 15 Jul 2019 21:01:42 GMT', 'server': 'ESF', 'cache-control': 'private', 'x-xss-protection': '0', 'x-frame-options': 'SAMEORIGIN', 'x-content-type-options': 'nosniff', 'transfer-encoding': 'chunked', 'status': '404', 'content-length': '280', '-content-encoding': 'gzip'}>, content <{
  "error": {
    "code": 404,
    "message": "(678f9943c509ff31): Information about job 2019-07-15_13_58_17-13906717044814748560 could not be found in our system. Please double check the id is correct. If it is please contact customer support.",
    "status": "NOT_FOUND"
  }
}
>

Found: https://console.cloud.google.com/dataflow/jobsDetail/locations/us-central1/jobs/2019-07-15_13_34_07-9004523324893492702?project=apache-beam-testing.
Found: https://console.cloud.google.com/dataflow/jobsDetail/locations/us-central1/jobs/2019-07-15_13_57_28-18334043715024226238?project=apache-beam-testing.
<https://builds.apache.org/job/beam_PostCommit_Python3_Verify/ws/src/sdks/python/apache_beam/runners/dataflow/dataflow_runner.py>:686: BeamDeprecationWarning: BigQuerySink is deprecated since 2.11.0. Use WriteToBigQuery instead.
  kms_key=transform.kms_key))
Found: https://console.cloud.google.com/dataflow/jobsDetail/locations/us-central1/jobs/2019-07-15_14_07_40-14148828240002570050?project=apache-beam-testing.
Found: https://console.cloud.google.com/dataflow/jobsDetail/locations/us-central1/jobs/2019-07-15_14_17_32-841627303778574064?project=apache-beam-testing.
Found: https://console.cloud.google.com/dataflow/jobsDetail/locations/us-central1/jobs/2019-07-15_13_34_11-18441051954717508481?project=apache-beam-testing.
<https://builds.apache.org/job/beam_PostCommit_Python3_Verify/ws/src/sdks/python/apache_beam/io/gcp/bigquery.py>:1140: BeamDeprecationWarning: options is deprecated since First stable release. References to <pipeline>.options will not be supported
  method_to_use = self._compute_method(p, p.options)
Found: https://console.cloud.google.com/dataflow/jobsDetail/locations/us-central1/jobs/2019-07-15_13_44_02-14334618274976561980?project=apache-beam-testing.
Found: https://console.cloud.google.com/dataflow/jobsDetail/locations/us-central1/jobs/2019-07-15_13_54_54-15226142334993829296?project=apache-beam-testing.
<https://builds.apache.org/job/beam_PostCommit_Python3_Verify/ws/src/sdks/python/apache_beam/io/gcp/bigquery_file_loads.py>:557: BeamDeprecationWarning: options is deprecated since First stable release. References to <pipeline>.options will not be supported
Found: https://console.cloud.google.com/dataflow/jobsDetail/locations/us-central1/jobs/2019-07-15_14_03_58-10311582230082828709?project=apache-beam-testing.
  temp_location = p.options.view_as(GoogleCloudOptions).temp_location
Found: https://console.cloud.google.com/dataflow/jobsDetail/locations/us-central1/jobs/2019-07-15_13_34_06-2877512301953450693?project=apache-beam-testing.
Found: https://console.cloud.google.com/dataflow/jobsDetail/locations/us-central1/jobs/2019-07-15_13_44_48-8440473175578534966?project=apache-beam-testing.
<https://builds.apache.org/job/beam_PostCommit_Python3_Verify/ws/src/sdks/python/apache_beam/runners/dataflow/dataflow_runner.py>:686: BeamDeprecationWarning: BigQuerySink is deprecated since 2.11.0. Use WriteToBigQuery instead.
Found: https://console.cloud.google.com/dataflow/jobsDetail/locations/us-central1/jobs/2019-07-15_13_54_50-14796381776467043442?project=apache-beam-testing.
  kms_key=transform.kms_key))
Exception in thread Thread-3:
Traceback (most recent call last):
Found: https://console.cloud.google.com/dataflow/jobsDetail/locations/us-central1/jobs/2019-07-15_14_02_47-15578659434726346930?project=apache-beam-testing.
Found: https://console.cloud.google.com/dataflow/jobsDetail/locations/us-central1/jobs/2019-07-15_14_12_10-4242382166623498383?project=apache-beam-testing.
  File "/usr/lib/python3.6/threading.py", line 916, in _bootstrap_inner
    self.run()
  File "/usr/lib/python3.6/threading.py", line 864, in run
    self._target(*self._args, **self._kwargs)
  File "<https://builds.apache.org/job/beam_PostCommit_Python3_Verify/ws/src/sdks/python/apache_beam/runners/dataflow/dataflow_runner.py",> line 157, in poll_for_job_completion
    response = runner.dataflow_client.get_job(job_id)
  File "<https://builds.apache.org/job/beam_PostCommit_Python3_Verify/ws/src/sdks/python/apache_beam/utils/retry.py",> line 197, in wrapper
    return fun(*args, **kwargs)
  File "<https://builds.apache.org/job/beam_PostCommit_Python3_Verify/ws/src/sdks/python/apache_beam/runners/dataflow/internal/apiclient.py",> line 663, in get_job
    response = self._client.projects_locations_jobs.Get(request)
  File "<https://builds.apache.org/job/beam_PostCommit_Python3_Verify/ws/src/sdks/python/apache_beam/runners/dataflow/internal/clients/dataflow/dataflow_v1b3_client.py",> line 689, in Get
    config, request, global_params=global_params)
  File "<https://builds.apache.org/job/beam_PostCommit_Python3_Verify/ws/src/build/gradleenv/-1734967053/lib/python3.6/site-packages/apitools/base/py/base_api.py",> line 731, in _RunMethod
    return self.ProcessHttpResponse(method_config, http_response, request)
  File "<https://builds.apache.org/job/beam_PostCommit_Python3_Verify/ws/src/build/gradleenv/-1734967053/lib/python3.6/site-packages/apitools/base/py/base_api.py",> line 737, in ProcessHttpResponse
    self.__ProcessHttpResponse(method_config, http_response, request))
  File "<https://builds.apache.org/job/beam_PostCommit_Python3_Verify/ws/src/build/gradleenv/-1734967053/lib/python3.6/site-packages/apitools/base/py/base_api.py",> line 604, in __ProcessHttpResponse
    http_response, method_config=method_config, request=request)
apitools.base.py.exceptions.HttpNotFoundError: HttpError accessing <https://dataflow.googleapis.com/v1b3/projects/apache-beam-testing/locations/us-central1/jobs/2019-07-15_13_54_50-14796381776467043442?alt=json>: response: <{'vary': 'Origin, X-Origin, Referer', 'content-type': 'application/json; charset=UTF-8', 'date': 'Mon, 15 Jul 2019 21:01:34 GMT', 'server': 'ESF', 'cache-control': 'private', 'x-xss-protection': '0', 'x-frame-options': 'SAMEORIGIN', 'x-content-type-options': 'nosniff', 'transfer-encoding': 'chunked', 'status': '404', 'content-length': '280', '-content-encoding': 'gzip'}>, content <{
  "error": {
    "code": 404,
    "message": "(86646b494fcb2bfe): Information about job 2019-07-15_13_54_50-14796381776467043442 could not be found in our system. Please double check the id is correct. If it is please contact customer support.",
    "status": "NOT_FOUND"
  }
}
>

<https://builds.apache.org/job/beam_PostCommit_Python3_Verify/ws/src/sdks/python/apache_beam/io/gcp/big_query_query_to_table_pipeline.py>:73: BeamDeprecationWarning: BigQuerySink is deprecated since 2.11.0. Use WriteToBigQuery instead.
  kms_key=kms_key))
Found: https://console.cloud.google.com/dataflow/jobsDetail/locations/us-central1/jobs/2019-07-15_13_34_09-15669051596316880822?project=apache-beam-testing.
<https://builds.apache.org/job/beam_PostCommit_Python3_Verify/ws/src/sdks/python/apache_beam/io/gcp/bigquery.py>:1140: BeamDeprecationWarning: options is deprecated since First stable release. References to <pipeline>.options will not be supported
Found: https://console.cloud.google.com/dataflow/jobsDetail/locations/us-central1/jobs/2019-07-15_13_45_26-152725580490209180?project=apache-beam-testing.
Found: https://console.cloud.google.com/dataflow/jobsDetail/locations/us-central1/jobs/2019-07-15_13_56_27-5710196702105582670?project=apache-beam-testing.
  method_to_use = self._compute_method(p, p.options)
Found: https://console.cloud.google.com/dataflow/jobsDetail/locations/us-central1/jobs/2019-07-15_14_05_15-12476039522508688686?project=apache-beam-testing.
<https://builds.apache.org/job/beam_PostCommit_Python3_Verify/ws/src/sdks/python/apache_beam/io/gcp/bigquery_file_loads.py>:557: BeamDeprecationWarning: options is deprecated since First stable release. References to <pipeline>.options will not be supported
  temp_location = p.options.view_as(GoogleCloudOptions).temp_location
Found: https://console.cloud.google.com/dataflow/jobsDetail/locations/us-central1/jobs/2019-07-15_13_34_09-1669758744994612634?project=apache-beam-testing.
Found: https://console.cloud.google.com/dataflow/jobsDetail/locations/us-central1/jobs/2019-07-15_13_44_21-4646476649173009222?project=apache-beam-testing.
Found: https://console.cloud.google.com/dataflow/jobsDetail/locations/us-central1/jobs/2019-07-15_13_52_16-2750821415681720474?project=apache-beam-testing.
Found: https://console.cloud.google.com/dataflow/jobsDetail/locations/us-central1/jobs/2019-07-15_14_02_17-8587066764866235873?project=apache-beam-testing.
Found: https://console.cloud.google.com/dataflow/jobsDetail/locations/us-central1/jobs/2019-07-15_14_12_42-1974006278801319050?project=apache-beam-testing.
Found: https://console.cloud.google.com/dataflow/jobsDetail/locations/us-central1/jobs/2019-07-15_14_20_53-6307722895216796096?project=apache-beam-testing.

----------------------------------------------------------------------
XML: <https://builds.apache.org/job/beam_PostCommit_Python3_Verify/ws/src/sdks/python/nosetests.xml>
----------------------------------------------------------------------
Ran 42 tests in 3445.151s

FAILED (SKIP=5, failures=3)

> Task :sdks:python:test-suites:dataflow:py36:postCommitIT FAILED

FAILURE: Build completed with 3 failures.

1: Task failed with an exception.
-----------
* Where:
Build file '<https://builds.apache.org/job/beam_PostCommit_Python3_Verify/ws/src/sdks/python/test-suites/dataflow/py35/build.gradle'> line: 48

* What went wrong:
Execution failed for task ':sdks:python:test-suites:dataflow:py35:postCommitIT'.
> Process 'command 'sh'' finished with non-zero exit value 1

* Try:
Run with --stacktrace option to get the stack trace. Run with --info or --debug option to get more log output. Run with --scan to get full insights.
==============================================================================

2: Task failed with an exception.
-----------
* Where:
Build file '<https://builds.apache.org/job/beam_PostCommit_Python3_Verify/ws/src/sdks/python/test-suites/dataflow/py37/build.gradle'> line: 78

* What went wrong:
Execution failed for task ':sdks:python:test-suites:dataflow:py37:postCommitIT'.
> Process 'command 'sh'' finished with non-zero exit value 1

* Try:
Run with --stacktrace option to get the stack trace. Run with --info or --debug option to get more log output. Run with --scan to get full insights.
==============================================================================

3: Task failed with an exception.
-----------
* Where:
Build file '<https://builds.apache.org/job/beam_PostCommit_Python3_Verify/ws/src/sdks/python/test-suites/dataflow/py36/build.gradle'> line: 48

* What went wrong:
Execution failed for task ':sdks:python:test-suites:dataflow:py36:postCommitIT'.
> Process 'command 'sh'' finished with non-zero exit value 1

* Try:
Run with --stacktrace option to get the stack trace. Run with --info or --debug option to get more log output. Run with --scan to get full insights.
==============================================================================

* Get more help at https://help.gradle.org

Deprecated Gradle features were used in this build, making it incompatible with Gradle 6.0.
Use '--warning-mode all' to show the individual deprecation warnings.
See https://docs.gradle.org/5.2.1/userguide/command_line_interface.html#sec:command_line_warnings

BUILD FAILED in 58m 51s
77 actionable tasks: 65 executed, 12 from cache

Publishing build scan...
https://gradle.com/s/gu3nmftaruv6a

Build step 'Invoke Gradle script' changed build result to FAILURE
Build step 'Invoke Gradle script' marked build as failure

---------------------------------------------------------------------
To unsubscribe, e-mail: builds-unsubscribe@beam.apache.org
For additional commands, e-mail: builds-help@beam.apache.org


Build failed in Jenkins: beam_PostCommit_Python3_Verify #1363

Posted by Apache Jenkins Server <je...@builds.apache.org>.
See <https://builds.apache.org/job/beam_PostCommit_Python3_Verify/1363/display/redirect?page=changes>

Changes:

[boyuanz] Add estimate_size() to source_test.LineSource

[boyuanz] fix lint

[boyuanz] Add _get_file_size and UT

------------------------------------------
[...truncated 711.66 KB...]
root: INFO: 2019-07-15T20:01:36.980Z: JOB_MESSAGE_BASIC: Executing operation WriteWithMultipleDests2/BigQueryBatchFileLoads/CreateFilePrefixView/Read+WriteWithMultipleDests2/BigQueryBatchFileLoads/GenerateFilePrefix
root: INFO: 2019-07-15T20:01:36.993Z: JOB_MESSAGE_DEBUG: Starting worker pool setup.
root: INFO: 2019-07-15T20:01:37.024Z: JOB_MESSAGE_BASIC: Executing operation WriteWithMultipleDests2/BigQueryBatchFileLoads/GroupShardedRows/Create
root: INFO: 2019-07-15T20:01:37.037Z: JOB_MESSAGE_BASIC: Starting 1 workers in us-central1-a...
root: INFO: 2019-07-15T20:01:37.066Z: JOB_MESSAGE_BASIC: Executing operation WriteWithMultipleDests2/BigQueryBatchFileLoads/GroupFilesByTableDestinations/Create
root: INFO: 2019-07-15T20:01:37.111Z: JOB_MESSAGE_BASIC: Executing operation WriteWithMultipleDests2/BigQueryBatchFileLoads/RemoveTempTables/DeduplicateTables/Create
root: INFO: 2019-07-15T20:01:37.123Z: JOB_MESSAGE_BASIC: Finished operation WriteWithMultipleDests2/BigQueryBatchFileLoads/GroupShardedRows/Create
root: INFO: 2019-07-15T20:01:37.123Z: JOB_MESSAGE_BASIC: Finished operation WriteWithMultipleDests2/BigQueryBatchFileLoads/GroupFilesByTableDestinations/Create
root: INFO: 2019-07-15T20:01:37.175Z: JOB_MESSAGE_BASIC: Finished operation WriteWithMultipleDests2/BigQueryBatchFileLoads/RemoveTempTables/DeduplicateTables/Create
root: INFO: 2019-07-15T20:01:37.218Z: JOB_MESSAGE_DEBUG: Value "WriteWithMultipleDests2/BigQueryBatchFileLoads/GroupShardedRows/Session" materialized.
root: INFO: 2019-07-15T20:01:37.268Z: JOB_MESSAGE_DEBUG: Value "WriteWithMultipleDests2/BigQueryBatchFileLoads/GroupFilesByTableDestinations/Session" materialized.
root: INFO: 2019-07-15T20:01:37.316Z: JOB_MESSAGE_DEBUG: Value "WriteWithMultipleDests2/BigQueryBatchFileLoads/RemoveTempTables/DeduplicateTables/Session" materialized.
root: INFO: 2019-07-15T20:01:37.339Z: JOB_MESSAGE_BASIC: Worker configuration: n1-standard-1 in us-central1-a.
root: INFO: 2019-07-15T20:03:37.496Z: JOB_MESSAGE_DETAILED: Autoscaling: Raised the number of workers to 1 based on the rate of progress in the currently running step(s).
root: INFO: 2019-07-15T20:04:13.143Z: JOB_MESSAGE_DETAILED: Workers have started successfully.
root: INFO: 2019-07-15T20:04:13.177Z: JOB_MESSAGE_DETAILED: Workers have started successfully.
root: INFO: 2019-07-15T20:04:37.400Z: JOB_MESSAGE_BASIC: Worker configuration: n1-standard-1 in us-central1-a.
root: INFO: 2019-07-15T20:07:36.785Z: JOB_MESSAGE_DETAILED: Checking permissions granted to controller Service Account.
root: INFO: 2019-07-15T20:07:37.300Z: JOB_MESSAGE_BASIC: Worker configuration: n1-standard-1 in us-central1-a.
root: INFO: 2019-07-15T20:07:58.913Z: JOB_MESSAGE_BASIC: Finished operation WriteWithMultipleDests2/BigQueryBatchFileLoads/CreateFilePrefixView/Read+WriteWithMultipleDests2/BigQueryBatchFileLoads/GenerateFilePrefix
root: INFO: 2019-07-15T20:07:59.006Z: JOB_MESSAGE_DEBUG: Value "WriteWithMultipleDests2/BigQueryBatchFileLoads/GenerateFilePrefix.out" materialized.
root: INFO: 2019-07-15T20:07:59.099Z: JOB_MESSAGE_BASIC: Executing operation WriteWithMultipleDests2/BigQueryBatchFileLoads/WriteGroupedRecordsToFile/_UnpickledSideInput(GenerateFilePrefix.out.0)
root: INFO: 2019-07-15T20:07:59.136Z: JOB_MESSAGE_BASIC: Executing operation WriteWithMultipleDests2/BigQueryBatchFileLoads/ParDo(WriteRecordsToFile)/ParDo(WriteRecordsToFile)/_UnpickledSideInput(GenerateFilePrefix.out.0)
root: INFO: 2019-07-15T20:07:59.170Z: JOB_MESSAGE_BASIC: Finished operation WriteWithMultipleDests2/BigQueryBatchFileLoads/WriteGroupedRecordsToFile/_UnpickledSideInput(GenerateFilePrefix.out.0)
root: INFO: 2019-07-15T20:07:59.196Z: JOB_MESSAGE_BASIC: Finished operation WriteWithMultipleDests2/BigQueryBatchFileLoads/ParDo(WriteRecordsToFile)/ParDo(WriteRecordsToFile)/_UnpickledSideInput(GenerateFilePrefix.out.0)
root: INFO: 2019-07-15T20:07:59.256Z: JOB_MESSAGE_DEBUG: Value "WriteWithMultipleDests2/BigQueryBatchFileLoads/WriteGroupedRecordsToFile/_UnpickledSideInput(GenerateFilePrefix.out.0).output" materialized.
root: INFO: 2019-07-15T20:07:59.303Z: JOB_MESSAGE_DEBUG: Value "WriteWithMultipleDests2/BigQueryBatchFileLoads/ParDo(WriteRecordsToFile)/ParDo(WriteRecordsToFile)/_UnpickledSideInput(GenerateFilePrefix.out.0).output" materialized.
root: INFO: 2019-07-15T20:07:59.400Z: JOB_MESSAGE_BASIC: Executing operation Create/Read+WriteWithMultipleDests/AppendDestination+WriteWithMultipleDests2/BigQueryBatchFileLoads/ApplyGlobalWindow+WriteWithMultipleDests2/BigQueryBatchFileLoads/AppendDestination+WriteWithMultipleDests2/BigQueryBatchFileLoads/ParDo(WriteRecordsToFile)/ParDo(WriteRecordsToFile)/ParDo(WriteRecordsToFile)+WriteWithMultipleDests2/BigQueryBatchFileLoads/GroupFilesByTableDestinations/Reify+WriteWithMultipleDests2/BigQueryBatchFileLoads/GroupFilesByTableDestinations/Write+WriteWithMultipleDests/StreamInsertRows/ParDo(BigQueryWriteFn)+WriteWithMultipleDests2/BigQueryBatchFileLoads/ParDo(_ShardDestinations)+WriteWithMultipleDests2/BigQueryBatchFileLoads/GroupShardedRows/Reify+WriteWithMultipleDests2/BigQueryBatchFileLoads/GroupShardedRows/Write
root: INFO: 2019-07-15T20:08:02.434Z: JOB_MESSAGE_BASIC: Finished operation WriteWithMultipleDests2/BigQueryBatchFileLoads/ImpulseJobName/Read+WriteWithMultipleDests2/BigQueryBatchFileLoads/Map(<lambda at bigquery_file_loads.py:562>)
root: INFO: 2019-07-15T20:08:02.509Z: JOB_MESSAGE_DEBUG: Value "WriteWithMultipleDests2/BigQueryBatchFileLoads/Map(<lambda at bigquery_file_loads.py:562>).out" materialized.
root: INFO: 2019-07-15T20:08:02.599Z: JOB_MESSAGE_BASIC: Executing operation WriteWithMultipleDests2/BigQueryBatchFileLoads/ParDo(TriggerLoadJobs)/ParDo(TriggerLoadJobs)/_UnpickledSideInput(Map(<lambda at bigquery_file_loads.py:562>).out.0)
root: INFO: 2019-07-15T20:08:02.648Z: JOB_MESSAGE_BASIC: Executing operation WriteWithMultipleDests2/BigQueryBatchFileLoads/ParDo(TriggerCopyJobs)/_UnpickledSideInput(Map(<lambda at bigquery_file_loads.py:562>).out.0)
root: INFO: 2019-07-15T20:08:02.654Z: JOB_MESSAGE_BASIC: Finished operation WriteWithMultipleDests2/BigQueryBatchFileLoads/ParDo(TriggerLoadJobs)/ParDo(TriggerLoadJobs)/_UnpickledSideInput(Map(<lambda at bigquery_file_loads.py:562>).out.0)
root: INFO: 2019-07-15T20:08:02.703Z: JOB_MESSAGE_BASIC: Finished operation WriteWithMultipleDests2/BigQueryBatchFileLoads/ParDo(TriggerCopyJobs)/_UnpickledSideInput(Map(<lambda at bigquery_file_loads.py:562>).out.0)
root: INFO: 2019-07-15T20:08:02.729Z: JOB_MESSAGE_DEBUG: Value "WriteWithMultipleDests2/BigQueryBatchFileLoads/ParDo(TriggerLoadJobs)/ParDo(TriggerLoadJobs)/_UnpickledSideInput(Map(<lambda at bigquery_file_loads.py:562>).out.0).output" materialized.
root: INFO: 2019-07-15T20:08:02.800Z: JOB_MESSAGE_DEBUG: Value "WriteWithMultipleDests2/BigQueryBatchFileLoads/ParDo(TriggerCopyJobs)/_UnpickledSideInput(Map(<lambda at bigquery_file_loads.py:562>).out.0).output" materialized.
root: INFO: 2019-07-15T20:08:22.554Z: JOB_MESSAGE_BASIC: Finished operation Create/Read+WriteWithMultipleDests/AppendDestination+WriteWithMultipleDests2/BigQueryBatchFileLoads/ApplyGlobalWindow+WriteWithMultipleDests2/BigQueryBatchFileLoads/AppendDestination+WriteWithMultipleDests2/BigQueryBatchFileLoads/ParDo(WriteRecordsToFile)/ParDo(WriteRecordsToFile)/ParDo(WriteRecordsToFile)+WriteWithMultipleDests2/BigQueryBatchFileLoads/GroupFilesByTableDestinations/Reify+WriteWithMultipleDests2/BigQueryBatchFileLoads/GroupFilesByTableDestinations/Write+WriteWithMultipleDests/StreamInsertRows/ParDo(BigQueryWriteFn)+WriteWithMultipleDests2/BigQueryBatchFileLoads/ParDo(_ShardDestinations)+WriteWithMultipleDests2/BigQueryBatchFileLoads/GroupShardedRows/Reify+WriteWithMultipleDests2/BigQueryBatchFileLoads/GroupShardedRows/Write
root: INFO: 2019-07-15T20:08:22.655Z: JOB_MESSAGE_BASIC: Executing operation WriteWithMultipleDests2/BigQueryBatchFileLoads/GroupShardedRows/Close
root: INFO: 2019-07-15T20:08:22.720Z: JOB_MESSAGE_BASIC: Finished operation WriteWithMultipleDests2/BigQueryBatchFileLoads/GroupShardedRows/Close
root: INFO: 2019-07-15T20:08:22.798Z: JOB_MESSAGE_BASIC: Executing operation WriteWithMultipleDests2/BigQueryBatchFileLoads/GroupShardedRows/Read+WriteWithMultipleDests2/BigQueryBatchFileLoads/GroupShardedRows/GroupByWindow+WriteWithMultipleDests2/BigQueryBatchFileLoads/DropShardNumber+WriteWithMultipleDests2/BigQueryBatchFileLoads/WriteGroupedRecordsToFile/WriteGroupedRecordsToFile+WriteWithMultipleDests2/BigQueryBatchFileLoads/GroupFilesByTableDestinations/Reify+WriteWithMultipleDests2/BigQueryBatchFileLoads/GroupFilesByTableDestinations/Write
root: INFO: 2019-07-15T20:08:25.909Z: JOB_MESSAGE_BASIC: Finished operation WriteWithMultipleDests2/BigQueryBatchFileLoads/GroupShardedRows/Read+WriteWithMultipleDests2/BigQueryBatchFileLoads/GroupShardedRows/GroupByWindow+WriteWithMultipleDests2/BigQueryBatchFileLoads/DropShardNumber+WriteWithMultipleDests2/BigQueryBatchFileLoads/WriteGroupedRecordsToFile/WriteGroupedRecordsToFile+WriteWithMultipleDests2/BigQueryBatchFileLoads/GroupFilesByTableDestinations/Reify+WriteWithMultipleDests2/BigQueryBatchFileLoads/GroupFilesByTableDestinations/Write
root: INFO: 2019-07-15T20:08:26.023Z: JOB_MESSAGE_BASIC: Executing operation WriteWithMultipleDests2/BigQueryBatchFileLoads/GroupFilesByTableDestinations/Close
root: INFO: 2019-07-15T20:08:26.093Z: JOB_MESSAGE_BASIC: Finished operation WriteWithMultipleDests2/BigQueryBatchFileLoads/GroupFilesByTableDestinations/Close
root: INFO: 2019-07-15T20:08:26.191Z: JOB_MESSAGE_BASIC: Executing operation WriteWithMultipleDests2/BigQueryBatchFileLoads/GroupFilesByTableDestinations/Read+WriteWithMultipleDests2/BigQueryBatchFileLoads/GroupFilesByTableDestinations/GroupByWindow+WriteWithMultipleDests2/BigQueryBatchFileLoads/ParDo(TriggerLoadJobs)/ParDo(TriggerLoadJobs)/ParDo(TriggerLoadJobs)
root: INFO: 2019-07-15T20:08:41.756Z: JOB_MESSAGE_BASIC: Finished operation WriteWithMultipleDests2/BigQueryBatchFileLoads/GroupFilesByTableDestinations/Read+WriteWithMultipleDests2/BigQueryBatchFileLoads/GroupFilesByTableDestinations/GroupByWindow+WriteWithMultipleDests2/BigQueryBatchFileLoads/ParDo(TriggerLoadJobs)/ParDo(TriggerLoadJobs)/ParDo(TriggerLoadJobs)
root: INFO: 2019-07-15T20:08:41.832Z: JOB_MESSAGE_DEBUG: Value "WriteWithMultipleDests2/BigQueryBatchFileLoads/ParDo(TriggerLoadJobs)/ParDo(TriggerLoadJobs).out" materialized.
root: INFO: 2019-07-15T20:08:41.870Z: JOB_MESSAGE_DEBUG: Value "WriteWithMultipleDests2/BigQueryBatchFileLoads/ParDo(TriggerLoadJobs)/ParDo(TriggerLoadJobs).TemporaryTables" materialized.
root: INFO: 2019-07-15T20:08:41.918Z: JOB_MESSAGE_BASIC: Executing operation WriteWithMultipleDests2/BigQueryBatchFileLoads/WaitForLoadJobs/_UnpickledSideInput(ParDo(TriggerLoadJobs).out.0)
root: INFO: 2019-07-15T20:08:41.978Z: JOB_MESSAGE_BASIC: Executing operation WriteWithMultipleDests2/BigQueryBatchFileLoads/RemoveTempTables/PassTables/_UnpickledSideInput(ParDo(TriggerLoadJobs).TemporaryTables.0)
root: INFO: 2019-07-15T20:08:41.987Z: JOB_MESSAGE_BASIC: Finished operation WriteWithMultipleDests2/BigQueryBatchFileLoads/WaitForLoadJobs/_UnpickledSideInput(ParDo(TriggerLoadJobs).out.0)
root: INFO: 2019-07-15T20:08:42.037Z: JOB_MESSAGE_BASIC: Finished operation WriteWithMultipleDests2/BigQueryBatchFileLoads/RemoveTempTables/PassTables/_UnpickledSideInput(ParDo(TriggerLoadJobs).TemporaryTables.0)
root: INFO: 2019-07-15T20:08:42.083Z: JOB_MESSAGE_DEBUG: Value "WriteWithMultipleDests2/BigQueryBatchFileLoads/WaitForLoadJobs/_UnpickledSideInput(ParDo(TriggerLoadJobs).out.0).output" materialized.
root: INFO: 2019-07-15T20:08:42.130Z: JOB_MESSAGE_DEBUG: Value "WriteWithMultipleDests2/BigQueryBatchFileLoads/RemoveTempTables/PassTables/_UnpickledSideInput(ParDo(TriggerLoadJobs).TemporaryTables.0).output" materialized.
root: INFO: 2019-07-15T20:08:42.164Z: JOB_MESSAGE_BASIC: Executing operation WriteWithMultipleDests2/BigQueryBatchFileLoads/ImpulseMonitorLoadJobs/Read+WriteWithMultipleDests2/BigQueryBatchFileLoads/WaitForLoadJobs/WaitForLoadJobs+WriteWithMultipleDests2/BigQueryBatchFileLoads/ParDo(TriggerCopyJobs)/ParDo(TriggerCopyJobs)
root: INFO: 2019-07-15T20:08:49.397Z: JOB_MESSAGE_BASIC: Finished operation WriteWithMultipleDests2/BigQueryBatchFileLoads/ImpulseMonitorLoadJobs/Read+WriteWithMultipleDests2/BigQueryBatchFileLoads/WaitForLoadJobs/WaitForLoadJobs+WriteWithMultipleDests2/BigQueryBatchFileLoads/ParDo(TriggerCopyJobs)/ParDo(TriggerCopyJobs)
root: INFO: 2019-07-15T20:08:49.486Z: JOB_MESSAGE_DEBUG: Value "WriteWithMultipleDests2/BigQueryBatchFileLoads/ParDo(TriggerCopyJobs).out" materialized.
root: INFO: 2019-07-15T20:08:49.569Z: JOB_MESSAGE_BASIC: Executing operation WriteWithMultipleDests2/BigQueryBatchFileLoads/WaitForCopyJobs/_UnpickledSideInput(ParDo(TriggerCopyJobs).out.0)
root: INFO: 2019-07-15T20:08:49.629Z: JOB_MESSAGE_BASIC: Finished operation WriteWithMultipleDests2/BigQueryBatchFileLoads/WaitForCopyJobs/_UnpickledSideInput(ParDo(TriggerCopyJobs).out.0)
root: INFO: 2019-07-15T20:08:49.710Z: JOB_MESSAGE_DEBUG: Value "WriteWithMultipleDests2/BigQueryBatchFileLoads/WaitForCopyJobs/_UnpickledSideInput(ParDo(TriggerCopyJobs).out.0).output" materialized.
root: INFO: 2019-07-15T20:08:49.807Z: JOB_MESSAGE_BASIC: Executing operation WriteWithMultipleDests2/BigQueryBatchFileLoads/ImpulseMonitorCopyJobs/Read+WriteWithMultipleDests2/BigQueryBatchFileLoads/WaitForCopyJobs/WaitForCopyJobs+WriteWithMultipleDests2/BigQueryBatchFileLoads/RemoveTempTables/PassTables/PassTables+WriteWithMultipleDests2/BigQueryBatchFileLoads/RemoveTempTables/AddUselessValue+WriteWithMultipleDests2/BigQueryBatchFileLoads/RemoveTempTables/DeduplicateTables/Reify+WriteWithMultipleDests2/BigQueryBatchFileLoads/RemoveTempTables/DeduplicateTables/Write
root: INFO: 2019-07-15T20:08:55.449Z: JOB_MESSAGE_BASIC: Finished operation WriteWithMultipleDests2/BigQueryBatchFileLoads/ImpulseMonitorCopyJobs/Read+WriteWithMultipleDests2/BigQueryBatchFileLoads/WaitForCopyJobs/WaitForCopyJobs+WriteWithMultipleDests2/BigQueryBatchFileLoads/RemoveTempTables/PassTables/PassTables+WriteWithMultipleDests2/BigQueryBatchFileLoads/RemoveTempTables/AddUselessValue+WriteWithMultipleDests2/BigQueryBatchFileLoads/RemoveTempTables/DeduplicateTables/Reify+WriteWithMultipleDests2/BigQueryBatchFileLoads/RemoveTempTables/DeduplicateTables/Write
root: INFO: 2019-07-15T20:08:55.542Z: JOB_MESSAGE_BASIC: Executing operation WriteWithMultipleDests2/BigQueryBatchFileLoads/RemoveTempTables/DeduplicateTables/Close
root: INFO: 2019-07-15T20:08:55.595Z: JOB_MESSAGE_BASIC: Finished operation WriteWithMultipleDests2/BigQueryBatchFileLoads/RemoveTempTables/DeduplicateTables/Close
root: INFO: 2019-07-15T20:08:55.687Z: JOB_MESSAGE_BASIC: Executing operation WriteWithMultipleDests2/BigQueryBatchFileLoads/RemoveTempTables/DeduplicateTables/Read+WriteWithMultipleDests2/BigQueryBatchFileLoads/RemoveTempTables/DeduplicateTables/GroupByWindow+WriteWithMultipleDests2/BigQueryBatchFileLoads/RemoveTempTables/GetTableNames+WriteWithMultipleDests2/BigQueryBatchFileLoads/RemoveTempTables/Delete
root: INFO: 2019-07-15T20:08:58.655Z: JOB_MESSAGE_BASIC: Finished operation WriteWithMultipleDests2/BigQueryBatchFileLoads/RemoveTempTables/DeduplicateTables/Read+WriteWithMultipleDests2/BigQueryBatchFileLoads/RemoveTempTables/DeduplicateTables/GroupByWindow+WriteWithMultipleDests2/BigQueryBatchFileLoads/RemoveTempTables/GetTableNames+WriteWithMultipleDests2/BigQueryBatchFileLoads/RemoveTempTables/Delete
root: INFO: 2019-07-15T20:08:58.745Z: JOB_MESSAGE_DEBUG: Executing success step success42
root: INFO: 2019-07-15T20:08:58.872Z: JOB_MESSAGE_DETAILED: Cleaning up.
root: INFO: 2019-07-15T20:08:58.952Z: JOB_MESSAGE_DEBUG: Starting worker pool teardown.
root: INFO: 2019-07-15T20:08:59.012Z: JOB_MESSAGE_BASIC: Stopping worker pool...
root: INFO: 2019-07-15T20:12:42.030Z: JOB_MESSAGE_DETAILED: Autoscaling: Resized worker pool from 1 to 0.
root: INFO: 2019-07-15T20:12:42.088Z: JOB_MESSAGE_BASIC: Worker pool stopped.
root: INFO: 2019-07-15T20:12:42.128Z: JOB_MESSAGE_DEBUG: Tearing down pending resources...
root: INFO: Job 2019-07-15_13_01_29-1091923853720971026 is in state JOB_STATE_DONE
root: INFO: Start verify Bigquery table properties.
root: DEBUG: Connecting using Google Application Default Credentials.
oauth2client.transport: INFO: Attempting refresh to obtain initial access_token
root: INFO: Table proto is <Table
 clustering: <Clustering
 fields: ['language']>
 creationTime: 1563221286296
 etag: '6baPiNfBtZt4jDFjHUOEmQ=='
 id: 'apache-beam-testing:python_bq_streaming_inserts_15632208807954.output_table1'
 kind: 'bigquery#table'
 lastModifiedTime: 1563221287213
 location: 'US'
 numBytes: 0
 numLongTermBytes: 0
 numRows: 0
 schema: <TableSchema
 fields: [<TableFieldSchema
 fields: []
 mode: 'NULLABLE'
 name: 'name'
 type: 'STRING'>, <TableFieldSchema
 fields: []
 mode: 'NULLABLE'
 name: 'language'
 type: 'STRING'>]>
 selfLink: 'https://www.googleapis.com/bigquery/v2/projects/apache-beam-testing/datasets/python_bq_streaming_inserts_15632208807954/tables/output_table1'
 streamingBuffer: <Streamingbuffer
 estimatedBytes: 98
 estimatedRows: 8
 oldestEntryTime: 1563221280000>
 tableReference: <TableReference
 datasetId: 'python_bq_streaming_inserts_15632208807954'
 projectId: 'apache-beam-testing'
 tableId: 'output_table1'>
 timePartitioning: <TimePartitioning
 type: 'DAY'>
 type: 'TABLE'>
root: INFO: Matching {'type': 'DAY'} to <TimePartitioning
 type: 'DAY'>
root: INFO: Matching DAY to DAY
root: INFO: Matching {'fields': ['language']} to <Clustering
 fields: ['language']>
root: INFO: Matching ['language'] to ['language']
root: INFO: Start verify Bigquery table properties.
root: DEBUG: Connecting using Google Application Default Credentials.
oauth2client.transport: INFO: Attempting refresh to obtain initial access_token
root: INFO: Deleting dataset python_bq_streaming_inserts_15632208807954 in project apache-beam-testing
--------------------- >> end captured logging << ---------------------
<https://builds.apache.org/job/beam_PostCommit_Python3_Verify/ws/src/sdks/python/apache_beam/io/gcp/bigquery.py>:1140: BeamDeprecationWarning: options is deprecated since First stable release. References to <pipeline>.options will not be supported
Found: https://console.cloud.google.com/dataflow/jobsDetail/locations/us-central1/jobs/2019-07-15_12_31_44-115971789938467813?project=apache-beam-testing.
Found: https://console.cloud.google.com/dataflow/jobsDetail/locations/us-central1/jobs/2019-07-15_12_48_20-3180492249729383114?project=apache-beam-testing.
Found: https://console.cloud.google.com/dataflow/jobsDetail/locations/us-central1/jobs/2019-07-15_12_56_41-5345465469181927569?project=apache-beam-testing.
  method_to_use = self._compute_method(p, p.options)
Found: https://console.cloud.google.com/dataflow/jobsDetail/locations/us-central1/jobs/2019-07-15_13_06_27-16212293402016492658?project=apache-beam-testing.
Found: https://console.cloud.google.com/dataflow/jobsDetail/locations/us-central1/jobs/2019-07-15_13_15_18-12656350113958962153?project=apache-beam-testing.
Found: https://console.cloud.google.com/dataflow/jobsDetail/locations/us-central1/jobs/2019-07-15_12_31_40-12532478089347127768?project=apache-beam-testing.
<https://builds.apache.org/job/beam_PostCommit_Python3_Verify/ws/src/sdks/python/apache_beam/runners/dataflow/dataflow_runner.py>:686: BeamDeprecationWarning: BigQuerySink is deprecated since 2.11.0. Use WriteToBigQuery instead.
  kms_key=transform.kms_key))
Found: https://console.cloud.google.com/dataflow/jobsDetail/locations/us-central1/jobs/2019-07-15_12_55_50-9460923043884020238?project=apache-beam-testing.
Found: https://console.cloud.google.com/dataflow/jobsDetail/locations/us-central1/jobs/2019-07-15_13_05_17-8446860598589870095?project=apache-beam-testing.
<https://builds.apache.org/job/beam_PostCommit_Python3_Verify/ws/src/sdks/python/apache_beam/io/gcp/bigquery.py>:1140: BeamDeprecationWarning: options is deprecated since First stable release. References to <pipeline>.options will not be supported
  method_to_use = self._compute_method(p, p.options)
Found: https://console.cloud.google.com/dataflow/jobsDetail/locations/us-central1/jobs/2019-07-15_12_31_43-16769793064804157001?project=apache-beam-testing.
<https://builds.apache.org/job/beam_PostCommit_Python3_Verify/ws/src/sdks/python/apache_beam/runners/dataflow/dataflow_runner.py>:686: BeamDeprecationWarning: BigQuerySink is deprecated since 2.11.0. Use WriteToBigQuery instead.
  kms_key=transform.kms_key))
Found: https://console.cloud.google.com/dataflow/jobsDetail/locations/us-central1/jobs/2019-07-15_12_45_58-11345376309347872463?project=apache-beam-testing.
Found: https://console.cloud.google.com/dataflow/jobsDetail/locations/us-central1/jobs/2019-07-15_12_55_14-15182750900089474726?project=apache-beam-testing.
Found: https://console.cloud.google.com/dataflow/jobsDetail/locations/us-central1/jobs/2019-07-15_13_05_30-5952612122711180162?project=apache-beam-testing.
Found: https://console.cloud.google.com/dataflow/jobsDetail/locations/us-central1/jobs/2019-07-15_13_14_12-3321918154235195372?project=apache-beam-testing.
Found: https://console.cloud.google.com/dataflow/jobsDetail/locations/us-central1/jobs/2019-07-15_12_31_40-15810111382518479707?project=apache-beam-testing.
Found: https://console.cloud.google.com/dataflow/jobsDetail/locations/us-central1/jobs/2019-07-15_12_56_26-1659772760896959622?project=apache-beam-testing.
Found: https://console.cloud.google.com/dataflow/jobsDetail/locations/us-central1/jobs/2019-07-15_13_06_31-11568396389995987400?project=apache-beam-testing.
<https://builds.apache.org/job/beam_PostCommit_Python3_Verify/ws/src/sdks/python/apache_beam/io/fileio_test.py>:232: FutureWarning: MatchAll is experimental.
  | 'GetPath' >> beam.Map(lambda metadata: metadata.path))
<https://builds.apache.org/job/beam_PostCommit_Python3_Verify/ws/src/sdks/python/apache_beam/io/fileio_test.py>:243: FutureWarning: MatchAll is experimental.
  | 'Checksums' >> beam.Map(compute_hash))
<https://builds.apache.org/job/beam_PostCommit_Python3_Verify/ws/src/sdks/python/apache_beam/io/fileio_test.py>:243: FutureWarning: ReadMatches is experimental.
  | 'Checksums' >> beam.Map(compute_hash))
Found: https://console.cloud.google.com/dataflow/jobsDetail/locations/us-central1/jobs/2019-07-15_12_31_40-16743713558709615490?project=apache-beam-testing.
Found: https://console.cloud.google.com/dataflow/jobsDetail/locations/us-central1/jobs/2019-07-15_12_41_16-12772796320335174273?project=apache-beam-testing.
Found: https://console.cloud.google.com/dataflow/jobsDetail/locations/us-central1/jobs/2019-07-15_12_50_41-10089369561004020700?project=apache-beam-testing.
Found: https://console.cloud.google.com/dataflow/jobsDetail/locations/us-central1/jobs/2019-07-15_13_01_11-11482519151802201054?project=apache-beam-testing.
Found: https://console.cloud.google.com/dataflow/jobsDetail/locations/us-central1/jobs/2019-07-15_13_12_26-8749177463974728588?project=apache-beam-testing.
Found: https://console.cloud.google.com/dataflow/jobsDetail/locations/us-central1/jobs/2019-07-15_13_22_22-4064350069650742486?project=apache-beam-testing.
Found: https://console.cloud.google.com/dataflow/jobsDetail/locations/us-central1/jobs/2019-07-15_12_31_39-7472209276943531500?project=apache-beam-testing.
<https://builds.apache.org/job/beam_PostCommit_Python3_Verify/ws/src/sdks/python/apache_beam/runners/dataflow/dataflow_runner.py>:686: BeamDeprecationWarning: BigQuerySink is deprecated since 2.11.0. Use WriteToBigQuery instead.
  kms_key=transform.kms_key))
Found: https://console.cloud.google.com/dataflow/jobsDetail/locations/us-central1/jobs/2019-07-15_12_41_12-4007709702624657169?project=apache-beam-testing.
Found: https://console.cloud.google.com/dataflow/jobsDetail/locations/us-central1/jobs/2019-07-15_12_51_28-17452623885375737753?project=apache-beam-testing.
Found: https://console.cloud.google.com/dataflow/jobsDetail/locations/us-central1/jobs/2019-07-15_13_01_29-1091923853720971026?project=apache-beam-testing.
<https://builds.apache.org/job/beam_PostCommit_Python3_Verify/ws/src/sdks/python/apache_beam/io/gcp/bigquery.py>:1140: BeamDeprecationWarning: options is deprecated since First stable release. References to <pipeline>.options will not be supported
  method_to_use = self._compute_method(p, p.options)
<https://builds.apache.org/job/beam_PostCommit_Python3_Verify/ws/src/sdks/python/apache_beam/io/gcp/bigquery_file_loads.py>:557: BeamDeprecationWarning: options is deprecated since First stable release. References to <pipeline>.options will not be supported
  temp_location = p.options.view_as(GoogleCloudOptions).temp_location
Found: https://console.cloud.google.com/dataflow/jobsDetail/locations/us-central1/jobs/2019-07-15_12_31_44-9653035721713284542?project=apache-beam-testing.
<https://builds.apache.org/job/beam_PostCommit_Python3_Verify/ws/src/sdks/python/apache_beam/io/gcp/bigquery.py>:1140: BeamDeprecationWarning: options is deprecated since First stable release. References to <pipeline>.options will not be supported
  method_to_use = self._compute_method(p, p.options)
<https://builds.apache.org/job/beam_PostCommit_Python3_Verify/ws/src/sdks/python/apache_beam/io/gcp/bigquery_file_loads.py>:557: BeamDeprecationWarning: options is deprecated since First stable release. References to <pipeline>.options will not be supported
  temp_location = p.options.view_as(GoogleCloudOptions).temp_location
Found: https://console.cloud.google.com/dataflow/jobsDetail/locations/us-central1/jobs/2019-07-15_12_41_49-3862107225971431244?project=apache-beam-testing.
Found: https://console.cloud.google.com/dataflow/jobsDetail/locations/us-central1/jobs/2019-07-15_12_53_34-9881469532136986912?project=apache-beam-testing.
Found: https://console.cloud.google.com/dataflow/jobsDetail/locations/us-central1/jobs/2019-07-15_13_03_38-7817875082261962609?project=apache-beam-testing.
Found: https://console.cloud.google.com/dataflow/jobsDetail/locations/us-central1/jobs/2019-07-15_12_31_43-16164381877786313673?project=apache-beam-testing.
Found: https://console.cloud.google.com/dataflow/jobsDetail/locations/us-central1/jobs/2019-07-15_12_41_44-13143008113485470275?project=apache-beam-testing.
Found: https://console.cloud.google.com/dataflow/jobsDetail/locations/us-central1/jobs/2019-07-15_12_50_46-4169361499871699267?project=apache-beam-testing.
<https://builds.apache.org/job/beam_PostCommit_Python3_Verify/ws/src/sdks/python/apache_beam/runners/dataflow/dataflow_runner.py>:686: BeamDeprecationWarning: BigQuerySink is deprecated since 2.11.0. Use WriteToBigQuery instead.
  kms_key=transform.kms_key))
Found: https://console.cloud.google.com/dataflow/jobsDetail/locations/us-central1/jobs/2019-07-15_12_59_32-6661255247529341936?project=apache-beam-testing.
<https://builds.apache.org/job/beam_PostCommit_Python3_Verify/ws/src/sdks/python/apache_beam/io/gcp/big_query_query_to_table_pipeline.py>:73: BeamDeprecationWarning: BigQuerySink is deprecated since 2.11.0. Use WriteToBigQuery instead.
  kms_key=kms_key))
Found: https://console.cloud.google.com/dataflow/jobsDetail/locations/us-central1/jobs/2019-07-15_13_09_33-12442413425660833626?project=apache-beam-testing.

----------------------------------------------------------------------
XML: <https://builds.apache.org/job/beam_PostCommit_Python3_Verify/ws/src/sdks/python/nosetests.xml>
----------------------------------------------------------------------
Ran 42 tests in 3649.677s

FAILED (SKIP=5, errors=1)

> Task :sdks:python:test-suites:dataflow:py36:postCommitIT FAILED

FAILURE: Build completed with 3 failures.

1: Task failed with an exception.
-----------
* Where:
Build file '<https://builds.apache.org/job/beam_PostCommit_Python3_Verify/ws/src/sdks/python/test-suites/dataflow/py37/build.gradle'> line: 78

* What went wrong:
Execution failed for task ':sdks:python:test-suites:dataflow:py37:postCommitIT'.
> Process 'command 'sh'' finished with non-zero exit value 1

* Try:
Run with --stacktrace option to get the stack trace. Run with --info or --debug option to get more log output. Run with --scan to get full insights.
==============================================================================

2: Task failed with an exception.
-----------
* Where:
Build file '<https://builds.apache.org/job/beam_PostCommit_Python3_Verify/ws/src/sdks/python/test-suites/dataflow/py35/build.gradle'> line: 48

* What went wrong:
Execution failed for task ':sdks:python:test-suites:dataflow:py35:postCommitIT'.
> Process 'command 'sh'' finished with non-zero exit value 1

* Try:
Run with --stacktrace option to get the stack trace. Run with --info or --debug option to get more log output. Run with --scan to get full insights.
==============================================================================

3: Task failed with an exception.
-----------
* Where:
Build file '<https://builds.apache.org/job/beam_PostCommit_Python3_Verify/ws/src/sdks/python/test-suites/dataflow/py36/build.gradle'> line: 48

* What went wrong:
Execution failed for task ':sdks:python:test-suites:dataflow:py36:postCommitIT'.
> Process 'command 'sh'' finished with non-zero exit value 1

* Try:
Run with --stacktrace option to get the stack trace. Run with --info or --debug option to get more log output. Run with --scan to get full insights.
==============================================================================

* Get more help at https://help.gradle.org

Deprecated Gradle features were used in this build, making it incompatible with Gradle 6.0.
Use '--warning-mode all' to show the individual deprecation warnings.
See https://docs.gradle.org/5.2.1/userguide/command_line_interface.html#sec:command_line_warnings

BUILD FAILED in 1h 1m 49s
77 actionable tasks: 60 executed, 17 from cache

Publishing build scan...
https://gradle.com/s/gqdvzzrahiymy

Build step 'Invoke Gradle script' changed build result to FAILURE
Build step 'Invoke Gradle script' marked build as failure

---------------------------------------------------------------------
To unsubscribe, e-mail: builds-unsubscribe@beam.apache.org
For additional commands, e-mail: builds-help@beam.apache.org


Build failed in Jenkins: beam_PostCommit_Python3_Verify #1362

Posted by Apache Jenkins Server <je...@builds.apache.org>.
See <https://builds.apache.org/job/beam_PostCommit_Python3_Verify/1362/display/redirect>

------------------------------------------
[...truncated 781.68 KB...]
root: INFO: 2019-07-15T18:20:39.984Z: JOB_MESSAGE_DETAILED: Fusing consumer assert_that/Group/pair_with_1 into assert_that/ToVoidKey
root: INFO: 2019-07-15T18:20:40.029Z: JOB_MESSAGE_DETAILED: Fusing consumer assert_that/Unkey into assert_that/Group/Map(_merge_tagged_vals_under_key)
root: INFO: 2019-07-15T18:20:40.076Z: JOB_MESSAGE_DETAILED: Fusing consumer assert_that/Group/Map(_merge_tagged_vals_under_key) into assert_that/Group/GroupByKey/GroupByWindow
root: INFO: 2019-07-15T18:20:40.122Z: JOB_MESSAGE_DETAILED: Fusing consumer assert_that/ToVoidKey into assert_that/WindowInto(WindowIntoFn)
root: INFO: 2019-07-15T18:20:40.168Z: JOB_MESSAGE_DETAILED: Fusing consumer assert_that/Group/GroupByKey/GroupByWindow into assert_that/Group/GroupByKey/Read
root: INFO: 2019-07-15T18:20:40.203Z: JOB_MESSAGE_DETAILED: Fusing consumer assert_that/Group/pair_with_0 into assert_that/Create/Read
root: INFO: 2019-07-15T18:20:40.251Z: JOB_MESSAGE_DEBUG: Workflow config is missing a default resource spec.
root: INFO: 2019-07-15T18:20:40.296Z: JOB_MESSAGE_DEBUG: Adding StepResource setup and teardown to workflow graph.
root: INFO: 2019-07-15T18:20:40.345Z: JOB_MESSAGE_DEBUG: Adding workflow start and stop steps.
root: INFO: 2019-07-15T18:20:40.392Z: JOB_MESSAGE_DEBUG: Assigning stage ids.
root: INFO: 2019-07-15T18:20:40.600Z: JOB_MESSAGE_DEBUG: Executing wait step start21
root: INFO: 2019-07-15T18:20:40.709Z: JOB_MESSAGE_BASIC: Executing operation assert_that/Group/GroupByKey/Create
root: INFO: 2019-07-15T18:20:40.762Z: JOB_MESSAGE_DEBUG: Starting worker pool setup.
root: INFO: 2019-07-15T18:20:40.806Z: JOB_MESSAGE_BASIC: Starting 1 workers in us-central1-a...
root: INFO: 2019-07-15T18:20:40.888Z: JOB_MESSAGE_BASIC: Finished operation assert_that/Group/GroupByKey/Create
root: INFO: 2019-07-15T18:20:40.986Z: JOB_MESSAGE_DEBUG: Value "assert_that/Group/GroupByKey/Session" materialized.
root: INFO: 2019-07-15T18:20:41.088Z: JOB_MESSAGE_BASIC: Executing operation read+assert_that/WindowInto(WindowIntoFn)+assert_that/ToVoidKey+assert_that/Group/pair_with_1+assert_that/Group/GroupByKey/Reify+assert_that/Group/GroupByKey/Write
root: INFO: 2019-07-15T18:20:41.135Z: JOB_MESSAGE_BASIC: Executing operation assert_that/Create/Read+assert_that/Group/pair_with_0+assert_that/Group/GroupByKey/Reify+assert_that/Group/GroupByKey/Write
root: INFO: 2019-07-15T18:20:41.173Z: JOB_MESSAGE_BASIC: BigQuery query issued as job: "dataflow_job_14848854359514051374". You can check its status with the bq tool: "bq show -j --project_id=apache-beam-testing dataflow_job_14848854359514051374".
root: INFO: 2019-07-15T18:20:41.352Z: JOB_MESSAGE_BASIC: Worker configuration: n1-standard-1 in us-central1-a.
root: INFO: 2019-07-15T18:21:37.450Z: JOB_MESSAGE_DETAILED: Autoscaling: Raised the number of workers to 1 based on the rate of progress in the currently running step(s).
root: INFO: Deleting dataset python_read_table_1563214824878 in project apache-beam-testing
--------------------- >> end captured logging << ---------------------
<https://builds.apache.org/job/beam_PostCommit_Python3_Verify/ws/src/sdks/python/apache_beam/io/gcp/bigquery.py>:1140: BeamDeprecationWarning: options is deprecated since First stable release. References to <pipeline>.options will not be supported
  method_to_use = self._compute_method(p, p.options)
Exception in thread Thread-7:
Traceback (most recent call last):
  File "/usr/lib/python3.7/threading.py", line 917, in _bootstrap_inner
Found: https://console.cloud.google.com/dataflow/jobsDetail/locations/us-central1/jobs/2019-07-15_11_04_07-5882553201906626527?project=apache-beam-testing.
    self.run()
  File "/usr/lib/python3.7/threading.py", line 865, in run
    self._target(*self._args, **self._kwargs)
  File "<https://builds.apache.org/job/beam_PostCommit_Python3_Verify/ws/src/sdks/python/apache_beam/runners/dataflow/dataflow_runner.py",> line 190, in poll_for_job_completion
Found: https://console.cloud.google.com/dataflow/jobsDetail/locations/us-central1/jobs/2019-07-15_11_20_33-2946738292966229467?project=apache-beam-testing.
    job_id, page_token=page_token, start_time=last_message_time)
Found: https://console.cloud.google.com/dataflow/jobsDetail/locations/us-central1/jobs/2019-07-15_11_25_47-13073651623640488307?project=apache-beam-testing.
Found: https://console.cloud.google.com/dataflow/jobsDetail/locations/us-central1/jobs/2019-07-15_11_35_04-15745354797927809374?project=apache-beam-testing.
  File "<https://builds.apache.org/job/beam_PostCommit_Python3_Verify/ws/src/sdks/python/apache_beam/utils/retry.py",> line 197, in wrapper
    return fun(*args, **kwargs)
  File "<https://builds.apache.org/job/beam_PostCommit_Python3_Verify/ws/src/sdks/python/apache_beam/runners/dataflow/internal/apiclient.py",> line 748, in list_messages
    response = self._client.projects_locations_jobs_messages.List(request)
  File "<https://builds.apache.org/job/beam_PostCommit_Python3_Verify/ws/src/sdks/python/apache_beam/runners/dataflow/internal/clients/dataflow/dataflow_v1b3_client.py",> line 553, in List
    config, request, global_params=global_params)
  File "<https://builds.apache.org/job/beam_PostCommit_Python3_Verify/ws/src/build/gradleenv/-1734967052/lib/python3.7/site-packages/apitools/base/py/base_api.py",> line 731, in _RunMethod
    return self.ProcessHttpResponse(method_config, http_response, request)
  File "<https://builds.apache.org/job/beam_PostCommit_Python3_Verify/ws/src/build/gradleenv/-1734967052/lib/python3.7/site-packages/apitools/base/py/base_api.py",> line 737, in ProcessHttpResponse
    self.__ProcessHttpResponse(method_config, http_response, request))
  File "<https://builds.apache.org/job/beam_PostCommit_Python3_Verify/ws/src/build/gradleenv/-1734967052/lib/python3.7/site-packages/apitools/base/py/base_api.py",> line 604, in __ProcessHttpResponse
    http_response, method_config=method_config, request=request)
apitools.base.py.exceptions.HttpNotFoundError: HttpError accessing <https://dataflow.googleapis.com/v1b3/projects/apache-beam-testing/locations/us-central1/jobs/2019-07-15_11_20_33-2946738292966229467/messages?alt=json&startTime=2019-07-15T18%3A21%3A37.450Z>: response: <{'vary': 'Origin, X-Origin, Referer', 'content-type': 'application/json; charset=UTF-8', 'date': 'Mon, 15 Jul 2019 18:22:42 GMT', 'server': 'ESF', 'cache-control': 'private', 'x-xss-protection': '0', 'x-frame-options': 'SAMEORIGIN', 'x-content-type-options': 'nosniff', 'transfer-encoding': 'chunked', 'status': '404', 'content-length': '279', '-content-encoding': 'gzip'}>, content <{
  "error": {
    "code": 404,
    "message": "(c707587bba6b31e0): Information about job 2019-07-15_11_20_33-2946738292966229467 could not be found in our system. Please double check the id is correct. If it is please contact customer support.",
    "status": "NOT_FOUND"
  }
}
>

Found: https://console.cloud.google.com/dataflow/jobsDetail/locations/us-central1/jobs/2019-07-15_11_04_00-12352160866629532861?project=apache-beam-testing.
Found: https://console.cloud.google.com/dataflow/jobsDetail/locations/us-central1/jobs/2019-07-15_11_28_51-553194818448133268?project=apache-beam-testing.
Found: https://console.cloud.google.com/dataflow/jobsDetail/locations/us-central1/jobs/2019-07-15_11_36_56-9932371068470770681?project=apache-beam-testing.
<https://builds.apache.org/job/beam_PostCommit_Python3_Verify/ws/src/sdks/python/apache_beam/runners/dataflow/dataflow_runner.py>:686: BeamDeprecationWarning: BigQuerySink is deprecated since 2.11.0. Use WriteToBigQuery instead.
  kms_key=transform.kms_key))
Exception in thread Thread-7:
Traceback (most recent call last):
  File "/usr/lib/python3.7/threading.py", line 917, in _bootstrap_inner
    self.run()
  File "/usr/lib/python3.7/threading.py", line 865, in run
    self._target(*self._args, **self._kwargs)
  File "<https://builds.apache.org/job/beam_PostCommit_Python3_Verify/ws/src/sdks/python/apache_beam/runners/dataflow/dataflow_runner.py",> line 190, in poll_for_job_completion
    job_id, page_token=page_token, start_time=last_message_time)
  File "<https://builds.apache.org/job/beam_PostCommit_Python3_Verify/ws/src/sdks/python/apache_beam/utils/retry.py",> line 197, in wrapper
    return fun(*args, **kwargs)
  File "<https://builds.apache.org/job/beam_PostCommit_Python3_Verify/ws/src/sdks/python/apache_beam/runners/dataflow/internal/apiclient.py",> line 748, in list_messages
    response = self._client.projects_locations_jobs_messages.List(request)
  File "<https://builds.apache.org/job/beam_PostCommit_Python3_Verify/ws/src/sdks/python/apache_beam/runners/dataflow/internal/clients/dataflow/dataflow_v1b3_client.py",> line 553, in List
    config, request, global_params=global_params)
  File "<https://builds.apache.org/job/beam_PostCommit_Python3_Verify/ws/src/build/gradleenv/-1734967052/lib/python3.7/site-packages/apitools/base/py/base_api.py",> line 731, in _RunMethod
    return self.ProcessHttpResponse(method_config, http_response, request)
  File "<https://builds.apache.org/job/beam_PostCommit_Python3_Verify/ws/src/build/gradleenv/-1734967052/lib/python3.7/site-packages/apitools/base/py/base_api.py",> line 737, in ProcessHttpResponse
    self.__ProcessHttpResponse(method_config, http_response, request))
  File "<https://builds.apache.org/job/beam_PostCommit_Python3_Verify/ws/src/build/gradleenv/-1734967052/lib/python3.7/site-packages/apitools/base/py/base_api.py",> line 604, in __ProcessHttpResponse
    http_response, method_config=method_config, request=request)
apitools.base.py.exceptions.HttpNotFoundError: HttpError accessing <https://dataflow.googleapis.com/v1b3/projects/apache-beam-testing/locations/us-central1/jobs/2019-07-15_11_28_51-553194818448133268/messages?alt=json&startTime=2019-07-15T18%3A29%3A50.753Z>: response: <{'vary': 'Origin, X-Origin, Referer', 'content-type': 'application/json; charset=UTF-8', 'date': 'Mon, 15 Jul 2019 18:31:49 GMT', 'server': 'ESF', 'cache-control': 'private', 'x-xss-protection': '0', 'x-frame-options': 'SAMEORIGIN', 'x-content-type-options': 'nosniff', 'transfer-encoding': 'chunked', 'status': '404', 'content-length': '278', '-content-encoding': 'gzip'}>, content <{
  "error": {
    "code": 404,
    "message": "(e0bbd328a44c1ccf): Information about job 2019-07-15_11_28_51-553194818448133268 could not be found in our system. Please double check the id is correct. If it is please contact customer support.",
    "status": "NOT_FOUND"
  }
}
>

Found: https://console.cloud.google.com/dataflow/jobsDetail/locations/us-central1/jobs/2019-07-15_11_04_03-4594928334051633204?project=apache-beam-testing.
Found: https://console.cloud.google.com/dataflow/jobsDetail/locations/us-central1/jobs/2019-07-15_11_18_35-747471589940279926?project=apache-beam-testing.
Found: https://console.cloud.google.com/dataflow/jobsDetail/locations/us-central1/jobs/2019-07-15_11_28_59-3771984842457676196?project=apache-beam-testing.
Found: https://console.cloud.google.com/dataflow/jobsDetail/locations/us-central1/jobs/2019-07-15_11_38_34-12309436989561899223?project=apache-beam-testing.
<https://builds.apache.org/job/beam_PostCommit_Python3_Verify/ws/src/sdks/python/apache_beam/io/gcp/bigquery.py>:1140: BeamDeprecationWarning: options is deprecated since First stable release. References to <pipeline>.options will not be supported
  method_to_use = self._compute_method(p, p.options)
<https://builds.apache.org/job/beam_PostCommit_Python3_Verify/ws/src/sdks/python/apache_beam/io/fileio_test.py>:232: FutureWarning: MatchAll is experimental.
  | 'GetPath' >> beam.Map(lambda metadata: metadata.path))
<https://builds.apache.org/job/beam_PostCommit_Python3_Verify/ws/src/sdks/python/apache_beam/io/fileio_test.py>:243: FutureWarning: MatchAll is experimental.
  | 'Checksums' >> beam.Map(compute_hash))
<https://builds.apache.org/job/beam_PostCommit_Python3_Verify/ws/src/sdks/python/apache_beam/io/fileio_test.py>:243: FutureWarning: ReadMatches is experimental.
  | 'Checksums' >> beam.Map(compute_hash))
Found: https://console.cloud.google.com/dataflow/jobsDetail/locations/us-central1/jobs/2019-07-15_11_04_01-8922909391764374647?project=apache-beam-testing.
Exception in thread Thread-1:
Traceback (most recent call last):
  File "/usr/lib/python3.7/threading.py", line 917, in _bootstrap_inner
    self.run()
  File "/usr/lib/python3.7/threading.py", line 865, in run
    self._target(*self._args, **self._kwargs)
Found: https://console.cloud.google.com/dataflow/jobsDetail/locations/us-central1/jobs/2019-07-15_11_25_09-1891199584467174496?project=apache-beam-testing.
Found: https://console.cloud.google.com/dataflow/jobsDetail/locations/us-central1/jobs/2019-07-15_11_34_59-16446599040654482928?project=apache-beam-testing.
  File "<https://builds.apache.org/job/beam_PostCommit_Python3_Verify/ws/src/sdks/python/apache_beam/runners/dataflow/dataflow_runner.py",> line 157, in poll_for_job_completion
    response = runner.dataflow_client.get_job(job_id)
  File "<https://builds.apache.org/job/beam_PostCommit_Python3_Verify/ws/src/sdks/python/apache_beam/utils/retry.py",> line 197, in wrapper
    return fun(*args, **kwargs)
  File "<https://builds.apache.org/job/beam_PostCommit_Python3_Verify/ws/src/sdks/python/apache_beam/runners/dataflow/internal/apiclient.py",> line 663, in get_job
    response = self._client.projects_locations_jobs.Get(request)
  File "<https://builds.apache.org/job/beam_PostCommit_Python3_Verify/ws/src/sdks/python/apache_beam/runners/dataflow/internal/clients/dataflow/dataflow_v1b3_client.py",> line 689, in Get
    config, request, global_params=global_params)
  File "<https://builds.apache.org/job/beam_PostCommit_Python3_Verify/ws/src/build/gradleenv/-1734967052/lib/python3.7/site-packages/apitools/base/py/base_api.py",> line 731, in _RunMethod
    return self.ProcessHttpResponse(method_config, http_response, request)
  File "<https://builds.apache.org/job/beam_PostCommit_Python3_Verify/ws/src/build/gradleenv/-1734967052/lib/python3.7/site-packages/apitools/base/py/base_api.py",> line 737, in ProcessHttpResponse
    self.__ProcessHttpResponse(method_config, http_response, request))
  File "<https://builds.apache.org/job/beam_PostCommit_Python3_Verify/ws/src/build/gradleenv/-1734967052/lib/python3.7/site-packages/apitools/base/py/base_api.py",> line 604, in __ProcessHttpResponse
    http_response, method_config=method_config, request=request)
apitools.base.py.exceptions.HttpNotFoundError: HttpError accessing <https://dataflow.googleapis.com/v1b3/projects/apache-beam-testing/locations/us-central1/jobs/2019-07-15_11_04_01-8922909391764374647?alt=json>: response: <{'vary': 'Origin, X-Origin, Referer', 'content-type': 'application/json; charset=UTF-8', 'date': 'Mon, 15 Jul 2019 18:22:49 GMT', 'server': 'ESF', 'cache-control': 'private', 'x-xss-protection': '0', 'x-frame-options': 'SAMEORIGIN', 'x-content-type-options': 'nosniff', 'transfer-encoding': 'chunked', 'status': '404', 'content-length': '279', '-content-encoding': 'gzip'}>, content <{
  "error": {
    "code": 404,
    "message": "(615ea5d76a30771c): Information about job 2019-07-15_11_04_01-8922909391764374647 could not be found in our system. Please double check the id is correct. If it is please contact customer support.",
    "status": "NOT_FOUND"
  }
}
>

<https://builds.apache.org/job/beam_PostCommit_Python3_Verify/ws/src/sdks/python/apache_beam/io/gcp/bigquery.py>:1140: BeamDeprecationWarning: options is deprecated since First stable release. References to <pipeline>.options will not be supported
  method_to_use = self._compute_method(p, p.options)
<https://builds.apache.org/job/beam_PostCommit_Python3_Verify/ws/src/sdks/python/apache_beam/io/gcp/bigquery_file_loads.py>:557: BeamDeprecationWarning: options is deprecated since First stable release. References to <pipeline>.options will not be supported
  temp_location = p.options.view_as(GoogleCloudOptions).temp_location
Found: https://console.cloud.google.com/dataflow/jobsDetail/locations/us-central1/jobs/2019-07-15_11_04_01-12904329776650675089?project=apache-beam-testing.
<https://builds.apache.org/job/beam_PostCommit_Python3_Verify/ws/src/sdks/python/apache_beam/io/gcp/bigquery.py>:1140: BeamDeprecationWarning: options is deprecated since First stable release. References to <pipeline>.options will not be supported
Found: https://console.cloud.google.com/dataflow/jobsDetail/locations/us-central1/jobs/2019-07-15_11_15_13-13790413299095885387?project=apache-beam-testing.
Found: https://console.cloud.google.com/dataflow/jobsDetail/locations/us-central1/jobs/2019-07-15_11_25_51-5811749176713756148?project=apache-beam-testing.
Found: https://console.cloud.google.com/dataflow/jobsDetail/locations/us-central1/jobs/2019-07-15_11_36_50-10688669615906368095?project=apache-beam-testing.
Found: https://console.cloud.google.com/dataflow/jobsDetail/locations/us-central1/jobs/2019-07-15_11_46_25-12468800066564038351?project=apache-beam-testing.
  method_to_use = self._compute_method(p, p.options)
<https://builds.apache.org/job/beam_PostCommit_Python3_Verify/ws/src/sdks/python/apache_beam/io/gcp/bigquery_file_loads.py>:557: BeamDeprecationWarning: options is deprecated since First stable release. References to <pipeline>.options will not be supported
  temp_location = p.options.view_as(GoogleCloudOptions).temp_location
Found: https://console.cloud.google.com/dataflow/jobsDetail/locations/us-central1/jobs/2019-07-15_11_04_00-6650050475545636985?project=apache-beam-testing.
Found: https://console.cloud.google.com/dataflow/jobsDetail/locations/us-central1/jobs/2019-07-15_11_13_28-15040612478838028558?project=apache-beam-testing.
<https://builds.apache.org/job/beam_PostCommit_Python3_Verify/ws/src/sdks/python/apache_beam/runners/dataflow/dataflow_runner.py>:686: BeamDeprecationWarning: BigQuerySink is deprecated since 2.11.0. Use WriteToBigQuery instead.
Found: https://console.cloud.google.com/dataflow/jobsDetail/locations/us-central1/jobs/2019-07-15_11_25_39-6308273059129200598?project=apache-beam-testing.
  kms_key=transform.kms_key))
Found: https://console.cloud.google.com/dataflow/jobsDetail/locations/us-central1/jobs/2019-07-15_11_37_01-8460270159818121172?project=apache-beam-testing.
Found: https://console.cloud.google.com/dataflow/jobsDetail/locations/us-central1/jobs/2019-07-15_11_46_23-18847983924990317?project=apache-beam-testing.
Found: https://console.cloud.google.com/dataflow/jobsDetail/locations/us-central1/jobs/2019-07-15_11_04_04-4650543678367804711?project=apache-beam-testing.
Found: https://console.cloud.google.com/dataflow/jobsDetail/locations/us-central1/jobs/2019-07-15_11_14_11-6508004455204352877?project=apache-beam-testing.
Found: https://console.cloud.google.com/dataflow/jobsDetail/locations/us-central1/jobs/2019-07-15_11_22_56-4304809155306677573?project=apache-beam-testing.
Found: https://console.cloud.google.com/dataflow/jobsDetail/locations/us-central1/jobs/2019-07-15_11_32_48-3715897392816253778?project=apache-beam-testing.
Found: https://console.cloud.google.com/dataflow/jobsDetail/locations/us-central1/jobs/2019-07-15_11_41_33-746802922473368410?project=apache-beam-testing.
Found: https://console.cloud.google.com/dataflow/jobsDetail/locations/us-central1/jobs/2019-07-15_11_51_39-4223670260291301883?project=apache-beam-testing.
Found: https://console.cloud.google.com/dataflow/jobsDetail/locations/us-central1/jobs/2019-07-15_11_04_02-18065090532768883000?project=apache-beam-testing.
Found: https://console.cloud.google.com/dataflow/jobsDetail/locations/us-central1/jobs/2019-07-15_11_14_54-1866541724603461119?project=apache-beam-testing.
Found: https://console.cloud.google.com/dataflow/jobsDetail/locations/us-central1/jobs/2019-07-15_11_22_56-10523104949731395263?project=apache-beam-testing.
Found: https://console.cloud.google.com/dataflow/jobsDetail/locations/us-central1/jobs/2019-07-15_11_33_23-6249994351554330936?project=apache-beam-testing.
Found: https://console.cloud.google.com/dataflow/jobsDetail/locations/us-central1/jobs/2019-07-15_11_43_13-2034751611428246582?project=apache-beam-testing.
<https://builds.apache.org/job/beam_PostCommit_Python3_Verify/ws/src/sdks/python/apache_beam/runners/dataflow/dataflow_runner.py>:686: BeamDeprecationWarning: BigQuerySink is deprecated since 2.11.0. Use WriteToBigQuery instead.
  kms_key=transform.kms_key))
<https://builds.apache.org/job/beam_PostCommit_Python3_Verify/ws/src/sdks/python/apache_beam/io/gcp/big_query_query_to_table_pipeline.py>:73: BeamDeprecationWarning: BigQuerySink is deprecated since 2.11.0. Use WriteToBigQuery instead.
  kms_key=kms_key))

----------------------------------------------------------------------
XML: <https://builds.apache.org/job/beam_PostCommit_Python3_Verify/ws/src/sdks/python/nosetests.xml>
----------------------------------------------------------------------
Ran 42 tests in 3432.096s

FAILED (SKIP=5, failures=2)

> Task :sdks:python:test-suites:dataflow:py37:postCommitIT FAILED

FAILURE: Build completed with 4 failures.

1: Task failed with an exception.
-----------
* Where:
Build file '<https://builds.apache.org/job/beam_PostCommit_Python3_Verify/ws/src/sdks/python/test-suites/direct/py35/build.gradle'> line: 48

* What went wrong:
Execution failed for task ':sdks:python:test-suites:direct:py35:postCommitIT'.
> Process 'command 'sh'' finished with non-zero exit value 1

* Try:
Run with --stacktrace option to get the stack trace. Run with --info or --debug option to get more log output. Run with --scan to get full insights.
==============================================================================

2: Task failed with an exception.
-----------
* Where:
Build file '<https://builds.apache.org/job/beam_PostCommit_Python3_Verify/ws/src/sdks/python/test-suites/dataflow/py36/build.gradle'> line: 48

* What went wrong:
Execution failed for task ':sdks:python:test-suites:dataflow:py36:postCommitIT'.
> Process 'command 'sh'' finished with non-zero exit value 1

* Try:
Run with --stacktrace option to get the stack trace. Run with --info or --debug option to get more log output. Run with --scan to get full insights.
==============================================================================

3: Task failed with an exception.
-----------
* Where:
Build file '<https://builds.apache.org/job/beam_PostCommit_Python3_Verify/ws/src/sdks/python/test-suites/dataflow/py35/build.gradle'> line: 48

* What went wrong:
Execution failed for task ':sdks:python:test-suites:dataflow:py35:postCommitIT'.
> Process 'command 'sh'' finished with non-zero exit value 1

* Try:
Run with --stacktrace option to get the stack trace. Run with --info or --debug option to get more log output. Run with --scan to get full insights.
==============================================================================

4: Task failed with an exception.
-----------
* Where:
Build file '<https://builds.apache.org/job/beam_PostCommit_Python3_Verify/ws/src/sdks/python/test-suites/dataflow/py37/build.gradle'> line: 78

* What went wrong:
Execution failed for task ':sdks:python:test-suites:dataflow:py37:postCommitIT'.
> Process 'command 'sh'' finished with non-zero exit value 1

* Try:
Run with --stacktrace option to get the stack trace. Run with --info or --debug option to get more log output. Run with --scan to get full insights.
==============================================================================

* Get more help at https://help.gradle.org

Deprecated Gradle features were used in this build, making it incompatible with Gradle 6.0.
Use '--warning-mode all' to show the individual deprecation warnings.
See https://docs.gradle.org/5.2.1/userguide/command_line_interface.html#sec:command_line_warnings

BUILD FAILED in 58m 10s
77 actionable tasks: 60 executed, 17 from cache

Publishing build scan...
https://gradle.com/s/wxhjm6mrak7fw

Build step 'Invoke Gradle script' changed build result to FAILURE
Build step 'Invoke Gradle script' marked build as failure

---------------------------------------------------------------------
To unsubscribe, e-mail: builds-unsubscribe@beam.apache.org
For additional commands, e-mail: builds-help@beam.apache.org