You are viewing a plain text version of this content. The canonical link for it is here.
Posted to yarn-dev@hadoop.apache.org by Apache Jenkins Server <je...@builds.apache.org> on 2015/05/12 04:14:17 UTC
Failed: YARN-3529 PreCommit Build #7871
Jira: https://issues.apache.org/jira/browse/YARN-3529
Build: https://builds.apache.org/job/PreCommit-YARN-Build/7871/
###################################################################################
########################## LAST 60 LINES OF THE CONSOLE ###########################
[...truncated 272 lines...]
| | | | whitespace.
| +1 | install | 1m 42s | mvn install still works.
| +1 | eclipse:eclipse | 0m 40s | The patch built with
| | | | eclipse:eclipse.
| -1 | findbugs | 0m 39s | The patch appears to introduce 1
| | | | new Findbugs (version 2.0.3)
| | | | warnings.
| +1 | yarn tests | 0m 54s | Tests passed in
| | | | hadoop-yarn-server-timelineservice.
| | | 37m 40s |
Reason | Tests
FindBugs | module:hadoop-yarn-server-timelineservice
| Write to static field org.apache.hadoop.yarn.server.timelineservice.storage.PhoenixTimelineWriterImpl.connString from instance method org.apache.hadoop.yarn.server.timelineservice.storage.PhoenixTimelineWriterImpl.serviceInit(Configuration) At PhoenixTimelineWriterImpl.java:from instance method org.apache.hadoop.yarn.server.timelineservice.storage.PhoenixTimelineWriterImpl.serviceInit(Configuration) At PhoenixTimelineWriterImpl.java:[line 114]
|| Subsystem || Report/Notes ||
============================================================================
| Patch URL | http://issues.apache.org/jira/secure/attachment/12732099/YARN-3529-YARN-2928.001.patch |
| Optional Tests | javadoc javac unit findbugs checkstyle |
| git revision | YARN-2928 / b3b791b |
| Findbugs warnings | /home/jenkins/jenkins-slave/workspace/PreCommit-YARN-Build/patchprocess/newPatchFindbugsWarningshadoop-yarn-server-timelineservice.html |
| hadoop-yarn-server-timelineservice test log | /home/jenkins/jenkins-slave/workspace/PreCommit-YARN-Build/patchprocess/testrun_hadoop-yarn-server-timelineservice.txt |
| Test Results | https://builds.apache.org/job/PreCommit-YARN-Build/7871/testReport/ |
| Java | 1.7.0_55 |
| uname | Linux asf902.gq1.ygridcore.net 3.13.0-36-lowlatency #63-Ubuntu SMP PREEMPT Wed Sep 3 21:56:12 UTC 2014 x86_64 x86_64 x86_64 GNU/Linux |
============================================================================
============================================================================
Adding comment to JIRA
============================================================================
============================================================================
Comment added.
751746c80595da727150dd45d7f94129af350eeb logged out
============================================================================
============================================================================
Finished build.
============================================================================
============================================================================
Build step 'Execute shell' marked build as failure
Archiving artifacts
Sending artifact delta relative to PreCommit-YARN-Build #7869
Archived 24 artifacts
Archive block size is 32768
Received 32 blocks and 9177774 bytes
Compression is 10.3%
Took 6.6 sec
[description-setter] Could not determine description.
Recording test results
Email was triggered for: Failure
Sending email for trigger: Failure
###################################################################################
############################## FAILED TESTS (if any) ##############################
All tests passed
Success: YARN-3529 PreCommit Build #7874
Posted by Apache Jenkins Server <je...@builds.apache.org>.
Jira: https://issues.apache.org/jira/browse/YARN-3529
Build: https://builds.apache.org/job/PreCommit-YARN-Build/7874/
###################################################################################
########################## LAST 60 LINES OF THE CONSOLE ###########################
[...truncated 265 lines...]
| | | | messages.
| +1 | release audit | 0m 22s | The applied patch does not increase
| | | | the total number of release audit
| | | | warnings.
| +1 | checkstyle | 0m 35s | There were no new checkstyle
| | | | issues.
| +1 | whitespace | 0m 1s | The patch has no lines that end in
| | | | whitespace.
| +1 | install | 1m 44s | mvn install still works.
| +1 | eclipse:eclipse | 0m 43s | The patch built with
| | | | eclipse:eclipse.
| +1 | findbugs | 0m 37s | The patch does not introduce any
| | | | new Findbugs (version 2.0.3)
| | | | warnings.
| +1 | yarn tests | 0m 54s | Tests passed in
| | | | hadoop-yarn-server-timelineservice.
| | | 38m 53s |
|| Subsystem || Report/Notes ||
============================================================================
| Patch URL | http://issues.apache.org/jira/secure/attachment/12732119/YARN-3529-YARN-2928.002.patch |
| Optional Tests | javadoc javac unit findbugs checkstyle |
| git revision | YARN-2928 / b3b791b |
| hadoop-yarn-server-timelineservice test log | /home/jenkins/jenkins-slave/workspace/PreCommit-YARN-Build/patchprocess/testrun_hadoop-yarn-server-timelineservice.txt |
| Test Results | https://builds.apache.org/job/PreCommit-YARN-Build/7874/testReport/ |
| Java | 1.7.0_55 |
| uname | Linux asf904.gq1.ygridcore.net 3.13.0-36-lowlatency #63-Ubuntu SMP PREEMPT Wed Sep 3 21:56:12 UTC 2014 x86_64 x86_64 x86_64 GNU/Linux |
============================================================================
============================================================================
Adding comment to JIRA
============================================================================
============================================================================
Comment added.
2a69e68cdd8ee29f309148313d7090b7631ef8c1 logged out
============================================================================
============================================================================
Finished build.
============================================================================
============================================================================
Archiving artifacts
Sending artifact delta relative to PreCommit-YARN-Build #7869
Archived 24 artifacts
Archive block size is 32768
Received 35 blocks and 9134531 bytes
Compression is 11.2%
Took 7.2 sec
Description set: YARN-3529
Recording test results
Email was triggered for: Success
Sending email for trigger: Success
###################################################################################
############################## FAILED TESTS (if any) ##############################
All tests passed
Failed: YARN-2556 PreCommit Build #7873
Posted by Apache Jenkins Server <je...@builds.apache.org>.
Jira: https://issues.apache.org/jira/browse/YARN-2556
Build: https://builds.apache.org/job/PreCommit-YARN-Build/7873/
###################################################################################
########################## LAST 60 LINES OF THE CONSOLE ###########################
[...truncated 247 lines...]
| | | | warnings.
| +1 | checkstyle | 0m 36s | There were no new checkstyle
| | | | issues.
| -1 | whitespace | 0m 0s | The patch has 1 line(s) that end in
| | | | whitespace. Use git apply
| | | | --whitespace=fix.
| +1 | install | 1m 36s | mvn install still works.
| +1 | eclipse:eclipse | 0m 32s | The patch built with
| | | | eclipse:eclipse.
| +1 | findbugs | 0m 41s | The patch does not introduce any
| | | | new Findbugs (version 2.0.3)
| | | | warnings.
| +1 | mapreduce tests | 105m 46s | Tests passed in
| | | | hadoop-mapreduce-client-jobclient.
| | | 122m 20s |
|| Subsystem || Report/Notes ||
============================================================================
| Patch URL | http://issues.apache.org/jira/secure/attachment/12732105/YARN-2556.3.patch |
| Optional Tests | javac unit findbugs checkstyle |
| git revision | trunk / 3d28611 |
| whitespace | /home/jenkins/jenkins-slave/workspace/PreCommit-YARN-Build/patchprocess/whitespace.txt |
| hadoop-mapreduce-client-jobclient test log | /home/jenkins/jenkins-slave/workspace/PreCommit-YARN-Build/patchprocess/testrun_hadoop-mapreduce-client-jobclient.txt |
| Test Results | https://builds.apache.org/job/PreCommit-YARN-Build/7873/testReport/ |
| Java | 1.7.0_55 |
| uname | Linux asf902.gq1.ygridcore.net 3.13.0-36-lowlatency #63-Ubuntu SMP PREEMPT Wed Sep 3 21:56:12 UTC 2014 x86_64 x86_64 x86_64 GNU/Linux |
============================================================================
============================================================================
Adding comment to JIRA
============================================================================
============================================================================
Comment added.
774877886b1f8f17a8b5c0a5adcf725daa45022a logged out
============================================================================
============================================================================
Finished build.
============================================================================
============================================================================
Build step 'Execute shell' marked build as failure
Archiving artifacts
Sending artifact delta relative to PreCommit-YARN-Build #7869
Archived 22 artifacts
Archive block size is 32768
Received 47 blocks and 2808056 bytes
Compression is 35.4%
Took 10 sec
[description-setter] Could not determine description.
Recording test results
Email was triggered for: Failure
Sending email for trigger: Failure
###################################################################################
############################## FAILED TESTS (if any) ##############################
All tests passed
Failed: YARN-3543 PreCommit Build #7872
Posted by Apache Jenkins Server <je...@builds.apache.org>.
Jira: https://issues.apache.org/jira/browse/YARN-3543
Build: https://builds.apache.org/job/PreCommit-YARN-Build/7872/
###################################################################################
########################## LAST 60 LINES OF THE CONSOLE ###########################
[...truncated 436 lines...]
| +1 | yarn tests | 52m 7s | Tests passed in
| | | | hadoop-yarn-server-resourcemanager.
| | | 109m 13s |
Reason | Tests
FindBugs | module:hadoop-yarn-server-applicationhistoryservice
| Redundant nullcheck of app, which is known to be non-null in org.apache.hadoop.yarn.server.applicationhistoryservice.ApplicationHistoryManagerImpl.getAMContainer(ApplicationAttemptId) Redundant null check at ApplicationHistoryManagerImpl.java:is known to be non-null in org.apache.hadoop.yarn.server.applicationhistoryservice.ApplicationHistoryManagerImpl.getAMContainer(ApplicationAttemptId) Redundant null check at ApplicationHistoryManagerImpl.java:[line 96]
| Redundant nullcheck of app, which is known to be non-null in org.apache.hadoop.yarn.server.applicationhistoryservice.ApplicationHistoryManagerImpl.getContainer(ContainerId) Redundant null check at ApplicationHistoryManagerImpl.java:is known to be non-null in org.apache.hadoop.yarn.server.applicationhistoryservice.ApplicationHistoryManagerImpl.getContainer(ContainerId) Redundant null check at ApplicationHistoryManagerImpl.java:[line 203]
| Redundant nullcheck of app, which is known to be non-null in org.apache.hadoop.yarn.server.applicationhistoryservice.ApplicationHistoryManagerImpl.getContainers(ApplicationAttemptId) Redundant null check at ApplicationHistoryManagerImpl.java:is known to be non-null in org.apache.hadoop.yarn.server.applicationhistoryservice.ApplicationHistoryManagerImpl.getContainers(ApplicationAttemptId) Redundant null check at ApplicationHistoryManagerImpl.java:[line 235]
|| Subsystem || Report/Notes ||
============================================================================
| Patch URL | http://issues.apache.org/jira/secure/attachment/12731571/0003-YARN-3543.patch |
| Optional Tests | javadoc javac unit findbugs checkstyle |
| git revision | trunk / 3d28611 |
| Findbugs warnings | /home/jenkins/jenkins-slave/workspace/PreCommit-YARN-Build/patchprocess/newPatchFindbugsWarningshadoop-yarn-server-applicationhistoryservice.html |
| hadoop-yarn-api test log | /home/jenkins/jenkins-slave/workspace/PreCommit-YARN-Build/patchprocess/testrun_hadoop-yarn-api.txt |
| hadoop-yarn-client test log | /home/jenkins/jenkins-slave/workspace/PreCommit-YARN-Build/patchprocess/testrun_hadoop-yarn-client.txt |
| hadoop-yarn-common test log | /home/jenkins/jenkins-slave/workspace/PreCommit-YARN-Build/patchprocess/testrun_hadoop-yarn-common.txt |
| hadoop-yarn-server-applicationhistoryservice test log | /home/jenkins/jenkins-slave/workspace/PreCommit-YARN-Build/patchprocess/testrun_hadoop-yarn-server-applicationhistoryservice.txt |
| hadoop-yarn-server-common test log | /home/jenkins/jenkins-slave/workspace/PreCommit-YARN-Build/patchprocess/testrun_hadoop-yarn-server-common.txt |
| hadoop-yarn-server-resourcemanager test log | /home/jenkins/jenkins-slave/workspace/PreCommit-YARN-Build/patchprocess/testrun_hadoop-yarn-server-resourcemanager.txt |
| Test Results | https://builds.apache.org/job/PreCommit-YARN-Build/7872/testReport/ |
| Java | 1.7.0_55 |
| uname | Linux asf901.gq1.ygridcore.net 3.13.0-36-lowlatency #63-Ubuntu SMP PREEMPT Wed Sep 3 21:56:12 UTC 2014 x86_64 x86_64 x86_64 GNU/Linux |
============================================================================
============================================================================
Adding comment to JIRA
============================================================================
============================================================================
Comment added.
9e78353aa59e0dc749d4e856e03eb987583b96d7 logged out
============================================================================
============================================================================
Finished build.
============================================================================
============================================================================
Build step 'Execute shell' marked build as failure
Archiving artifacts
Sending artifact delta relative to PreCommit-YARN-Build #7869
Archived 69 artifacts
Archive block size is 32768
Received 481 blocks and 16954224 bytes
Compression is 48.2%
Took 7.9 sec
[description-setter] Could not determine description.
Recording test results
Email was triggered for: Failure
Sending email for trigger: Failure
###################################################################################
############################## FAILED TESTS (if any) ##############################
All tests passed