You are viewing a plain text version of this content. The canonical link for it is here.
Posted to dev@any23.apache.org by Apache Jenkins Server <je...@builds.apache.org> on 2012/04/06 09:44:17 UTC

Build failed in Jenkins: Any23-trunk #162

See <https://builds.apache.org/job/Any23-trunk/162/changes>

Changes:

[simonetripodi] dropped trailing spaces on empty line

[mostarda] Moved section Acknowledgments to the Acknowledgments.apt page. Related to #ANY23-57.

[mostarda] Changed site links, removed banners, added powered by Tika banner, added links to acknoledgements and powedby page. Updated acknowledgements. Added powered by page. This commit is related to #ANY23-57, #ANY23-68.

[simonetripodi] updated Tool plugin description

[mostarda] Renamed history to acknowledgements.

------------------------------------------
[...truncated 3044 lines...]
</div>

------------------------------------------------------------------------
Apache Any23 SUCCESS
Total time: 0s
Finished at: Fri Apr 06 07:17:50 GMT+00:00 2012
Final Memory: 124M/382M
------------------------------------------------------------------------

------------------------------------------------------------------------
Apache Any23 :: extractor
------------------------------------------------------------------------

@prefix foaf: <http://xmlns.com/foaf/0.1/> .
@prefix rdf: <http://www.w3.org/1999/02/22-rdf-syntax-ns#> .
@prefix doac: <http://ramonantonio.net/doac/0.1/#> .

_:node87919e2de475937c47b1d31b77ce651 a <http://schema.org/LocalBusiness> .

_:node68348111a754c8b4596678d165a172 a <http://schema.org/PostalAddress> ;
	<http://schema.org/PostalAddress/streetAddress> "\n            6725 Southwest Bradbury Court\n        " ;
	<http://schema.org/PostalAddress/addressLocality> "Lake Oswego" ;
	<http://schema.org/PostalAddress/postalCode> "97035" ;
	<http://schema.org/PostalAddress/addressRegion> "OR" .

_:node87919e2de475937c47b1d31b77ce651 <http://schema.org/LocalBusiness/address> _:node68348111a754c8b4596678d165a172 ;
	<http://schema.org/LocalBusiness/name> "\n        Golden Key Mini Storage\n    " ;
	<http://schema.org/LocalBusiness/telephone> "\n        (503) 639-1733\n    " ;
	<http://schema.org/LocalBusiness/url> "\n        http://www.goldenkeyministorage.com/\n    " .

<http://example.com/> <http://www.w3.org/1999/xhtml/microdata#item> _:node87919e2de475937c47b1d31b77ce651 .


------------------------------------------------------------------------
Apache Any23 SUCCESS
Total time: 0s
Finished at: Fri Apr 06 07:17:50 GMT+00:00 2012
Final Memory: 131M/382M
------------------------------------------------------------------------
Tests run: 4, Failures: 0, Errors: 0, Skipped: 0, Time elapsed: 0.608 sec
Running org.apache.any23.cli.ToolRunnerTest
Tests run: 1, Failures: 0, Errors: 0, Skipped: 0, Time elapsed: 0.068 sec
Running org.apache.any23.validator.DefaultValidatorTest
Tests run: 4, Failures: 0, Errors: 0, Skipped: 0, Time elapsed: 0.001 sec
Running org.apache.any23.validator.XMLValidationReportSerializerTest
Tests run: 2, Failures: 0, Errors: 0, Skipped: 0, Time elapsed: 0.001 sec
Running org.apache.any23.Any23Test
Tests run: 23, Failures: 0, Errors: 0, Skipped: 0, Time elapsed: 9.451 sec
Running org.apache.any23.extractor.xpath.TemplateXPathExtractorRuleImplTest
Tests run: 6, Failures: 0, Errors: 0, Skipped: 0, Time elapsed: 0.138 sec
Running org.apache.any23.extractor.rdf.TurtleExtractorTest
Tests run: 1, Failures: 0, Errors: 0, Skipped: 0, Time elapsed: 0.001 sec
Running org.apache.any23.extractor.microdata.MicrodataParserTest
Tests run: 9, Failures: 0, Errors: 0, Skipped: 0, Time elapsed: 0.127 sec
Running org.apache.any23.extractor.microdata.MicrodataExtractorTest
log4j:WARN No appenders could be found for logger (org.apache.any23.extractor.microdata.MicrodataExtractorTest).
log4j:WARN Please initialize the log4j system properly.
Tests run: 6, Failures: 0, Errors: 0, Skipped: 0, Time elapsed: 0.242 sec
Running org.apache.any23.extractor.html.HListingExtractorTest
Tests run: 26, Failures: 0, Errors: 0, Skipped: 0, Time elapsed: 0.518 sec
Running org.apache.any23.extractor.html.HTMLMetaExtractorTest
Tests run: 2, Failures: 0, Errors: 0, Skipped: 0, Time elapsed: 0.023 sec
Running org.apache.any23.extractor.html.HRecipeExtractorTest
Tests run: 2, Failures: 0, Errors: 0, Skipped: 0, Time elapsed: 0.08 sec
Running org.apache.any23.extractor.html.RDFMergerTest
Tests run: 10, Failures: 0, Errors: 0, Skipped: 0, Time elapsed: 0.856 sec
Running org.apache.any23.extractor.html.LicenseExtractorTest
Tests run: 6, Failures: 0, Errors: 0, Skipped: 0, Time elapsed: 0.027 sec
Running org.apache.any23.extractor.html.HTMLDocumentTest
Tests run: 1, Failures: 0, Errors: 0, Skipped: 0, Time elapsed: 0 sec
Running org.apache.any23.extractor.html.HCardExtractorTest
Tests run: 45, Failures: 0, Errors: 0, Skipped: 0, Time elapsed: 2.44 sec
Running org.apache.any23.extractor.html.HResumeExtractorTest
Tests run: 4, Failures: 0, Errors: 0, Skipped: 0, Time elapsed: 0.286 sec
Running org.apache.any23.extractor.html.TitleExtractorTest
Tests run: 5, Failures: 0, Errors: 0, Skipped: 0, Time elapsed: 0.017 sec
Running org.apache.any23.extractor.html.SpanCloserInputStreamTest
Tests run: 7, Failures: 0, Errors: 0, Skipped: 0, Time elapsed: 0.009 sec
Running org.apache.any23.extractor.html.EncodingTest
Tests run: 5, Failures: 0, Errors: 0, Skipped: 0, Time elapsed: 0.009 sec
Running org.apache.any23.extractor.html.XFNExtractorTest
Tests run: 15, Failures: 0, Errors: 0, Skipped: 0, Time elapsed: 0.043 sec
Running org.apache.any23.extractor.html.HeadLinkExtractorTest
Tests run: 1, Failures: 0, Errors: 0, Skipped: 0, Time elapsed: 0.007 sec
Running org.apache.any23.extractor.html.AdrExtractorTest
Tests run: 1, Failures: 0, Errors: 0, Skipped: 0, Time elapsed: 0.288 sec
Running org.apache.any23.extractor.html.TagSoupParserTest
Tests run: 4, Failures: 0, Errors: 0, Skipped: 0, Time elapsed: 0.087 sec
Running org.apache.any23.extractor.html.HReviewExtractorTest
Tests run: 6, Failures: 0, Errors: 0, Skipped: 0, Time elapsed: 0.068 sec
Running org.apache.any23.extractor.html.TurtleHTMLExtractorTest
Tests run: 1, Failures: 0, Errors: 0, Skipped: 0, Time elapsed: 0.009 sec
Running org.apache.any23.extractor.html.SpeciesExtractorTest
Tests run: 1, Failures: 0, Errors: 0, Skipped: 0, Time elapsed: 0.062 sec
Running org.apache.any23.extractor.html.HCalendarExtractorTest
Tests run: 27, Failures: 0, Errors: 0, Skipped: 0, Time elapsed: 0.452 sec
Running org.apache.any23.extractor.html.DomUtilsTest
Tests run: 7, Failures: 0, Errors: 0, Skipped: 0, Time elapsed: 0.189 sec
Running org.apache.any23.extractor.ExtractionAPITest
Tests run: 1, Failures: 0, Errors: 0, Skipped: 0, Time elapsed: 0 sec
Running org.apache.any23.extractor.ExtractionParametersTest
Tests run: 2, Failures: 0, Errors: 0, Skipped: 0, Time elapsed: 0 sec
Running org.apache.any23.extractor.rdfa.RDFaExtractorTest
<http://bob.example.com/> <http://purl.org/dc/terms/title> "The trouble with Bob"@en <http://bob.example.com/> .
<http://bob.example.com/> <http://purl.org/dc/terms/creator> "Alice"@en <http://bob.example.com/> .
<http://bob.example.com/> <http://fake.org/prop> "Mary"@en <http://bob.example.com/> .

Tests run: 7, Failures: 0, Errors: 0, Skipped: 0, Time elapsed: 0.54 sec
Running org.apache.any23.extractor.rdfa.ExtractionExceptionTest
Tests run: 1, Failures: 0, Errors: 0, Skipped: 0, Time elapsed: 0.024 sec
Running org.apache.any23.extractor.rdfa.RDFa11ExtractorTest
<http://bob.example.com/> <http://purl.org/dc/terms/title> "The trouble with Bob"@en <http://bob.example.com/> .
<http://bob.example.com/> <http://purl.org/dc/terms/creator> "Alice"@en <http://bob.example.com/> .
<http://bob.example.com/> <http://fake.org/prop> "Mary"@en <http://bob.example.com/> .

Tests run: 14, Failures: 0, Errors: 0, Skipped: 0, Time elapsed: 0.142 sec
Running org.apache.any23.extractor.rdfa.XSLTStylesheetTest
Tests run: 2, Failures: 0, Errors: 0, Skipped: 0, Time elapsed: 0.014 sec
Running org.apache.any23.extractor.rdfa.RDFa11ParserTest
Tests run: 12, Failures: 0, Errors: 0, Skipped: 0, Time elapsed: 0.378 sec
Running org.apache.any23.extractor.csv.CSVReaderBuilderTest
Tests run: 2, Failures: 0, Errors: 0, Skipped: 0, Time elapsed: 0.003 sec
Running org.apache.any23.extractor.csv.CSVExtractorTest
Tests run: 4, Failures: 0, Errors: 0, Skipped: 0, Time elapsed: 0.012 sec
Running org.apache.any23.extractor.ExtractionResultImplTest
Tests run: 1, Failures: 0, Errors: 0, Skipped: 0, Time elapsed: 0.002 sec
Running org.apache.any23.extractor.SingleDocumentExtractionTest
Tests run: 5, Failures: 0, Errors: 0, Skipped: 0, Time elapsed: 0.211 sec
Running org.apache.any23.http.AcceptHeaderBuilderTest
Tests run: 12, Failures: 0, Errors: 0, Skipped: 0, Time elapsed: 0.001 sec
Running org.apache.any23.configuration.DefaultConfigurationTest
Tests run: 14, Failures: 0, Errors: 0, Skipped: 0, Time elapsed: 0.002 sec
Running org.apache.any23.filter.ExtractionContextBlockerTest
Tests run: 1, Failures: 0, Errors: 0, Skipped: 0, Time elapsed: 0.001 sec
Running org.apache.any23.filter.IgnoreAccidentalRDFaTest
Tests run: 2, Failures: 0, Errors: 0, Skipped: 0, Time elapsed: 0.004 sec
Running org.apache.any23.plugin.Any23PluginManagerTest
Tests run: 2, Failures: 0, Errors: 0, Skipped: 0, Time elapsed: 0.001 sec
Running org.apache.any23.vocab.VocabularyTest
Tests run: 3, Failures: 0, Errors: 0, Skipped: 0, Time elapsed: 0 sec
Running org.apache.any23.vocab.RDFSchemaUtilsTest
Tests run: 2, Failures: 0, Errors: 0, Skipped: 0, Time elapsed: 0.059 sec
Running org.apache.any23.util.StringUtilsTest
Tests run: 3, Failures: 0, Errors: 0, Skipped: 0, Time elapsed: 0 sec
Running org.apache.any23.util.DiscoveryUtilsTest
Tests run: 2, Failures: 0, Errors: 0, Skipped: 0, Time elapsed: 0.02 sec
Running org.apache.any23.SesameTest
Tests run: 3, Failures: 0, Errors: 0, Skipped: 0, Time elapsed: 0.001 sec
Running org.apache.any23.mime.purifier.WhiteSpacesPurifierTest
Tests run: 1, Failures: 0, Errors: 0, Skipped: 0, Time elapsed: 0.006 sec
Running org.apache.any23.mime.TikaMIMETypeDetectorTest
Tests run: 42, Failures: 0, Errors: 0, Skipped: 0, Time elapsed: 0.055 sec
Running org.apache.any23.encoding.TikaEncodingDetectorTest
Tests run: 6, Failures: 0, Errors: 0, Skipped: 0, Time elapsed: 0.009 sec

Results :

Tests run: 455, Failures: 0, Errors: 0, Skipped: 0

[JENKINS] Recording test results
[INFO] [jar:jar {execution: default-jar}]
[INFO] Building jar: <https://builds.apache.org/job/Any23-trunk/ws/core/target/any23-core-0.7.0-incubating-SNAPSHOT.jar>
[INFO] [appassembler:assemble {execution: default}]
[INFO] Installing /export/home/hudson/hudson-slave/maven-repositories/1/commons-lang/commons-lang/2.4/commons-lang-2.4.jar to <https://builds.apache.org/job/Any23-trunk/ws/core/target/appassembler/lib/commons-lang-2.4.jar>
[INFO] Installing /export/home/hudson/hudson-slave/maven-repositories/1/commons-httpclient/commons-httpclient/3.1/commons-httpclient-3.1.jar to <https://builds.apache.org/job/Any23-trunk/ws/core/target/appassembler/lib/commons-httpclient-3.1.jar>
[INFO] Installing /export/home/hudson/hudson-slave/maven-repositories/1/commons-logging/commons-logging/1.0.4/commons-logging-1.0.4.jar to <https://builds.apache.org/job/Any23-trunk/ws/core/target/appassembler/lib/commons-logging-1.0.4.jar>
[INFO] Installing /export/home/hudson/hudson-slave/maven-repositories/1/commons-codec/commons-codec/1.3/commons-codec-1.3.jar to <https://builds.apache.org/job/Any23-trunk/ws/core/target/appassembler/lib/commons-codec-1.3.jar>
[INFO] Installing /export/home/hudson/hudson-slave/maven-repositories/1/net/sourceforge/nekohtml/nekohtml/1.9.14/nekohtml-1.9.14.jar to <https://builds.apache.org/job/Any23-trunk/ws/core/target/appassembler/lib/nekohtml-1.9.14.jar>
[INFO] Installing /export/home/hudson/hudson-slave/maven-repositories/1/xerces/xercesImpl/2.9.1/xercesImpl-2.9.1.jar to <https://builds.apache.org/job/Any23-trunk/ws/core/target/appassembler/lib/xercesImpl-2.9.1.jar>
[INFO] Installing /export/home/hudson/hudson-slave/maven-repositories/1/xml-apis/xml-apis/1.3.04/xml-apis-1.3.04.jar to <https://builds.apache.org/job/Any23-trunk/ws/core/target/appassembler/lib/xml-apis-1.3.04.jar>
[INFO] Installing /export/home/hudson/hudson-slave/maven-repositories/1/com/beust/jcommander/1.23/jcommander-1.23.jar to <https://builds.apache.org/job/Any23-trunk/ws/core/target/appassembler/lib/jcommander-1.23.jar>
[INFO] Installing /export/home/hudson/hudson-slave/maven-repositories/1/org/apache/tika/tika-core/0.6/tika-core-0.6.jar to <https://builds.apache.org/job/Any23-trunk/ws/core/target/appassembler/lib/tika-core-0.6.jar>
[INFO] Installing /export/home/hudson/hudson-slave/maven-repositories/1/org/apache/tika/tika-parsers/0.6/tika-parsers-0.6.jar to <https://builds.apache.org/job/Any23-trunk/ws/core/target/appassembler/lib/tika-parsers-0.6.jar>
[INFO] Installing /export/home/hudson/hudson-slave/maven-repositories/1/org/apache/commons/commons-compress/1.0/commons-compress-1.0.jar to <https://builds.apache.org/job/Any23-trunk/ws/core/target/appassembler/lib/commons-compress-1.0.jar>
[INFO] Installing /export/home/hudson/hudson-slave/maven-repositories/1/org/apache/pdfbox/pdfbox/0.8.0-incubating/pdfbox-0.8.0-incubating.jar to <https://builds.apache.org/job/Any23-trunk/ws/core/target/appassembler/lib/pdfbox-0.8.0-incubating.jar>
[INFO] Installing /export/home/hudson/hudson-slave/maven-repositories/1/org/apache/pdfbox/fontbox/0.8.0-incubator/fontbox-0.8.0-incubator.jar to <https://builds.apache.org/job/Any23-trunk/ws/core/target/appassembler/lib/fontbox-0.8.0-incubator.jar>
[INFO] Installing /export/home/hudson/hudson-slave/maven-repositories/1/org/apache/pdfbox/jempbox/0.8.0-incubator/jempbox-0.8.0-incubator.jar to <https://builds.apache.org/job/Any23-trunk/ws/core/target/appassembler/lib/jempbox-0.8.0-incubator.jar>
[INFO] Installing /export/home/hudson/hudson-slave/maven-repositories/1/org/apache/poi/poi/3.6/poi-3.6.jar to <https://builds.apache.org/job/Any23-trunk/ws/core/target/appassembler/lib/poi-3.6.jar>
[INFO] Installing /export/home/hudson/hudson-slave/maven-repositories/1/log4j/log4j/1.2.14/log4j-1.2.14.jar to <https://builds.apache.org/job/Any23-trunk/ws/core/target/appassembler/lib/log4j-1.2.14.jar>
[INFO] Installing /export/home/hudson/hudson-slave/maven-repositories/1/org/apache/poi/poi-scratchpad/3.6/poi-scratchpad-3.6.jar to <https://builds.apache.org/job/Any23-trunk/ws/core/target/appassembler/lib/poi-scratchpad-3.6.jar>
[INFO] Installing /export/home/hudson/hudson-slave/maven-repositories/1/org/apache/poi/poi-ooxml/3.6/poi-ooxml-3.6.jar to <https://builds.apache.org/job/Any23-trunk/ws/core/target/appassembler/lib/poi-ooxml-3.6.jar>
[INFO] Installing /export/home/hudson/hudson-slave/maven-repositories/1/org/apache/poi/poi-ooxml-schemas/3.6/poi-ooxml-schemas-3.6.jar to <https://builds.apache.org/job/Any23-trunk/ws/core/target/appassembler/lib/poi-ooxml-schemas-3.6.jar>
[INFO] Installing /export/home/hudson/hudson-slave/maven-repositories/1/org/apache/xmlbeans/xmlbeans/2.3.0/xmlbeans-2.3.0.jar to <https://builds.apache.org/job/Any23-trunk/ws/core/target/appassembler/lib/xmlbeans-2.3.0.jar>
[INFO] Installing /export/home/hudson/hudson-slave/maven-repositories/1/org/apache/geronimo/specs/geronimo-stax-api_1.0_spec/1.0.1/geronimo-stax-api_1.0_spec-1.0.1.jar to <https://builds.apache.org/job/Any23-trunk/ws/core/target/appassembler/lib/geronimo-stax-api_1.0_spec-1.0.1.jar>
[INFO] Installing /export/home/hudson/hudson-slave/maven-repositories/1/dom4j/dom4j/1.6.1/dom4j-1.6.1.jar to <https://builds.apache.org/job/Any23-trunk/ws/core/target/appassembler/lib/dom4j-1.6.1.jar>
[INFO] Installing /export/home/hudson/hudson-slave/maven-repositories/1/org/ccil/cowan/tagsoup/tagsoup/1.2/tagsoup-1.2.jar to <https://builds.apache.org/job/Any23-trunk/ws/core/target/appassembler/lib/tagsoup-1.2.jar>
[INFO] Installing /export/home/hudson/hudson-slave/maven-repositories/1/asm/asm/3.1/asm-3.1.jar to <https://builds.apache.org/job/Any23-trunk/ws/core/target/appassembler/lib/asm-3.1.jar>
[INFO] Installing /export/home/hudson/hudson-slave/maven-repositories/1/com/drewnoakes/metadata-extractor/2.4.0-beta-1/metadata-extractor-2.4.0-beta-1.jar to <https://builds.apache.org/job/Any23-trunk/ws/core/target/appassembler/lib/metadata-extractor-2.4.0-beta-1.jar>
[INFO] Installing /export/home/hudson/hudson-slave/maven-repositories/1/org/openrdf/sesame/sesame-model/2.6.1/sesame-model-2.6.1.jar to <https://builds.apache.org/job/Any23-trunk/ws/core/target/appassembler/lib/sesame-model-2.6.1.jar>
[INFO] Installing /export/home/hudson/hudson-slave/maven-repositories/1/org/openrdf/sesame/sesame-util/2.6.1/sesame-util-2.6.1.jar to <https://builds.apache.org/job/Any23-trunk/ws/core/target/appassembler/lib/sesame-util-2.6.1.jar>
[INFO] Installing /export/home/hudson/hudson-slave/maven-repositories/1/org/slf4j/slf4j-api/1.5.6/slf4j-api-1.5.6.jar to <https://builds.apache.org/job/Any23-trunk/ws/core/target/appassembler/lib/slf4j-api-1.5.6.jar>
[INFO] Installing /export/home/hudson/hudson-slave/maven-repositories/1/org/openrdf/sesame/sesame-rio-api/2.6.1/sesame-rio-api-2.6.1.jar to <https://builds.apache.org/job/Any23-trunk/ws/core/target/appassembler/lib/sesame-rio-api-2.6.1.jar>
[INFO] Installing /export/home/hudson/hudson-slave/maven-repositories/1/org/openrdf/sesame/sesame-rio-turtle/2.6.1/sesame-rio-turtle-2.6.1.jar to <https://builds.apache.org/job/Any23-trunk/ws/core/target/appassembler/lib/sesame-rio-turtle-2.6.1.jar>
[INFO] Installing /export/home/hudson/hudson-slave/maven-repositories/1/org/openrdf/sesame/sesame-rio-rdfxml/2.6.1/sesame-rio-rdfxml-2.6.1.jar to <https://builds.apache.org/job/Any23-trunk/ws/core/target/appassembler/lib/sesame-rio-rdfxml-2.6.1.jar>
[INFO] Installing /export/home/hudson/hudson-slave/maven-repositories/1/org/openrdf/sesame/sesame-rio-ntriples/2.6.1/sesame-rio-ntriples-2.6.1.jar to <https://builds.apache.org/job/Any23-trunk/ws/core/target/appassembler/lib/sesame-rio-ntriples-2.6.1.jar>
[INFO] Installing /export/home/hudson/hudson-slave/maven-repositories/1/org/openrdf/sesame/sesame-rio-trix/2.6.1/sesame-rio-trix-2.6.1.jar to <https://builds.apache.org/job/Any23-trunk/ws/core/target/appassembler/lib/sesame-rio-trix-2.6.1.jar>
[INFO] Installing /export/home/hudson/hudson-slave/maven-repositories/1/org/openrdf/sesame/sesame-repository-sail/2.6.1/sesame-repository-sail-2.6.1.jar to <https://builds.apache.org/job/Any23-trunk/ws/core/target/appassembler/lib/sesame-repository-sail-2.6.1.jar>
[INFO] Installing /export/home/hudson/hudson-slave/maven-repositories/1/org/openrdf/sesame/sesame-repository-api/2.6.1/sesame-repository-api-2.6.1.jar to <https://builds.apache.org/job/Any23-trunk/ws/core/target/appassembler/lib/sesame-repository-api-2.6.1.jar>
[INFO] Installing /export/home/hudson/hudson-slave/maven-repositories/1/org/openrdf/sesame/sesame-query/2.6.1/sesame-query-2.6.1.jar to <https://builds.apache.org/job/Any23-trunk/ws/core/target/appassembler/lib/sesame-query-2.6.1.jar>
[INFO] Installing /export/home/hudson/hudson-slave/maven-repositories/1/org/openrdf/sesame/sesame-sail-api/2.6.1/sesame-sail-api-2.6.1.jar to <https://builds.apache.org/job/Any23-trunk/ws/core/target/appassembler/lib/sesame-sail-api-2.6.1.jar>
[INFO] Installing /export/home/hudson/hudson-slave/maven-repositories/1/org/openrdf/sesame/sesame-queryalgebra-model/2.6.1/sesame-queryalgebra-model-2.6.1.jar to <https://builds.apache.org/job/Any23-trunk/ws/core/target/appassembler/lib/sesame-queryalgebra-model-2.6.1.jar>
[INFO] Installing /export/home/hudson/hudson-slave/maven-repositories/1/org/openrdf/sesame/sesame-queryparser-api/2.6.1/sesame-queryparser-api-2.6.1.jar to <https://builds.apache.org/job/Any23-trunk/ws/core/target/appassembler/lib/sesame-queryparser-api-2.6.1.jar>
[INFO] Installing /export/home/hudson/hudson-slave/maven-repositories/1/org/openrdf/sesame/sesame-sail-memory/2.6.1/sesame-sail-memory-2.6.1.jar to <https://builds.apache.org/job/Any23-trunk/ws/core/target/appassembler/lib/sesame-sail-memory-2.6.1.jar>
[INFO] Installing /export/home/hudson/hudson-slave/maven-repositories/1/org/openrdf/sesame/sesame-sail-inferencer/2.6.1/sesame-sail-inferencer-2.6.1.jar to <https://builds.apache.org/job/Any23-trunk/ws/core/target/appassembler/lib/sesame-sail-inferencer-2.6.1.jar>
[INFO] Installing /export/home/hudson/hudson-slave/maven-repositories/1/org/openrdf/sesame/sesame-queryparser-serql/2.6.1/sesame-queryparser-serql-2.6.1.jar to <https://builds.apache.org/job/Any23-trunk/ws/core/target/appassembler/lib/sesame-queryparser-serql-2.6.1.jar>
[INFO] Installing /export/home/hudson/hudson-slave/maven-repositories/1/org/openrdf/sesame/sesame-queryalgebra-evaluation/2.6.1/sesame-queryalgebra-evaluation-2.6.1.jar to <https://builds.apache.org/job/Any23-trunk/ws/core/target/appassembler/lib/sesame-queryalgebra-evaluation-2.6.1.jar>
[INFO] Installing /export/home/hudson/hudson-slave/maven-repositories/1/org/openrdf/sesame/sesame-repository-sparql/2.6.1/sesame-repository-sparql-2.6.1.jar to <https://builds.apache.org/job/Any23-trunk/ws/core/target/appassembler/lib/sesame-repository-sparql-2.6.1.jar>
[INFO] Installing /export/home/hudson/hudson-slave/maven-repositories/1/org/openrdf/sesame/sesame-http-client/2.6.1/sesame-http-client-2.6.1.jar to <https://builds.apache.org/job/Any23-trunk/ws/core/target/appassembler/lib/sesame-http-client-2.6.1.jar>
[INFO] Installing /export/home/hudson/hudson-slave/maven-repositories/1/org/openrdf/sesame/sesame-http-protocol/2.6.1/sesame-http-protocol-2.6.1.jar to <https://builds.apache.org/job/Any23-trunk/ws/core/target/appassembler/lib/sesame-http-protocol-2.6.1.jar>
[INFO] Installing /export/home/hudson/hudson-slave/maven-repositories/1/org/openrdf/sesame/sesame-queryresultio-api/2.6.1/sesame-queryresultio-api-2.6.1.jar to <https://builds.apache.org/job/Any23-trunk/ws/core/target/appassembler/lib/sesame-queryresultio-api-2.6.1.jar>
[INFO] Installing /export/home/hudson/hudson-slave/maven-repositories/1/org/openrdf/sesame/sesame-queryresultio-sparqlxml/2.6.1/sesame-queryresultio-sparqlxml-2.6.1.jar to <https://builds.apache.org/job/Any23-trunk/ws/core/target/appassembler/lib/sesame-queryresultio-sparqlxml-2.6.1.jar>
[INFO] Installing /export/home/hudson/hudson-slave/maven-repositories/1/info/aduna/commons/aduna-commons-xml/2.7.0/aduna-commons-xml-2.7.0.jar to <https://builds.apache.org/job/Any23-trunk/ws/core/target/appassembler/lib/aduna-commons-xml-2.7.0.jar>
[INFO] Installing /export/home/hudson/hudson-slave/maven-repositories/1/info/aduna/commons/aduna-commons-text/2.7.0/aduna-commons-text-2.7.0.jar to <https://builds.apache.org/job/Any23-trunk/ws/core/target/appassembler/lib/aduna-commons-text-2.7.0.jar>
[INFO] Installing /export/home/hudson/hudson-slave/maven-repositories/1/info/aduna/commons/aduna-commons-net/2.7.0/aduna-commons-net-2.7.0.jar to <https://builds.apache.org/job/Any23-trunk/ws/core/target/appassembler/lib/aduna-commons-net-2.7.0.jar>
[INFO] Installing /export/home/hudson/hudson-slave/maven-repositories/1/info/aduna/commons/aduna-commons-lang/2.9.0/aduna-commons-lang-2.9.0.jar to <https://builds.apache.org/job/Any23-trunk/ws/core/target/appassembler/lib/aduna-commons-lang-2.9.0.jar>
[INFO] Installing /export/home/hudson/hudson-slave/maven-repositories/1/info/aduna/commons/aduna-commons-iteration/2.10.0/aduna-commons-iteration-2.10.0.jar to <https://builds.apache.org/job/Any23-trunk/ws/core/target/appassembler/lib/aduna-commons-iteration-2.10.0.jar>
[INFO] Installing /export/home/hudson/hudson-slave/maven-repositories/1/info/aduna/commons/aduna-commons-concurrent/2.7.0/aduna-commons-concurrent-2.7.0.jar to <https://builds.apache.org/job/Any23-trunk/ws/core/target/appassembler/lib/aduna-commons-concurrent-2.7.0.jar>
[INFO] Installing /export/home/hudson/hudson-slave/maven-repositories/1/info/aduna/commons/aduna-commons-io/2.10.0/aduna-commons-io-2.10.0.jar to <https://builds.apache.org/job/Any23-trunk/ws/core/target/appassembler/lib/aduna-commons-io-2.10.0.jar>
[INFO] Installing /export/home/hudson/hudson-slave/maven-repositories/1/org/apache/commons/commons-csv/1.0-SNAPSHOT-rev1148315/commons-csv-1.0-SNAPSHOT-rev1148315.jar to <https://builds.apache.org/job/Any23-trunk/ws/core/target/appassembler/lib/commons-csv-1.0-SNAPSHOT-rev1148315.jar>
[INFO] Installing /export/home/hudson/hudson-slave/maven-repositories/1/org/slf4j/slf4j-jdk14/1.5.6/slf4j-jdk14-1.5.6.jar to <https://builds.apache.org/job/Any23-trunk/ws/core/target/appassembler/lib/slf4j-jdk14-1.5.6.jar>
[INFO] Installing /export/home/hudson/hudson-slave/maven-repositories/1/org/slf4j/jcl-over-slf4j/1.5.6/jcl-over-slf4j-1.5.6.jar to <https://builds.apache.org/job/Any23-trunk/ws/core/target/appassembler/lib/jcl-over-slf4j-1.5.6.jar>
[INFO] Installing <https://builds.apache.org/job/Any23-trunk/ws/core/target/any23-core-0.7.0-incubating-SNAPSHOT.jar> to <https://builds.apache.org/job/Any23-trunk/ws/core/target/appassembler/lib/any23-core-0.7.0-incubating-SNAPSHOT.jar>
[INFO] [assembly:single {execution: assembly}]
[INFO] Reading assembly descriptor: <https://builds.apache.org/job/Any23-trunk/ws/core/src/main/assembly/bin.xml>
[INFO] Building tar : <https://builds.apache.org/job/Any23-trunk/ws/core/target/apache-any23-0.7.0-incubating-SNAPSHOT-bin.tar.gz>
[INFO] Building zip: <https://builds.apache.org/job/Any23-trunk/ws/core/target/apache-any23-0.7.0-incubating-SNAPSHOT-bin.zip>
[INFO] [install:install {execution: default-install}]
[INFO] Installing <https://builds.apache.org/job/Any23-trunk/ws/core/target/any23-core-0.7.0-incubating-SNAPSHOT.jar> to /export/home/hudson/hudson-slave/maven-repositories/1/org/apache/any23/any23-core/0.7.0-incubating-SNAPSHOT/any23-core-0.7.0-incubating-SNAPSHOT.jar
[INFO] Installing <https://builds.apache.org/job/Any23-trunk/ws/core/target/apache-any23-0.7.0-incubating-SNAPSHOT-bin.tar.gz> to /export/home/hudson/hudson-slave/maven-repositories/1/org/apache/any23/any23-core/0.7.0-incubating-SNAPSHOT/any23-core-0.7.0-incubating-SNAPSHOT-bin.tar.gz
[INFO] Installing <https://builds.apache.org/job/Any23-trunk/ws/core/target/apache-any23-0.7.0-incubating-SNAPSHOT-bin.zip> to /export/home/hudson/hudson-slave/maven-repositories/1/org/apache/any23/any23-core/0.7.0-incubating-SNAPSHOT/any23-core-0.7.0-incubating-SNAPSHOT-bin.zip
[JENKINS] Archiving <https://builds.apache.org/job/Any23-trunk/ws/core/pom.xml> to /home/hudson/hudson/jobs/Any23-trunk/modules/org.apache.any23$any23-core/builds/2012-04-06_07-12-49/archive/org.apache.any23/any23-core/0.7.0-incubating-SNAPSHOT/any23-core-0.7.0-incubating-SNAPSHOT.pom
[JENKINS] Archiving <https://builds.apache.org/job/Any23-trunk/ws/core/target/any23-core-0.7.0-incubating-SNAPSHOT.jar> to /home/hudson/hudson/jobs/Any23-trunk/modules/org.apache.any23$any23-core/builds/2012-04-06_07-12-49/archive/org.apache.any23/any23-core/0.7.0-incubating-SNAPSHOT/any23-core-0.7.0-incubating-SNAPSHOT.jar
[JENKINS] Archiving <https://builds.apache.org/job/Any23-trunk/ws/core/target/apache-any23-0.7.0-incubating-SNAPSHOT-bin.tar.gz> to /home/hudson/hudson/jobs/Any23-trunk/modules/org.apache.any23$any23-core/builds/2012-04-06_07-12-49/archive/org.apache.any23/any23-core/0.7.0-incubating-SNAPSHOT/any23-core-0.7.0-incubating-SNAPSHOT-bin.tar.gz
[JENKINS] Archiving <https://builds.apache.org/job/Any23-trunk/ws/core/target/apache-any23-0.7.0-incubating-SNAPSHOT-bin.zip> to /home/hudson/hudson/jobs/Any23-trunk/modules/org.apache.any23$any23-core/builds/2012-04-06_07-12-49/archive/org.apache.any23/any23-core/0.7.0-incubating-SNAPSHOT/any23-core-0.7.0-incubating-SNAPSHOT-bin.zip
[INFO] ------------------------------------------------------------------------
[ERROR] BUILD ERROR
[INFO] ------------------------------------------------------------------------
[INFO] Internal error in the plugin manager executing goal 'org.apache.maven.plugins:maven-deploy-plugin:2.5:deploy': Unable to find the mojo 'deploy' (or one of its required components) in the plugin 'org.apache.maven.plugins:maven-deploy-plugin'
Component descriptor cannot be found in the component repository: org.apache.maven.artifact.repository.layout.ArtifactRepositoryLayoutflat.
[INFO] ------------------------------------------------------------------------
[INFO] For more information, run Maven with the -e switch
[INFO] ------------------------------------------------------------------------
[INFO] Total time: 28 minutes 9 seconds
[INFO] Finished at: Fri Apr 06 07:44:00 GMT+00:00 2012
[INFO] Final Memory: 74M/401M
[INFO] ------------------------------------------------------------------------
channel stopped
Updating ANY23-68
Updating ANY23-57

Jenkins build is still unstable: Any23-trunk #167

Posted by Apache Jenkins Server <je...@builds.apache.org>.
See <https://builds.apache.org/job/Any23-trunk/changes>


Jenkins build is unstable: Any23-trunk #166

Posted by Apache Jenkins Server <je...@builds.apache.org>.
See <https://builds.apache.org/job/Any23-trunk/166/>


Build failed in Jenkins: Any23-trunk #165

Posted by Apache Jenkins Server <je...@builds.apache.org>.
See <https://builds.apache.org/job/Any23-trunk/165/>

------------------------------------------
[...truncated 3574 lines...]
@prefix doac: <http://ramonantonio.net/doac/0.1/#> .

_:node8d695d8a1dfcf1de656c69863ce5e7e7 a <http://schema.org/LocalBusiness> .

_:node1ddf4e762288555f8728c631cc29147f a <http://schema.org/PostalAddress> ;
	<http://schema.org/PostalAddress/streetAddress> "\n            6725 Southwest Bradbury Court\n        " ;
	<http://schema.org/PostalAddress/addressLocality> "Lake Oswego" ;
	<http://schema.org/PostalAddress/postalCode> "97035" ;
	<http://schema.org/PostalAddress/addressRegion> "OR" .

_:node8d695d8a1dfcf1de656c69863ce5e7e7 <http://schema.org/LocalBusiness/address> _:node1ddf4e762288555f8728c631cc29147f ;
	<http://schema.org/LocalBusiness/name> "\n        Golden Key Mini Storage\n    " ;
	<http://schema.org/LocalBusiness/telephone> "\n        (503) 639-1733\n    " ;
	<http://schema.org/LocalBusiness/url> "\n        http://www.goldenkeyministorage.com/\n    " .

<http://example.com/> <http://www.w3.org/1999/xhtml/microdata#item> _:node8d695d8a1dfcf1de656c69863ce5e7e7 .


------------------------------------------------------------------------
Apache Any23 SUCCESS
Total time: 0s
Finished at: Mon Apr 09 07:18:24 GMT+00:00 2012
Final Memory: 29M/380M
------------------------------------------------------------------------
Tests run: 4, Failures: 0, Errors: 0, Skipped: 0, Time elapsed: 0.384 sec
Running org.apache.any23.cli.MimeDetectorTest

------------------------------------------------------------------------
Apache Any23 :: mimes
------------------------------------------------------------------------

text/html

------------------------------------------------------------------------
Apache Any23 SUCCESS
Total time: 0s
Finished at: Mon Apr 09 07:18:25 GMT+00:00 2012
Final Memory: 29M/380M
------------------------------------------------------------------------

------------------------------------------------------------------------
Apache Any23 :: mimes
------------------------------------------------------------------------

application/trix

------------------------------------------------------------------------
Apache Any23 SUCCESS
Total time: 0s
Finished at: Mon Apr 09 07:18:25 GMT+00:00 2012
Final Memory: 36M/380M
------------------------------------------------------------------------

------------------------------------------------------------------------
Apache Any23 :: mimes
------------------------------------------------------------------------

text/n3

------------------------------------------------------------------------
Apache Any23 SUCCESS
Total time: 0s
Finished at: Mon Apr 09 07:18:25 GMT+00:00 2012
Final Memory: 36M/380M
------------------------------------------------------------------------
Tests run: 3, Failures: 0, Errors: 0, Skipped: 0, Time elapsed: 0.002 sec
Running org.apache.any23.configuration.DefaultConfigurationTest
Tests run: 14, Failures: 0, Errors: 0, Skipped: 0, Time elapsed: 0.001 sec
Running org.apache.any23.validator.XMLValidationReportSerializerTest
Tests run: 2, Failures: 0, Errors: 0, Skipped: 0, Time elapsed: 0 sec
Running org.apache.any23.validator.DefaultValidatorTest
Tests run: 4, Failures: 0, Errors: 0, Skipped: 0, Time elapsed: 0 sec
Running org.apache.any23.extractor.rdfa.ExtractionExceptionTest
Tests run: 1, Failures: 0, Errors: 0, Skipped: 0, Time elapsed: 0.001 sec
Running org.apache.any23.extractor.rdfa.RDFaExtractorTest
<http://bob.example.com/> <http://purl.org/dc/terms/title> "The trouble with Bob"@en <http://bob.example.com/> .
<http://bob.example.com/> <http://purl.org/dc/terms/creator> "Alice"@en <http://bob.example.com/> .
<http://bob.example.com/> <http://fake.org/prop> "Mary"@en <http://bob.example.com/> .

Tests run: 7, Failures: 0, Errors: 0, Skipped: 0, Time elapsed: 0.656 sec
Running org.apache.any23.extractor.rdfa.RDFa11ExtractorTest
<http://bob.example.com/> <http://purl.org/dc/terms/title> "The trouble with Bob"@en <http://bob.example.com/> .
<http://bob.example.com/> <http://purl.org/dc/terms/creator> "Alice"@en <http://bob.example.com/> .
<http://bob.example.com/> <http://fake.org/prop> "Mary"@en <http://bob.example.com/> .

Tests run: 14, Failures: 0, Errors: 0, Skipped: 0, Time elapsed: 0.207 sec
Running org.apache.any23.extractor.rdfa.RDFa11ParserTest
Tests run: 12, Failures: 0, Errors: 0, Skipped: 0, Time elapsed: 0.198 sec
Running org.apache.any23.extractor.rdfa.XSLTStylesheetTest
Tests run: 2, Failures: 0, Errors: 0, Skipped: 0, Time elapsed: 0.019 sec
Running org.apache.any23.extractor.ExtractionParametersTest
Tests run: 2, Failures: 0, Errors: 0, Skipped: 0, Time elapsed: 0 sec
Running org.apache.any23.extractor.ExtractionResultImplTest
Tests run: 1, Failures: 0, Errors: 0, Skipped: 0, Time elapsed: 0.001 sec
Running org.apache.any23.extractor.csv.CSVReaderBuilderTest
Tests run: 2, Failures: 0, Errors: 0, Skipped: 0, Time elapsed: 0.002 sec
Running org.apache.any23.extractor.csv.CSVExtractorTest
Tests run: 4, Failures: 0, Errors: 0, Skipped: 0, Time elapsed: 0.023 sec
Running org.apache.any23.extractor.SingleDocumentExtractionTest
Tests run: 5, Failures: 0, Errors: 0, Skipped: 0, Time elapsed: 0.273 sec
Running org.apache.any23.extractor.html.HTMLMetaExtractorTest
Tests run: 2, Failures: 0, Errors: 0, Skipped: 0, Time elapsed: 0.018 sec
Running org.apache.any23.extractor.html.HListingExtractorTest
Tests run: 26, Failures: 0, Errors: 0, Skipped: 0, Time elapsed: 0.537 sec
Running org.apache.any23.extractor.html.HRecipeExtractorTest
Tests run: 2, Failures: 0, Errors: 0, Skipped: 0, Time elapsed: 0.064 sec
Running org.apache.any23.extractor.html.RDFMergerTest
Tests run: 10, Failures: 0, Errors: 0, Skipped: 0, Time elapsed: 0.805 sec
Running org.apache.any23.extractor.html.HTMLDocumentTest
Tests run: 1, Failures: 0, Errors: 0, Skipped: 0, Time elapsed: 0 sec
Running org.apache.any23.extractor.html.TurtleHTMLExtractorTest
Tests run: 1, Failures: 0, Errors: 0, Skipped: 0, Time elapsed: 0.009 sec
Running org.apache.any23.extractor.html.SpanCloserInputStreamTest
Tests run: 7, Failures: 0, Errors: 0, Skipped: 0, Time elapsed: 0.006 sec
Running org.apache.any23.extractor.html.DomUtilsTest
Tests run: 7, Failures: 0, Errors: 0, Skipped: 0, Time elapsed: 0.051 sec
Running org.apache.any23.extractor.html.LicenseExtractorTest
Tests run: 6, Failures: 0, Errors: 0, Skipped: 0, Time elapsed: 0.021 sec
Running org.apache.any23.extractor.html.EncodingTest
Tests run: 5, Failures: 0, Errors: 0, Skipped: 0, Time elapsed: 0.011 sec
Running org.apache.any23.extractor.html.HResumeExtractorTest
Tests run: 4, Failures: 0, Errors: 0, Skipped: 0, Time elapsed: 0.377 sec
Running org.apache.any23.extractor.html.HCardExtractorTest
Tests run: 45, Failures: 0, Errors: 0, Skipped: 0, Time elapsed: 2.34 sec
Running org.apache.any23.extractor.html.TitleExtractorTest
Tests run: 5, Failures: 0, Errors: 0, Skipped: 0, Time elapsed: 0.017 sec
Running org.apache.any23.extractor.html.HeadLinkExtractorTest
Tests run: 1, Failures: 0, Errors: 0, Skipped: 0, Time elapsed: 0.006 sec
Running org.apache.any23.extractor.html.HReviewExtractorTest
Tests run: 6, Failures: 0, Errors: 0, Skipped: 0, Time elapsed: 0.068 sec
Running org.apache.any23.extractor.html.SpeciesExtractorTest
Tests run: 1, Failures: 0, Errors: 0, Skipped: 0, Time elapsed: 0.06 sec
Running org.apache.any23.extractor.html.HCalendarExtractorTest
Tests run: 27, Failures: 0, Errors: 0, Skipped: 0, Time elapsed: 0.443 sec
Running org.apache.any23.extractor.html.AdrExtractorTest
Tests run: 1, Failures: 0, Errors: 0, Skipped: 0, Time elapsed: 0.275 sec
Running org.apache.any23.extractor.html.XFNExtractorTest
Tests run: 15, Failures: 0, Errors: 0, Skipped: 0, Time elapsed: 0.042 sec
Running org.apache.any23.extractor.html.TagSoupParserTest
Tests run: 4, Failures: 0, Errors: 0, Skipped: 0, Time elapsed: 0.099 sec
Running org.apache.any23.extractor.ExtractionAPITest
Tests run: 1, Failures: 0, Errors: 0, Skipped: 0, Time elapsed: 0 sec
Running org.apache.any23.extractor.rdf.TurtleExtractorTest
Tests run: 1, Failures: 0, Errors: 0, Skipped: 0, Time elapsed: 0.001 sec
Running org.apache.any23.extractor.xpath.TemplateXPathExtractorRuleImplTest
Tests run: 6, Failures: 0, Errors: 0, Skipped: 0, Time elapsed: 0.012 sec
Running org.apache.any23.extractor.microdata.MicrodataParserTest
Tests run: 9, Failures: 0, Errors: 0, Skipped: 0, Time elapsed: 0.09 sec
Running org.apache.any23.extractor.microdata.MicrodataExtractorTest
log4j:WARN No appenders could be found for logger (org.apache.any23.extractor.microdata.MicrodataExtractorTest).
log4j:WARN Please initialize the log4j system properly.
Tests run: 6, Failures: 0, Errors: 0, Skipped: 0, Time elapsed: 0.237 sec
Running org.apache.any23.SesameTest
Tests run: 3, Failures: 0, Errors: 0, Skipped: 0, Time elapsed: 0.001 sec
Running org.apache.any23.http.AcceptHeaderBuilderTest
Tests run: 12, Failures: 0, Errors: 0, Skipped: 0, Time elapsed: 0.001 sec

Results :

Tests run: 455, Failures: 0, Errors: 0, Skipped: 0

[JENKINS] Recording test results
[INFO] [jar:jar {execution: default-jar}]
[INFO] Building jar: <https://builds.apache.org/job/Any23-trunk/ws/core/target/any23-core-0.7.0-incubating-SNAPSHOT.jar>
[INFO] [appassembler:assemble {execution: default}]
[INFO] Installing /export/home/hudson/hudson-slave/maven-repositories/1/commons-lang/commons-lang/2.4/commons-lang-2.4.jar to <https://builds.apache.org/job/Any23-trunk/ws/core/target/appassembler/lib/commons-lang-2.4.jar>
[INFO] Installing /export/home/hudson/hudson-slave/maven-repositories/1/commons-httpclient/commons-httpclient/3.1/commons-httpclient-3.1.jar to <https://builds.apache.org/job/Any23-trunk/ws/core/target/appassembler/lib/commons-httpclient-3.1.jar>
[INFO] Installing /export/home/hudson/hudson-slave/maven-repositories/1/commons-logging/commons-logging/1.0.4/commons-logging-1.0.4.jar to <https://builds.apache.org/job/Any23-trunk/ws/core/target/appassembler/lib/commons-logging-1.0.4.jar>
[INFO] Installing /export/home/hudson/hudson-slave/maven-repositories/1/commons-codec/commons-codec/1.3/commons-codec-1.3.jar to <https://builds.apache.org/job/Any23-trunk/ws/core/target/appassembler/lib/commons-codec-1.3.jar>
[INFO] Installing /export/home/hudson/hudson-slave/maven-repositories/1/net/sourceforge/nekohtml/nekohtml/1.9.14/nekohtml-1.9.14.jar to <https://builds.apache.org/job/Any23-trunk/ws/core/target/appassembler/lib/nekohtml-1.9.14.jar>
[INFO] Installing /export/home/hudson/hudson-slave/maven-repositories/1/xerces/xercesImpl/2.9.1/xercesImpl-2.9.1.jar to <https://builds.apache.org/job/Any23-trunk/ws/core/target/appassembler/lib/xercesImpl-2.9.1.jar>
[INFO] Installing /export/home/hudson/hudson-slave/maven-repositories/1/xml-apis/xml-apis/1.3.04/xml-apis-1.3.04.jar to <https://builds.apache.org/job/Any23-trunk/ws/core/target/appassembler/lib/xml-apis-1.3.04.jar>
[INFO] Installing /export/home/hudson/hudson-slave/maven-repositories/1/com/beust/jcommander/1.23/jcommander-1.23.jar to <https://builds.apache.org/job/Any23-trunk/ws/core/target/appassembler/lib/jcommander-1.23.jar>
[INFO] Installing /export/home/hudson/hudson-slave/maven-repositories/1/org/apache/tika/tika-core/0.6/tika-core-0.6.jar to <https://builds.apache.org/job/Any23-trunk/ws/core/target/appassembler/lib/tika-core-0.6.jar>
[INFO] Installing /export/home/hudson/hudson-slave/maven-repositories/1/org/apache/tika/tika-parsers/0.6/tika-parsers-0.6.jar to <https://builds.apache.org/job/Any23-trunk/ws/core/target/appassembler/lib/tika-parsers-0.6.jar>
[INFO] Installing /export/home/hudson/hudson-slave/maven-repositories/1/org/apache/commons/commons-compress/1.0/commons-compress-1.0.jar to <https://builds.apache.org/job/Any23-trunk/ws/core/target/appassembler/lib/commons-compress-1.0.jar>
[INFO] Installing /export/home/hudson/hudson-slave/maven-repositories/1/org/apache/pdfbox/pdfbox/0.8.0-incubating/pdfbox-0.8.0-incubating.jar to <https://builds.apache.org/job/Any23-trunk/ws/core/target/appassembler/lib/pdfbox-0.8.0-incubating.jar>
[INFO] Installing /export/home/hudson/hudson-slave/maven-repositories/1/org/apache/pdfbox/fontbox/0.8.0-incubator/fontbox-0.8.0-incubator.jar to <https://builds.apache.org/job/Any23-trunk/ws/core/target/appassembler/lib/fontbox-0.8.0-incubator.jar>
[INFO] Installing /export/home/hudson/hudson-slave/maven-repositories/1/org/apache/pdfbox/jempbox/0.8.0-incubator/jempbox-0.8.0-incubator.jar to <https://builds.apache.org/job/Any23-trunk/ws/core/target/appassembler/lib/jempbox-0.8.0-incubator.jar>
[INFO] Installing /export/home/hudson/hudson-slave/maven-repositories/1/org/apache/poi/poi/3.6/poi-3.6.jar to <https://builds.apache.org/job/Any23-trunk/ws/core/target/appassembler/lib/poi-3.6.jar>
[INFO] Installing /export/home/hudson/hudson-slave/maven-repositories/1/log4j/log4j/1.2.14/log4j-1.2.14.jar to <https://builds.apache.org/job/Any23-trunk/ws/core/target/appassembler/lib/log4j-1.2.14.jar>
[INFO] Installing /export/home/hudson/hudson-slave/maven-repositories/1/org/apache/poi/poi-scratchpad/3.6/poi-scratchpad-3.6.jar to <https://builds.apache.org/job/Any23-trunk/ws/core/target/appassembler/lib/poi-scratchpad-3.6.jar>
[INFO] Installing /export/home/hudson/hudson-slave/maven-repositories/1/org/apache/poi/poi-ooxml/3.6/poi-ooxml-3.6.jar to <https://builds.apache.org/job/Any23-trunk/ws/core/target/appassembler/lib/poi-ooxml-3.6.jar>
[INFO] Installing /export/home/hudson/hudson-slave/maven-repositories/1/org/apache/poi/poi-ooxml-schemas/3.6/poi-ooxml-schemas-3.6.jar to <https://builds.apache.org/job/Any23-trunk/ws/core/target/appassembler/lib/poi-ooxml-schemas-3.6.jar>
[INFO] Installing /export/home/hudson/hudson-slave/maven-repositories/1/org/apache/xmlbeans/xmlbeans/2.3.0/xmlbeans-2.3.0.jar to <https://builds.apache.org/job/Any23-trunk/ws/core/target/appassembler/lib/xmlbeans-2.3.0.jar>
[INFO] Installing /export/home/hudson/hudson-slave/maven-repositories/1/org/apache/geronimo/specs/geronimo-stax-api_1.0_spec/1.0.1/geronimo-stax-api_1.0_spec-1.0.1.jar to <https://builds.apache.org/job/Any23-trunk/ws/core/target/appassembler/lib/geronimo-stax-api_1.0_spec-1.0.1.jar>
[INFO] Installing /export/home/hudson/hudson-slave/maven-repositories/1/dom4j/dom4j/1.6.1/dom4j-1.6.1.jar to <https://builds.apache.org/job/Any23-trunk/ws/core/target/appassembler/lib/dom4j-1.6.1.jar>
[INFO] Installing /export/home/hudson/hudson-slave/maven-repositories/1/org/ccil/cowan/tagsoup/tagsoup/1.2/tagsoup-1.2.jar to <https://builds.apache.org/job/Any23-trunk/ws/core/target/appassembler/lib/tagsoup-1.2.jar>
[INFO] Installing /export/home/hudson/hudson-slave/maven-repositories/1/asm/asm/3.1/asm-3.1.jar to <https://builds.apache.org/job/Any23-trunk/ws/core/target/appassembler/lib/asm-3.1.jar>
[INFO] Installing /export/home/hudson/hudson-slave/maven-repositories/1/com/drewnoakes/metadata-extractor/2.4.0-beta-1/metadata-extractor-2.4.0-beta-1.jar to <https://builds.apache.org/job/Any23-trunk/ws/core/target/appassembler/lib/metadata-extractor-2.4.0-beta-1.jar>
[INFO] Installing /export/home/hudson/hudson-slave/maven-repositories/1/org/openrdf/sesame/sesame-model/2.6.1/sesame-model-2.6.1.jar to <https://builds.apache.org/job/Any23-trunk/ws/core/target/appassembler/lib/sesame-model-2.6.1.jar>
[INFO] Installing /export/home/hudson/hudson-slave/maven-repositories/1/org/openrdf/sesame/sesame-util/2.6.1/sesame-util-2.6.1.jar to <https://builds.apache.org/job/Any23-trunk/ws/core/target/appassembler/lib/sesame-util-2.6.1.jar>
[INFO] Installing /export/home/hudson/hudson-slave/maven-repositories/1/org/slf4j/slf4j-api/1.5.6/slf4j-api-1.5.6.jar to <https://builds.apache.org/job/Any23-trunk/ws/core/target/appassembler/lib/slf4j-api-1.5.6.jar>
[INFO] Installing /export/home/hudson/hudson-slave/maven-repositories/1/org/openrdf/sesame/sesame-rio-api/2.6.1/sesame-rio-api-2.6.1.jar to <https://builds.apache.org/job/Any23-trunk/ws/core/target/appassembler/lib/sesame-rio-api-2.6.1.jar>
[INFO] Installing /export/home/hudson/hudson-slave/maven-repositories/1/org/openrdf/sesame/sesame-rio-turtle/2.6.1/sesame-rio-turtle-2.6.1.jar to <https://builds.apache.org/job/Any23-trunk/ws/core/target/appassembler/lib/sesame-rio-turtle-2.6.1.jar>
[INFO] Installing /export/home/hudson/hudson-slave/maven-repositories/1/org/openrdf/sesame/sesame-rio-rdfxml/2.6.1/sesame-rio-rdfxml-2.6.1.jar to <https://builds.apache.org/job/Any23-trunk/ws/core/target/appassembler/lib/sesame-rio-rdfxml-2.6.1.jar>
[INFO] Installing /export/home/hudson/hudson-slave/maven-repositories/1/org/openrdf/sesame/sesame-rio-ntriples/2.6.1/sesame-rio-ntriples-2.6.1.jar to <https://builds.apache.org/job/Any23-trunk/ws/core/target/appassembler/lib/sesame-rio-ntriples-2.6.1.jar>
[INFO] Installing /export/home/hudson/hudson-slave/maven-repositories/1/org/openrdf/sesame/sesame-rio-trix/2.6.1/sesame-rio-trix-2.6.1.jar to <https://builds.apache.org/job/Any23-trunk/ws/core/target/appassembler/lib/sesame-rio-trix-2.6.1.jar>
[INFO] Installing /export/home/hudson/hudson-slave/maven-repositories/1/org/openrdf/sesame/sesame-repository-sail/2.6.1/sesame-repository-sail-2.6.1.jar to <https://builds.apache.org/job/Any23-trunk/ws/core/target/appassembler/lib/sesame-repository-sail-2.6.1.jar>
[INFO] Installing /export/home/hudson/hudson-slave/maven-repositories/1/org/openrdf/sesame/sesame-repository-api/2.6.1/sesame-repository-api-2.6.1.jar to <https://builds.apache.org/job/Any23-trunk/ws/core/target/appassembler/lib/sesame-repository-api-2.6.1.jar>
[INFO] Installing /export/home/hudson/hudson-slave/maven-repositories/1/org/openrdf/sesame/sesame-query/2.6.1/sesame-query-2.6.1.jar to <https://builds.apache.org/job/Any23-trunk/ws/core/target/appassembler/lib/sesame-query-2.6.1.jar>
[INFO] Installing /export/home/hudson/hudson-slave/maven-repositories/1/org/openrdf/sesame/sesame-sail-api/2.6.1/sesame-sail-api-2.6.1.jar to <https://builds.apache.org/job/Any23-trunk/ws/core/target/appassembler/lib/sesame-sail-api-2.6.1.jar>
[INFO] Installing /export/home/hudson/hudson-slave/maven-repositories/1/org/openrdf/sesame/sesame-queryalgebra-model/2.6.1/sesame-queryalgebra-model-2.6.1.jar to <https://builds.apache.org/job/Any23-trunk/ws/core/target/appassembler/lib/sesame-queryalgebra-model-2.6.1.jar>
[INFO] Installing /export/home/hudson/hudson-slave/maven-repositories/1/org/openrdf/sesame/sesame-queryparser-api/2.6.1/sesame-queryparser-api-2.6.1.jar to <https://builds.apache.org/job/Any23-trunk/ws/core/target/appassembler/lib/sesame-queryparser-api-2.6.1.jar>
[INFO] Installing /export/home/hudson/hudson-slave/maven-repositories/1/org/openrdf/sesame/sesame-sail-memory/2.6.1/sesame-sail-memory-2.6.1.jar to <https://builds.apache.org/job/Any23-trunk/ws/core/target/appassembler/lib/sesame-sail-memory-2.6.1.jar>
[INFO] Installing /export/home/hudson/hudson-slave/maven-repositories/1/org/openrdf/sesame/sesame-sail-inferencer/2.6.1/sesame-sail-inferencer-2.6.1.jar to <https://builds.apache.org/job/Any23-trunk/ws/core/target/appassembler/lib/sesame-sail-inferencer-2.6.1.jar>
[INFO] Installing /export/home/hudson/hudson-slave/maven-repositories/1/org/openrdf/sesame/sesame-queryparser-serql/2.6.1/sesame-queryparser-serql-2.6.1.jar to <https://builds.apache.org/job/Any23-trunk/ws/core/target/appassembler/lib/sesame-queryparser-serql-2.6.1.jar>
[INFO] Installing /export/home/hudson/hudson-slave/maven-repositories/1/org/openrdf/sesame/sesame-queryalgebra-evaluation/2.6.1/sesame-queryalgebra-evaluation-2.6.1.jar to <https://builds.apache.org/job/Any23-trunk/ws/core/target/appassembler/lib/sesame-queryalgebra-evaluation-2.6.1.jar>
[INFO] Installing /export/home/hudson/hudson-slave/maven-repositories/1/org/openrdf/sesame/sesame-repository-sparql/2.6.1/sesame-repository-sparql-2.6.1.jar to <https://builds.apache.org/job/Any23-trunk/ws/core/target/appassembler/lib/sesame-repository-sparql-2.6.1.jar>
[INFO] Installing /export/home/hudson/hudson-slave/maven-repositories/1/org/openrdf/sesame/sesame-http-client/2.6.1/sesame-http-client-2.6.1.jar to <https://builds.apache.org/job/Any23-trunk/ws/core/target/appassembler/lib/sesame-http-client-2.6.1.jar>
[INFO] Installing /export/home/hudson/hudson-slave/maven-repositories/1/org/openrdf/sesame/sesame-http-protocol/2.6.1/sesame-http-protocol-2.6.1.jar to <https://builds.apache.org/job/Any23-trunk/ws/core/target/appassembler/lib/sesame-http-protocol-2.6.1.jar>
[INFO] Installing /export/home/hudson/hudson-slave/maven-repositories/1/org/openrdf/sesame/sesame-queryresultio-api/2.6.1/sesame-queryresultio-api-2.6.1.jar to <https://builds.apache.org/job/Any23-trunk/ws/core/target/appassembler/lib/sesame-queryresultio-api-2.6.1.jar>
[INFO] Installing /export/home/hudson/hudson-slave/maven-repositories/1/org/openrdf/sesame/sesame-queryresultio-sparqlxml/2.6.1/sesame-queryresultio-sparqlxml-2.6.1.jar to <https://builds.apache.org/job/Any23-trunk/ws/core/target/appassembler/lib/sesame-queryresultio-sparqlxml-2.6.1.jar>
[INFO] Installing /export/home/hudson/hudson-slave/maven-repositories/1/info/aduna/commons/aduna-commons-xml/2.7.0/aduna-commons-xml-2.7.0.jar to <https://builds.apache.org/job/Any23-trunk/ws/core/target/appassembler/lib/aduna-commons-xml-2.7.0.jar>
[INFO] Installing /export/home/hudson/hudson-slave/maven-repositories/1/info/aduna/commons/aduna-commons-text/2.7.0/aduna-commons-text-2.7.0.jar to <https://builds.apache.org/job/Any23-trunk/ws/core/target/appassembler/lib/aduna-commons-text-2.7.0.jar>
[INFO] Installing /export/home/hudson/hudson-slave/maven-repositories/1/info/aduna/commons/aduna-commons-net/2.7.0/aduna-commons-net-2.7.0.jar to <https://builds.apache.org/job/Any23-trunk/ws/core/target/appassembler/lib/aduna-commons-net-2.7.0.jar>
[INFO] Installing /export/home/hudson/hudson-slave/maven-repositories/1/info/aduna/commons/aduna-commons-lang/2.9.0/aduna-commons-lang-2.9.0.jar to <https://builds.apache.org/job/Any23-trunk/ws/core/target/appassembler/lib/aduna-commons-lang-2.9.0.jar>
[INFO] Installing /export/home/hudson/hudson-slave/maven-repositories/1/info/aduna/commons/aduna-commons-iteration/2.10.0/aduna-commons-iteration-2.10.0.jar to <https://builds.apache.org/job/Any23-trunk/ws/core/target/appassembler/lib/aduna-commons-iteration-2.10.0.jar>
[INFO] Installing /export/home/hudson/hudson-slave/maven-repositories/1/info/aduna/commons/aduna-commons-concurrent/2.7.0/aduna-commons-concurrent-2.7.0.jar to <https://builds.apache.org/job/Any23-trunk/ws/core/target/appassembler/lib/aduna-commons-concurrent-2.7.0.jar>
[INFO] Installing /export/home/hudson/hudson-slave/maven-repositories/1/info/aduna/commons/aduna-commons-io/2.10.0/aduna-commons-io-2.10.0.jar to <https://builds.apache.org/job/Any23-trunk/ws/core/target/appassembler/lib/aduna-commons-io-2.10.0.jar>
[INFO] Installing /export/home/hudson/hudson-slave/maven-repositories/1/org/apache/commons/commons-csv/1.0-SNAPSHOT-rev1148315/commons-csv-1.0-SNAPSHOT-rev1148315.jar to <https://builds.apache.org/job/Any23-trunk/ws/core/target/appassembler/lib/commons-csv-1.0-SNAPSHOT-rev1148315.jar>
[INFO] Installing /export/home/hudson/hudson-slave/maven-repositories/1/org/slf4j/slf4j-jdk14/1.5.6/slf4j-jdk14-1.5.6.jar to <https://builds.apache.org/job/Any23-trunk/ws/core/target/appassembler/lib/slf4j-jdk14-1.5.6.jar>
[INFO] Installing /export/home/hudson/hudson-slave/maven-repositories/1/org/slf4j/jcl-over-slf4j/1.5.6/jcl-over-slf4j-1.5.6.jar to <https://builds.apache.org/job/Any23-trunk/ws/core/target/appassembler/lib/jcl-over-slf4j-1.5.6.jar>
[INFO] Installing <https://builds.apache.org/job/Any23-trunk/ws/core/target/any23-core-0.7.0-incubating-SNAPSHOT.jar> to <https://builds.apache.org/job/Any23-trunk/ws/core/target/appassembler/lib/any23-core-0.7.0-incubating-SNAPSHOT.jar>
[INFO] [assembly:single {execution: assembly}]
[INFO] Reading assembly descriptor: <https://builds.apache.org/job/Any23-trunk/ws/core/src/main/assembly/bin.xml>
[INFO] Building tar : <https://builds.apache.org/job/Any23-trunk/ws/core/target/apache-any23-0.7.0-incubating-SNAPSHOT-bin.tar.gz>
[INFO] Building zip: <https://builds.apache.org/job/Any23-trunk/ws/core/target/apache-any23-0.7.0-incubating-SNAPSHOT-bin.zip>
[INFO] [install:install {execution: default-install}]
[INFO] Installing <https://builds.apache.org/job/Any23-trunk/ws/core/target/any23-core-0.7.0-incubating-SNAPSHOT.jar> to /export/home/hudson/hudson-slave/maven-repositories/1/org/apache/any23/any23-core/0.7.0-incubating-SNAPSHOT/any23-core-0.7.0-incubating-SNAPSHOT.jar
[INFO] Installing <https://builds.apache.org/job/Any23-trunk/ws/core/target/apache-any23-0.7.0-incubating-SNAPSHOT-bin.tar.gz> to /export/home/hudson/hudson-slave/maven-repositories/1/org/apache/any23/any23-core/0.7.0-incubating-SNAPSHOT/any23-core-0.7.0-incubating-SNAPSHOT-bin.tar.gz
[INFO] Installing <https://builds.apache.org/job/Any23-trunk/ws/core/target/apache-any23-0.7.0-incubating-SNAPSHOT-bin.zip> to /export/home/hudson/hudson-slave/maven-repositories/1/org/apache/any23/any23-core/0.7.0-incubating-SNAPSHOT/any23-core-0.7.0-incubating-SNAPSHOT-bin.zip
[JENKINS] Archiving <https://builds.apache.org/job/Any23-trunk/ws/core/pom.xml> to /home/hudson/hudson/jobs/Any23-trunk/modules/org.apache.any23$any23-core/builds/2012-04-09_07-12-36/archive/org.apache.any23/any23-core/0.7.0-incubating-SNAPSHOT/any23-core-0.7.0-incubating-SNAPSHOT.pom
[JENKINS] Archiving <https://builds.apache.org/job/Any23-trunk/ws/core/target/any23-core-0.7.0-incubating-SNAPSHOT.jar> to /home/hudson/hudson/jobs/Any23-trunk/modules/org.apache.any23$any23-core/builds/2012-04-09_07-12-36/archive/org.apache.any23/any23-core/0.7.0-incubating-SNAPSHOT/any23-core-0.7.0-incubating-SNAPSHOT.jar
[JENKINS] Archiving <https://builds.apache.org/job/Any23-trunk/ws/core/target/apache-any23-0.7.0-incubating-SNAPSHOT-bin.tar.gz> to /home/hudson/hudson/jobs/Any23-trunk/modules/org.apache.any23$any23-core/builds/2012-04-09_07-12-36/archive/org.apache.any23/any23-core/0.7.0-incubating-SNAPSHOT/any23-core-0.7.0-incubating-SNAPSHOT-bin.tar.gz
[JENKINS] Archiving <https://builds.apache.org/job/Any23-trunk/ws/core/target/apache-any23-0.7.0-incubating-SNAPSHOT-bin.zip> to /home/hudson/hudson/jobs/Any23-trunk/modules/org.apache.any23$any23-core/builds/2012-04-09_07-12-36/archive/org.apache.any23/any23-core/0.7.0-incubating-SNAPSHOT/any23-core-0.7.0-incubating-SNAPSHOT-bin.zip
[INFO] ------------------------------------------------------------------------
[ERROR] BUILD ERROR
[INFO] ------------------------------------------------------------------------
[INFO] Internal error in the plugin manager executing goal 'org.apache.maven.plugins:maven-deploy-plugin:2.5:deploy': Unable to find the mojo 'deploy' (or one of its required components) in the plugin 'org.apache.maven.plugins:maven-deploy-plugin'
Component descriptor cannot be found in the component repository: org.apache.maven.artifact.repository.layout.ArtifactRepositoryLayoutflat.
[INFO] ------------------------------------------------------------------------
[INFO] For more information, run Maven with the -e switch
[INFO] ------------------------------------------------------------------------
[INFO] Total time: 29 minutes 
[INFO] Finished at: Mon Apr 09 07:44:40 GMT+00:00 2012
[INFO] Final Memory: 76M/418M
[INFO] ------------------------------------------------------------------------
channel stopped

Jenkins build is unstable: Any23-trunk #164

Posted by Apache Jenkins Server <je...@builds.apache.org>.
See <https://builds.apache.org/job/Any23-trunk/164/>


Re: Build failed in Jenkins: Any23-trunk #163

Posted by Lewis John Mcgibbney <le...@gmail.com>.
Hi Guys,

It appears that the build is tripping over the deploy execution nested
within the wagon-ssh plugin configuration. Our maven-deploy-plugin
configuration considers no <distributionManagement> section which should
specify a remote repository.

I totally understand that wagon-ssh step, but it doesn't seem to be
correctly configured therefore Maven is not reading it correctly.

This is of course based on the assumption that I am correct in what I say
above.

I'll have a look at it in due course.

Lewis

On Sat, Apr 7, 2012 at 8:45 AM, Apache Jenkins Server <
jenkins@builds.apache.org> wrote:

> See <https://builds.apache.org/job/Any23-trunk/163/>
>
> ------------------------------------------
> [...truncated 3954 lines...]
> -------- Example Output --------
>
> [ERROR] BUILD ERROR
> [INFO]
> ------------------------------------------------------------------------
> [INFO] Internal error in the plugin manager executing goal
> 'org.apache.maven.plugins:maven-deploy-plugin:2.5:deploy': Unable to find
> the mojo 'deploy' (or one of its required components) in the plugin
> 'org.apache.maven.plugins:maven-deploy-plugin'
> Component descriptor cannot be found in the component repository:
> org.apache.maven.artifact.repository.layout.ArtifactRepositoryLayoutflat.
> [INFO]
> ------------------------------------------------------------------------
> [INFO] For more information, run Maven with the -e switch
> [INFO]
> ------------------------------------------------------------------------
> [INFO] Total time: 28 minutes 43 seconds
> [INFO] Finished at: Sat Apr 07 07:45:23 GMT+00:00 2012
> [INFO] Final Memory: 75M/418M
> [INFO]
> ------------------------------------------------------------------------
> channel stopped
>



-- 
*Lewis*

Build failed in Jenkins: Any23-trunk #163

Posted by Apache Jenkins Server <je...@builds.apache.org>.
See <https://builds.apache.org/job/Any23-trunk/163/>

------------------------------------------
[...truncated 3954 lines...]
-------- Example Output --------

<http://example.org/Bob> <http://example.org/wife> <http://example.org/Mary> ;
	<http://example.org/name> "Bob" .

<http://example.org/Mary> <http://example.org/age> "32"^^<http://www.w3.org/2001/XMLSchema#integer> .

================================

Extractor: rdf-turtle
	type: ContentExtractor

-------- Example Input  --------
@prefix foaf: <http://xmlns.com/foaf/0.1/> .
@prefix : <#> .

<> a foaf:PersonalProfileDocument;
	foaf:primaryTopic :Alice;
	.

:Alice a foaf:Person;
	foaf:name "Alice";
	foaf:homepage <http://alice.example.com/>;
	.
-------- Example Output --------
@prefix foaf: <http://xmlns.com/foaf/0.1/> .
@prefix : <http://example.com/#> .

<http://example.com/> a foaf:PersonalProfileDocument ;
	foaf:primaryTopic :Alice .

:Alice a foaf:Person ;
	foaf:name "Alice" ;
	foaf:homepage <http://alice.example.com/> .

================================

Extractor: rdf-xml
	type: ContentExtractor

-------- Example Input  --------
<rdf:RDF xmlns:rdf="http://www.w3.org/1999/02/22-rdf-syntax-ns#"
         xmlns:foaf="http://xmlns.com/foaf/0.1/">
  <foaf:PersonalProfileDocument rdf:about="">
    <foaf:primaryTopic>
      <foaf:Person rdf:about="#Alice">
        <foaf:name>Alice</foaf:name>
        <foaf:homepage rdf:resource="http://alice.example.com/"/>
      </foaf:Person>
    </foaf:primaryTopic>
  </foaf:PersonalProfileDocument>
</rdf:RDF>
-------- Example Output --------
@prefix rdf: <http://www.w3.org/1999/02/22-rdf-syntax-ns#> .
@prefix foaf: <http://xmlns.com/foaf/0.1/> .

<http://example.com/> a foaf:PersonalProfileDocument ;
	foaf:primaryTopic <http://example.com/#Alice> .

<http://example.com/#Alice> a foaf:Person ;
	foaf:name "Alice" ;
	foaf:homepage <http://alice.example.com/> .

================================


------------------------------------------------------------------------
Apache Any23 SUCCESS
Total time: 0s
Finished at: Sat Apr 07 07:19:19 GMT+00:00 2012
Final Memory: 11M/382M
------------------------------------------------------------------------

------------------------------------------------------------------------
Apache Any23 :: extractor
------------------------------------------------------------------------

<div itemscope itemtype="http://schema.org/LocalBusiness">
    <h1 itemprop="name">
        Golden Key Mini Storage
    </h1>
    <div itemprop="address" itemscope itemtype="http://schema.org/PostalAddress">
        <p itemprop="streetAddress">
            6725 Southwest Bradbury Court
        </p>
        <p>
            <span itemprop="addressLocality">Lake Oswego</span>,
            <span itemprop="addressRegion">OR</span>
            <span itemprop="postalCode">97035</span>
        </p>
    </div>
    <p itemprop="telephone">
        (503) 639-1733
    </p>
    <p itemprop="url">
        http://www.goldenkeyministorage.com/
    </p>
</div>
</div>

------------------------------------------------------------------------
Apache Any23 SUCCESS
Total time: 0s
Finished at: Sat Apr 07 07:19:19 GMT+00:00 2012
Final Memory: 11M/382M
------------------------------------------------------------------------

------------------------------------------------------------------------
Apache Any23 :: extractor
------------------------------------------------------------------------

@prefix foaf: <http://xmlns.com/foaf/0.1/> .
@prefix rdf: <http://www.w3.org/1999/02/22-rdf-syntax-ns#> .
@prefix doac: <http://ramonantonio.net/doac/0.1/#> .

_:node46b33c67744ce27ac6be1bd14931a8 a <http://schema.org/LocalBusiness> .

_:nodead84e3e51ee16b285179f4191a3b8ef a <http://schema.org/PostalAddress> ;
	<http://schema.org/PostalAddress/streetAddress> "\n            6725 Southwest Bradbury Court\n        " ;
	<http://schema.org/PostalAddress/addressLocality> "Lake Oswego" ;
	<http://schema.org/PostalAddress/postalCode> "97035" ;
	<http://schema.org/PostalAddress/addressRegion> "OR" .

_:node46b33c67744ce27ac6be1bd14931a8 <http://schema.org/LocalBusiness/address> _:nodead84e3e51ee16b285179f4191a3b8ef ;
	<http://schema.org/LocalBusiness/name> "\n        Golden Key Mini Storage\n    " ;
	<http://schema.org/LocalBusiness/telephone> "\n        (503) 639-1733\n    " ;
	<http://schema.org/LocalBusiness/url> "\n        http://www.goldenkeyministorage.com/\n    " .

<http://example.com/> <http://www.w3.org/1999/xhtml/microdata#item> _:node46b33c67744ce27ac6be1bd14931a8 .


------------------------------------------------------------------------
Apache Any23 SUCCESS
Total time: 0s
Finished at: Sat Apr 07 07:19:19 GMT+00:00 2012
Final Memory: 17M/382M
------------------------------------------------------------------------
Tests run: 4, Failures: 0, Errors: 0, Skipped: 0, Time elapsed: 0.767 sec
Running org.apache.any23.filter.IgnoreAccidentalRDFaTest
Tests run: 2, Failures: 0, Errors: 0, Skipped: 0, Time elapsed: 0 sec
Running org.apache.any23.filter.ExtractionContextBlockerTest
Tests run: 1, Failures: 0, Errors: 0, Skipped: 0, Time elapsed: 0.001 sec
Running org.apache.any23.SesameTest
Tests run: 3, Failures: 0, Errors: 0, Skipped: 0, Time elapsed: 0 sec
Running org.apache.any23.rdf.PrefixesTest
Tests run: 36, Failures: 0, Errors: 0, Skipped: 0, Time elapsed: 0.001 sec
Running org.apache.any23.rdf.RDFUtilsTest
Tests run: 2, Failures: 0, Errors: 0, Skipped: 0, Time elapsed: 0 sec
Running org.apache.any23.configuration.DefaultConfigurationTest
Tests run: 14, Failures: 0, Errors: 0, Skipped: 0, Time elapsed: 0.001 sec
Running org.apache.any23.encoding.TikaEncodingDetectorTest
Tests run: 6, Failures: 0, Errors: 0, Skipped: 0, Time elapsed: 0 sec
Running org.apache.any23.writer.WriterRegistryTest
Tests run: 7, Failures: 0, Errors: 0, Skipped: 0, Time elapsed: 0.001 sec
Running org.apache.any23.writer.JSONWriterTest
Tests run: 1, Failures: 0, Errors: 0, Skipped: 0, Time elapsed: 0 sec

Results :

Tests run: 455, Failures: 0, Errors: 0, Skipped: 0

[JENKINS] Recording test results
[INFO] [jar:jar {execution: default-jar}]
[INFO] Building jar: <https://builds.apache.org/job/Any23-trunk/ws/core/target/any23-core-0.7.0-incubating-SNAPSHOT.jar>
[INFO] [appassembler:assemble {execution: default}]
[INFO] Installing /export/home/hudson/hudson-slave/maven-repositories/0/commons-lang/commons-lang/2.4/commons-lang-2.4.jar to <https://builds.apache.org/job/Any23-trunk/ws/core/target/appassembler/lib/commons-lang-2.4.jar>
[INFO] Installing /export/home/hudson/hudson-slave/maven-repositories/0/commons-httpclient/commons-httpclient/3.1/commons-httpclient-3.1.jar to <https://builds.apache.org/job/Any23-trunk/ws/core/target/appassembler/lib/commons-httpclient-3.1.jar>
[INFO] Installing /export/home/hudson/hudson-slave/maven-repositories/0/commons-logging/commons-logging/1.0.4/commons-logging-1.0.4.jar to <https://builds.apache.org/job/Any23-trunk/ws/core/target/appassembler/lib/commons-logging-1.0.4.jar>
[INFO] Installing /export/home/hudson/hudson-slave/maven-repositories/0/commons-codec/commons-codec/1.3/commons-codec-1.3.jar to <https://builds.apache.org/job/Any23-trunk/ws/core/target/appassembler/lib/commons-codec-1.3.jar>
[INFO] Installing /export/home/hudson/hudson-slave/maven-repositories/0/net/sourceforge/nekohtml/nekohtml/1.9.14/nekohtml-1.9.14.jar to <https://builds.apache.org/job/Any23-trunk/ws/core/target/appassembler/lib/nekohtml-1.9.14.jar>
[INFO] Installing /export/home/hudson/hudson-slave/maven-repositories/0/xerces/xercesImpl/2.9.1/xercesImpl-2.9.1.jar to <https://builds.apache.org/job/Any23-trunk/ws/core/target/appassembler/lib/xercesImpl-2.9.1.jar>
[INFO] Installing /export/home/hudson/hudson-slave/maven-repositories/0/xml-apis/xml-apis/1.3.04/xml-apis-1.3.04.jar to <https://builds.apache.org/job/Any23-trunk/ws/core/target/appassembler/lib/xml-apis-1.3.04.jar>
[INFO] Installing /export/home/hudson/hudson-slave/maven-repositories/0/com/beust/jcommander/1.23/jcommander-1.23.jar to <https://builds.apache.org/job/Any23-trunk/ws/core/target/appassembler/lib/jcommander-1.23.jar>
[INFO] Installing /export/home/hudson/hudson-slave/maven-repositories/0/org/apache/tika/tika-core/0.6/tika-core-0.6.jar to <https://builds.apache.org/job/Any23-trunk/ws/core/target/appassembler/lib/tika-core-0.6.jar>
[INFO] Installing /export/home/hudson/hudson-slave/maven-repositories/0/org/apache/tika/tika-parsers/0.6/tika-parsers-0.6.jar to <https://builds.apache.org/job/Any23-trunk/ws/core/target/appassembler/lib/tika-parsers-0.6.jar>
[INFO] Installing /export/home/hudson/hudson-slave/maven-repositories/0/org/apache/commons/commons-compress/1.0/commons-compress-1.0.jar to <https://builds.apache.org/job/Any23-trunk/ws/core/target/appassembler/lib/commons-compress-1.0.jar>
[INFO] Installing /export/home/hudson/hudson-slave/maven-repositories/0/org/apache/pdfbox/pdfbox/0.8.0-incubating/pdfbox-0.8.0-incubating.jar to <https://builds.apache.org/job/Any23-trunk/ws/core/target/appassembler/lib/pdfbox-0.8.0-incubating.jar>
[INFO] Installing /export/home/hudson/hudson-slave/maven-repositories/0/org/apache/pdfbox/fontbox/0.8.0-incubator/fontbox-0.8.0-incubator.jar to <https://builds.apache.org/job/Any23-trunk/ws/core/target/appassembler/lib/fontbox-0.8.0-incubator.jar>
[INFO] Installing /export/home/hudson/hudson-slave/maven-repositories/0/org/apache/pdfbox/jempbox/0.8.0-incubator/jempbox-0.8.0-incubator.jar to <https://builds.apache.org/job/Any23-trunk/ws/core/target/appassembler/lib/jempbox-0.8.0-incubator.jar>
[INFO] Installing /export/home/hudson/hudson-slave/maven-repositories/0/org/apache/poi/poi/3.6/poi-3.6.jar to <https://builds.apache.org/job/Any23-trunk/ws/core/target/appassembler/lib/poi-3.6.jar>
[INFO] Installing /export/home/hudson/hudson-slave/maven-repositories/0/log4j/log4j/1.2.14/log4j-1.2.14.jar to <https://builds.apache.org/job/Any23-trunk/ws/core/target/appassembler/lib/log4j-1.2.14.jar>
[INFO] Installing /export/home/hudson/hudson-slave/maven-repositories/0/org/apache/poi/poi-scratchpad/3.6/poi-scratchpad-3.6.jar to <https://builds.apache.org/job/Any23-trunk/ws/core/target/appassembler/lib/poi-scratchpad-3.6.jar>
[INFO] Installing /export/home/hudson/hudson-slave/maven-repositories/0/org/apache/poi/poi-ooxml/3.6/poi-ooxml-3.6.jar to <https://builds.apache.org/job/Any23-trunk/ws/core/target/appassembler/lib/poi-ooxml-3.6.jar>
[INFO] Installing /export/home/hudson/hudson-slave/maven-repositories/0/org/apache/poi/poi-ooxml-schemas/3.6/poi-ooxml-schemas-3.6.jar to <https://builds.apache.org/job/Any23-trunk/ws/core/target/appassembler/lib/poi-ooxml-schemas-3.6.jar>
[INFO] Installing /export/home/hudson/hudson-slave/maven-repositories/0/org/apache/xmlbeans/xmlbeans/2.3.0/xmlbeans-2.3.0.jar to <https://builds.apache.org/job/Any23-trunk/ws/core/target/appassembler/lib/xmlbeans-2.3.0.jar>
[INFO] Installing /export/home/hudson/hudson-slave/maven-repositories/0/org/apache/geronimo/specs/geronimo-stax-api_1.0_spec/1.0.1/geronimo-stax-api_1.0_spec-1.0.1.jar to <https://builds.apache.org/job/Any23-trunk/ws/core/target/appassembler/lib/geronimo-stax-api_1.0_spec-1.0.1.jar>
[INFO] Installing /export/home/hudson/hudson-slave/maven-repositories/0/dom4j/dom4j/1.6.1/dom4j-1.6.1.jar to <https://builds.apache.org/job/Any23-trunk/ws/core/target/appassembler/lib/dom4j-1.6.1.jar>
[INFO] Installing /export/home/hudson/hudson-slave/maven-repositories/0/org/ccil/cowan/tagsoup/tagsoup/1.2/tagsoup-1.2.jar to <https://builds.apache.org/job/Any23-trunk/ws/core/target/appassembler/lib/tagsoup-1.2.jar>
[INFO] Installing /export/home/hudson/hudson-slave/maven-repositories/0/asm/asm/3.1/asm-3.1.jar to <https://builds.apache.org/job/Any23-trunk/ws/core/target/appassembler/lib/asm-3.1.jar>
[INFO] Installing /export/home/hudson/hudson-slave/maven-repositories/0/com/drewnoakes/metadata-extractor/2.4.0-beta-1/metadata-extractor-2.4.0-beta-1.jar to <https://builds.apache.org/job/Any23-trunk/ws/core/target/appassembler/lib/metadata-extractor-2.4.0-beta-1.jar>
[INFO] Installing /export/home/hudson/hudson-slave/maven-repositories/0/org/openrdf/sesame/sesame-model/2.6.1/sesame-model-2.6.1.jar to <https://builds.apache.org/job/Any23-trunk/ws/core/target/appassembler/lib/sesame-model-2.6.1.jar>
[INFO] Installing /export/home/hudson/hudson-slave/maven-repositories/0/org/openrdf/sesame/sesame-util/2.6.1/sesame-util-2.6.1.jar to <https://builds.apache.org/job/Any23-trunk/ws/core/target/appassembler/lib/sesame-util-2.6.1.jar>
[INFO] Installing /export/home/hudson/hudson-slave/maven-repositories/0/org/slf4j/slf4j-api/1.5.6/slf4j-api-1.5.6.jar to <https://builds.apache.org/job/Any23-trunk/ws/core/target/appassembler/lib/slf4j-api-1.5.6.jar>
[INFO] Installing /export/home/hudson/hudson-slave/maven-repositories/0/org/openrdf/sesame/sesame-rio-api/2.6.1/sesame-rio-api-2.6.1.jar to <https://builds.apache.org/job/Any23-trunk/ws/core/target/appassembler/lib/sesame-rio-api-2.6.1.jar>
[INFO] Installing /export/home/hudson/hudson-slave/maven-repositories/0/org/openrdf/sesame/sesame-rio-turtle/2.6.1/sesame-rio-turtle-2.6.1.jar to <https://builds.apache.org/job/Any23-trunk/ws/core/target/appassembler/lib/sesame-rio-turtle-2.6.1.jar>
[INFO] Installing /export/home/hudson/hudson-slave/maven-repositories/0/org/openrdf/sesame/sesame-rio-rdfxml/2.6.1/sesame-rio-rdfxml-2.6.1.jar to <https://builds.apache.org/job/Any23-trunk/ws/core/target/appassembler/lib/sesame-rio-rdfxml-2.6.1.jar>
[INFO] Installing /export/home/hudson/hudson-slave/maven-repositories/0/org/openrdf/sesame/sesame-rio-ntriples/2.6.1/sesame-rio-ntriples-2.6.1.jar to <https://builds.apache.org/job/Any23-trunk/ws/core/target/appassembler/lib/sesame-rio-ntriples-2.6.1.jar>
[INFO] Installing /export/home/hudson/hudson-slave/maven-repositories/0/org/openrdf/sesame/sesame-rio-trix/2.6.1/sesame-rio-trix-2.6.1.jar to <https://builds.apache.org/job/Any23-trunk/ws/core/target/appassembler/lib/sesame-rio-trix-2.6.1.jar>
[INFO] Installing /export/home/hudson/hudson-slave/maven-repositories/0/org/openrdf/sesame/sesame-repository-sail/2.6.1/sesame-repository-sail-2.6.1.jar to <https://builds.apache.org/job/Any23-trunk/ws/core/target/appassembler/lib/sesame-repository-sail-2.6.1.jar>
[INFO] Installing /export/home/hudson/hudson-slave/maven-repositories/0/org/openrdf/sesame/sesame-repository-api/2.6.1/sesame-repository-api-2.6.1.jar to <https://builds.apache.org/job/Any23-trunk/ws/core/target/appassembler/lib/sesame-repository-api-2.6.1.jar>
[INFO] Installing /export/home/hudson/hudson-slave/maven-repositories/0/org/openrdf/sesame/sesame-query/2.6.1/sesame-query-2.6.1.jar to <https://builds.apache.org/job/Any23-trunk/ws/core/target/appassembler/lib/sesame-query-2.6.1.jar>
[INFO] Installing /export/home/hudson/hudson-slave/maven-repositories/0/org/openrdf/sesame/sesame-sail-api/2.6.1/sesame-sail-api-2.6.1.jar to <https://builds.apache.org/job/Any23-trunk/ws/core/target/appassembler/lib/sesame-sail-api-2.6.1.jar>
[INFO] Installing /export/home/hudson/hudson-slave/maven-repositories/0/org/openrdf/sesame/sesame-queryalgebra-model/2.6.1/sesame-queryalgebra-model-2.6.1.jar to <https://builds.apache.org/job/Any23-trunk/ws/core/target/appassembler/lib/sesame-queryalgebra-model-2.6.1.jar>
[INFO] Installing /export/home/hudson/hudson-slave/maven-repositories/0/org/openrdf/sesame/sesame-queryparser-api/2.6.1/sesame-queryparser-api-2.6.1.jar to <https://builds.apache.org/job/Any23-trunk/ws/core/target/appassembler/lib/sesame-queryparser-api-2.6.1.jar>
[INFO] Installing /export/home/hudson/hudson-slave/maven-repositories/0/org/openrdf/sesame/sesame-sail-memory/2.6.1/sesame-sail-memory-2.6.1.jar to <https://builds.apache.org/job/Any23-trunk/ws/core/target/appassembler/lib/sesame-sail-memory-2.6.1.jar>
[INFO] Installing /export/home/hudson/hudson-slave/maven-repositories/0/org/openrdf/sesame/sesame-sail-inferencer/2.6.1/sesame-sail-inferencer-2.6.1.jar to <https://builds.apache.org/job/Any23-trunk/ws/core/target/appassembler/lib/sesame-sail-inferencer-2.6.1.jar>
[INFO] Installing /export/home/hudson/hudson-slave/maven-repositories/0/org/openrdf/sesame/sesame-queryparser-serql/2.6.1/sesame-queryparser-serql-2.6.1.jar to <https://builds.apache.org/job/Any23-trunk/ws/core/target/appassembler/lib/sesame-queryparser-serql-2.6.1.jar>
[INFO] Installing /export/home/hudson/hudson-slave/maven-repositories/0/org/openrdf/sesame/sesame-queryalgebra-evaluation/2.6.1/sesame-queryalgebra-evaluation-2.6.1.jar to <https://builds.apache.org/job/Any23-trunk/ws/core/target/appassembler/lib/sesame-queryalgebra-evaluation-2.6.1.jar>
[INFO] Installing /export/home/hudson/hudson-slave/maven-repositories/0/org/openrdf/sesame/sesame-repository-sparql/2.6.1/sesame-repository-sparql-2.6.1.jar to <https://builds.apache.org/job/Any23-trunk/ws/core/target/appassembler/lib/sesame-repository-sparql-2.6.1.jar>
[INFO] Installing /export/home/hudson/hudson-slave/maven-repositories/0/org/openrdf/sesame/sesame-http-client/2.6.1/sesame-http-client-2.6.1.jar to <https://builds.apache.org/job/Any23-trunk/ws/core/target/appassembler/lib/sesame-http-client-2.6.1.jar>
[INFO] Installing /export/home/hudson/hudson-slave/maven-repositories/0/org/openrdf/sesame/sesame-http-protocol/2.6.1/sesame-http-protocol-2.6.1.jar to <https://builds.apache.org/job/Any23-trunk/ws/core/target/appassembler/lib/sesame-http-protocol-2.6.1.jar>
[INFO] Installing /export/home/hudson/hudson-slave/maven-repositories/0/org/openrdf/sesame/sesame-queryresultio-api/2.6.1/sesame-queryresultio-api-2.6.1.jar to <https://builds.apache.org/job/Any23-trunk/ws/core/target/appassembler/lib/sesame-queryresultio-api-2.6.1.jar>
[INFO] Installing /export/home/hudson/hudson-slave/maven-repositories/0/org/openrdf/sesame/sesame-queryresultio-sparqlxml/2.6.1/sesame-queryresultio-sparqlxml-2.6.1.jar to <https://builds.apache.org/job/Any23-trunk/ws/core/target/appassembler/lib/sesame-queryresultio-sparqlxml-2.6.1.jar>
[INFO] Installing /export/home/hudson/hudson-slave/maven-repositories/0/info/aduna/commons/aduna-commons-xml/2.7.0/aduna-commons-xml-2.7.0.jar to <https://builds.apache.org/job/Any23-trunk/ws/core/target/appassembler/lib/aduna-commons-xml-2.7.0.jar>
[INFO] Installing /export/home/hudson/hudson-slave/maven-repositories/0/info/aduna/commons/aduna-commons-text/2.7.0/aduna-commons-text-2.7.0.jar to <https://builds.apache.org/job/Any23-trunk/ws/core/target/appassembler/lib/aduna-commons-text-2.7.0.jar>
[INFO] Installing /export/home/hudson/hudson-slave/maven-repositories/0/info/aduna/commons/aduna-commons-net/2.7.0/aduna-commons-net-2.7.0.jar to <https://builds.apache.org/job/Any23-trunk/ws/core/target/appassembler/lib/aduna-commons-net-2.7.0.jar>
[INFO] Installing /export/home/hudson/hudson-slave/maven-repositories/0/info/aduna/commons/aduna-commons-lang/2.9.0/aduna-commons-lang-2.9.0.jar to <https://builds.apache.org/job/Any23-trunk/ws/core/target/appassembler/lib/aduna-commons-lang-2.9.0.jar>
[INFO] Installing /export/home/hudson/hudson-slave/maven-repositories/0/info/aduna/commons/aduna-commons-iteration/2.10.0/aduna-commons-iteration-2.10.0.jar to <https://builds.apache.org/job/Any23-trunk/ws/core/target/appassembler/lib/aduna-commons-iteration-2.10.0.jar>
[INFO] Installing /export/home/hudson/hudson-slave/maven-repositories/0/info/aduna/commons/aduna-commons-concurrent/2.7.0/aduna-commons-concurrent-2.7.0.jar to <https://builds.apache.org/job/Any23-trunk/ws/core/target/appassembler/lib/aduna-commons-concurrent-2.7.0.jar>
[INFO] Installing /export/home/hudson/hudson-slave/maven-repositories/0/info/aduna/commons/aduna-commons-io/2.10.0/aduna-commons-io-2.10.0.jar to <https://builds.apache.org/job/Any23-trunk/ws/core/target/appassembler/lib/aduna-commons-io-2.10.0.jar>
[INFO] Installing /export/home/hudson/hudson-slave/maven-repositories/0/org/apache/commons/commons-csv/1.0-SNAPSHOT-rev1148315/commons-csv-1.0-SNAPSHOT-rev1148315.jar to <https://builds.apache.org/job/Any23-trunk/ws/core/target/appassembler/lib/commons-csv-1.0-SNAPSHOT-rev1148315.jar>
[INFO] Installing /export/home/hudson/hudson-slave/maven-repositories/0/org/slf4j/slf4j-jdk14/1.5.6/slf4j-jdk14-1.5.6.jar to <https://builds.apache.org/job/Any23-trunk/ws/core/target/appassembler/lib/slf4j-jdk14-1.5.6.jar>
[INFO] Installing /export/home/hudson/hudson-slave/maven-repositories/0/org/slf4j/jcl-over-slf4j/1.5.6/jcl-over-slf4j-1.5.6.jar to <https://builds.apache.org/job/Any23-trunk/ws/core/target/appassembler/lib/jcl-over-slf4j-1.5.6.jar>
[INFO] Installing <https://builds.apache.org/job/Any23-trunk/ws/core/target/any23-core-0.7.0-incubating-SNAPSHOT.jar> to <https://builds.apache.org/job/Any23-trunk/ws/core/target/appassembler/lib/any23-core-0.7.0-incubating-SNAPSHOT.jar>
[INFO] [assembly:single {execution: assembly}]
[INFO] Reading assembly descriptor: <https://builds.apache.org/job/Any23-trunk/ws/core/src/main/assembly/bin.xml>
[INFO] Building tar : <https://builds.apache.org/job/Any23-trunk/ws/core/target/apache-any23-0.7.0-incubating-SNAPSHOT-bin.tar.gz>
[INFO] Building zip: <https://builds.apache.org/job/Any23-trunk/ws/core/target/apache-any23-0.7.0-incubating-SNAPSHOT-bin.zip>
[INFO] [install:install {execution: default-install}]
[INFO] Installing <https://builds.apache.org/job/Any23-trunk/ws/core/target/any23-core-0.7.0-incubating-SNAPSHOT.jar> to /export/home/hudson/hudson-slave/maven-repositories/0/org/apache/any23/any23-core/0.7.0-incubating-SNAPSHOT/any23-core-0.7.0-incubating-SNAPSHOT.jar
[INFO] Installing <https://builds.apache.org/job/Any23-trunk/ws/core/target/apache-any23-0.7.0-incubating-SNAPSHOT-bin.tar.gz> to /export/home/hudson/hudson-slave/maven-repositories/0/org/apache/any23/any23-core/0.7.0-incubating-SNAPSHOT/any23-core-0.7.0-incubating-SNAPSHOT-bin.tar.gz
[INFO] Installing <https://builds.apache.org/job/Any23-trunk/ws/core/target/apache-any23-0.7.0-incubating-SNAPSHOT-bin.zip> to /export/home/hudson/hudson-slave/maven-repositories/0/org/apache/any23/any23-core/0.7.0-incubating-SNAPSHOT/any23-core-0.7.0-incubating-SNAPSHOT-bin.zip
[JENKINS] Archiving <https://builds.apache.org/job/Any23-trunk/ws/core/pom.xml> to /home/hudson/hudson/jobs/Any23-trunk/modules/org.apache.any23$any23-core/builds/2012-04-07_07-13-37/archive/org.apache.any23/any23-core/0.7.0-incubating-SNAPSHOT/any23-core-0.7.0-incubating-SNAPSHOT.pom
[JENKINS] Archiving <https://builds.apache.org/job/Any23-trunk/ws/core/target/any23-core-0.7.0-incubating-SNAPSHOT.jar> to /home/hudson/hudson/jobs/Any23-trunk/modules/org.apache.any23$any23-core/builds/2012-04-07_07-13-37/archive/org.apache.any23/any23-core/0.7.0-incubating-SNAPSHOT/any23-core-0.7.0-incubating-SNAPSHOT.jar
[JENKINS] Archiving <https://builds.apache.org/job/Any23-trunk/ws/core/target/apache-any23-0.7.0-incubating-SNAPSHOT-bin.tar.gz> to /home/hudson/hudson/jobs/Any23-trunk/modules/org.apache.any23$any23-core/builds/2012-04-07_07-13-37/archive/org.apache.any23/any23-core/0.7.0-incubating-SNAPSHOT/any23-core-0.7.0-incubating-SNAPSHOT-bin.tar.gz
[JENKINS] Archiving <https://builds.apache.org/job/Any23-trunk/ws/core/target/apache-any23-0.7.0-incubating-SNAPSHOT-bin.zip> to /home/hudson/hudson/jobs/Any23-trunk/modules/org.apache.any23$any23-core/builds/2012-04-07_07-13-37/archive/org.apache.any23/any23-core/0.7.0-incubating-SNAPSHOT/any23-core-0.7.0-incubating-SNAPSHOT-bin.zip
[INFO] ------------------------------------------------------------------------
[ERROR] BUILD ERROR
[INFO] ------------------------------------------------------------------------
[INFO] Internal error in the plugin manager executing goal 'org.apache.maven.plugins:maven-deploy-plugin:2.5:deploy': Unable to find the mojo 'deploy' (or one of its required components) in the plugin 'org.apache.maven.plugins:maven-deploy-plugin'
Component descriptor cannot be found in the component repository: org.apache.maven.artifact.repository.layout.ArtifactRepositoryLayoutflat.
[INFO] ------------------------------------------------------------------------
[INFO] For more information, run Maven with the -e switch
[INFO] ------------------------------------------------------------------------
[INFO] Total time: 28 minutes 43 seconds
[INFO] Finished at: Sat Apr 07 07:45:23 GMT+00:00 2012
[INFO] Final Memory: 75M/418M
[INFO] ------------------------------------------------------------------------
channel stopped