You are viewing a plain text version of this content. The canonical link for it is here.
Posted to builds@beam.apache.org by Apache Jenkins Server <je...@builds.apache.org> on 2022/12/05 13:27:32 UTC
Build failed in Jenkins: beam_PostCommit_Python310 #191
See <https://ci-beam.apache.org/job/beam_PostCommit_Python310/191/display/redirect>
Changes:
------------------------------------------
[...truncated 4.82 MB...]
INFO:root:severity: INFO
timestamp {
seconds: 1670231941
nanos: 883910417
}
message: "Done consuming work."
log_location: "/usr/local/lib/python3.10/site-packages/apache_beam/runners/worker/sdk_worker.py:277"
thread: "MainThread"
INFO:root:severity: INFO
timestamp {
seconds: 1670231941
nanos: 884103775
}
message: "Python sdk harness exiting."
log_location: "/usr/local/lib/python3.10/site-packages/apache_beam/runners/worker/sdk_worker_main.py:188"
thread: "MainThread"
INFO:apache_beam.runners.portability.local_job_service:Completed job in 34.81269311904907 seconds with state DONE.
INFO:root:Completed job in 34.81269311904907 seconds with state DONE.
INFO:apache_beam.runners.portability.portable_runner:Job state changed to DONE
> Task :sdks:python:test-suites:portable:py310:portableWordCountSparkRunnerBatch
INFO:apache_beam.runners.worker.worker_pool_main:Listening for workers at localhost:41803
INFO:root:Default Python SDK image for environment is apache/beam_python3.10_sdk:2.45.0.dev
INFO:apache_beam.runners.portability.fn_api_runner.translations:==================== <function pack_combiners at 0x7f5d7c9637f0> ====================
INFO:apache_beam.runners.portability.fn_api_runner.translations:==================== <function lift_combiners at 0x7f5d7c963880> ====================
INFO:apache_beam.runners.portability.fn_api_runner.translations:==================== <function sort_stages at 0x7f5d7c964040> ====================
INFO:apache_beam.utils.subprocess_server:Starting service with ['java' '-jar' '<https://ci-beam.apache.org/job/beam_PostCommit_Python310/ws/src/runners/spark/3/job-server/build/libs/beam-runners-spark-3-job-server-2.45.0-SNAPSHOT.jar'> '--spark-master-url' 'local[4]' '--artifacts-dir' '/tmp/beam-temp8fa4xse4/artifactslufqfqy3' '--job-port' '39801' '--artifact-port' '0' '--expansion-port' '0']
INFO:apache_beam.utils.subprocess_server:22/12/05 09:19:21 WARN software.amazon.awssdk.regions.internal.util.EC2MetadataUtils: Unable to retrieve the requested metadata.
INFO:apache_beam.utils.subprocess_server:22/12/05 09:19:22 INFO org.apache.beam.runners.jobsubmission.JobServerDriver: ArtifactStagingService started on localhost:41073
INFO:apache_beam.utils.subprocess_server:22/12/05 09:19:22 INFO org.apache.beam.runners.jobsubmission.JobServerDriver: Java ExpansionService started on localhost:37487
INFO:apache_beam.utils.subprocess_server:22/12/05 09:19:22 INFO org.apache.beam.runners.jobsubmission.JobServerDriver: JobService started on localhost:39801
INFO:apache_beam.utils.subprocess_server:22/12/05 09:19:22 INFO org.apache.beam.runners.jobsubmission.JobServerDriver: Job server now running, terminate with Ctrl+C
INFO:apache_beam.utils.subprocess_server:22/12/05 09:19:22 INFO org.apache.beam.runners.fnexecution.artifact.ArtifactStagingService: Staging artifacts for job_79533710-7367-4b19-8a36-3e034fcbc3ab.
INFO:apache_beam.utils.subprocess_server:22/12/05 09:19:22 INFO org.apache.beam.runners.fnexecution.artifact.ArtifactStagingService: Resolving artifacts for job_79533710-7367-4b19-8a36-3e034fcbc3ab.ref_Environment_default_environment_1.
INFO:apache_beam.utils.subprocess_server:22/12/05 09:19:22 INFO org.apache.beam.runners.fnexecution.artifact.ArtifactStagingService: Getting 1 artifacts for job_79533710-7367-4b19-8a36-3e034fcbc3ab.null.
INFO:apache_beam.utils.subprocess_server:22/12/05 09:19:22 INFO org.apache.beam.runners.fnexecution.artifact.ArtifactStagingService: Artifacts fully staged for job_79533710-7367-4b19-8a36-3e034fcbc3ab.
INFO:apache_beam.utils.subprocess_server:22/12/05 09:19:22 INFO org.apache.beam.runners.spark.SparkJobInvoker: Invoking job BeamApp-jenkins-1205091922-2e6e8d05_c90bc1f2-2905-4ec7-ac5f-ae534d60b93d
INFO:apache_beam.utils.subprocess_server:22/12/05 09:19:23 INFO org.apache.beam.runners.jobsubmission.JobInvocation: Starting job invocation BeamApp-jenkins-1205091922-2e6e8d05_c90bc1f2-2905-4ec7-ac5f-ae534d60b93d
INFO:apache_beam.runners.portability.portable_runner:Environment "LOOPBACK" has started a component necessary for the execution. Be sure to run the pipeline using
with Pipeline() as p:
p.apply(..)
This ensures that the pipeline finishes before this program exits.
INFO:apache_beam.runners.portability.portable_runner:Job state changed to STOPPED
INFO:apache_beam.runners.portability.portable_runner:Job state changed to STARTING
INFO:apache_beam.runners.portability.portable_runner:Job state changed to RUNNING
INFO:apache_beam.utils.subprocess_server:22/12/05 09:19:23 INFO org.apache.beam.runners.spark.translation.SparkContextFactory: Creating a brand new Spark Context.
INFO:apache_beam.utils.subprocess_server:22/12/05 09:19:23 WARN org.apache.hadoop.util.NativeCodeLoader: Unable to load native-hadoop library for your platform... using builtin-java classes where applicable
INFO:apache_beam.utils.subprocess_server:22/12/05 09:19:24 INFO org.sparkproject.jetty.util.log: Logging initialized @4842ms to org.sparkproject.jetty.util.log.Slf4jLog
INFO:apache_beam.utils.subprocess_server:22/12/05 09:19:24 INFO org.sparkproject.jetty.server.Server: jetty-9.4.40.v20210413; built: 2021-04-13T20:42:42.668Z; git: b881a572662e1943a14ae12e7e1207989f218b74; jvm 1.8.0_352-8u352-ga-1~20.04-b08
INFO:apache_beam.utils.subprocess_server:22/12/05 09:19:24 INFO org.sparkproject.jetty.server.Server: Started @5068ms
INFO:apache_beam.utils.subprocess_server:22/12/05 09:19:24 INFO org.sparkproject.jetty.server.AbstractConnector: Started ServerConnector@4d9cae72{HTTP/1.1, (http/1.1)}{127.0.0.1:4040}
INFO:apache_beam.utils.subprocess_server:22/12/05 09:19:24 INFO org.sparkproject.jetty.server.handler.ContextHandler: Started o.s.j.s.ServletContextHandler@44325f44{/jobs,null,AVAILABLE,@Spark}
INFO:apache_beam.utils.subprocess_server:22/12/05 09:19:24 INFO org.sparkproject.jetty.server.handler.ContextHandler: Started o.s.j.s.ServletContextHandler@7bfae446{/jobs/json,null,AVAILABLE,@Spark}
INFO:apache_beam.utils.subprocess_server:22/12/05 09:19:24 INFO org.sparkproject.jetty.server.handler.ContextHandler: Started o.s.j.s.ServletContextHandler@56ff1ba2{/jobs/job,null,AVAILABLE,@Spark}
INFO:apache_beam.utils.subprocess_server:22/12/05 09:19:24 INFO org.sparkproject.jetty.server.handler.ContextHandler: Started o.s.j.s.ServletContextHandler@6d82bf5f{/jobs/job/json,null,AVAILABLE,@Spark}
INFO:apache_beam.utils.subprocess_server:22/12/05 09:19:24 INFO org.sparkproject.jetty.server.handler.ContextHandler: Started o.s.j.s.ServletContextHandler@214ba564{/stages,null,AVAILABLE,@Spark}
INFO:apache_beam.utils.subprocess_server:22/12/05 09:19:24 INFO org.sparkproject.jetty.server.handler.ContextHandler: Started o.s.j.s.ServletContextHandler@373c2e17{/stages/json,null,AVAILABLE,@Spark}
INFO:apache_beam.utils.subprocess_server:22/12/05 09:19:24 INFO org.sparkproject.jetty.server.handler.ContextHandler: Started o.s.j.s.ServletContextHandler@7cc322e7{/stages/stage,null,AVAILABLE,@Spark}
INFO:apache_beam.utils.subprocess_server:22/12/05 09:19:24 INFO org.sparkproject.jetty.server.handler.ContextHandler: Started o.s.j.s.ServletContextHandler@1e25d720{/stages/stage/json,null,AVAILABLE,@Spark}
INFO:apache_beam.utils.subprocess_server:22/12/05 09:19:24 INFO org.sparkproject.jetty.server.handler.ContextHandler: Started o.s.j.s.ServletContextHandler@1eb89f7a{/stages/pool,null,AVAILABLE,@Spark}
INFO:apache_beam.utils.subprocess_server:22/12/05 09:19:24 INFO org.sparkproject.jetty.server.handler.ContextHandler: Started o.s.j.s.ServletContextHandler@756e00a3{/stages/pool/json,null,AVAILABLE,@Spark}
INFO:apache_beam.utils.subprocess_server:22/12/05 09:19:24 INFO org.sparkproject.jetty.server.handler.ContextHandler: Started o.s.j.s.ServletContextHandler@4c93303{/storage,null,AVAILABLE,@Spark}
INFO:apache_beam.utils.subprocess_server:22/12/05 09:19:24 INFO org.sparkproject.jetty.server.handler.ContextHandler: Started o.s.j.s.ServletContextHandler@562db486{/storage/json,null,AVAILABLE,@Spark}
INFO:apache_beam.utils.subprocess_server:22/12/05 09:19:24 INFO org.sparkproject.jetty.server.handler.ContextHandler: Started o.s.j.s.ServletContextHandler@4499f663{/storage/rdd,null,AVAILABLE,@Spark}
INFO:apache_beam.utils.subprocess_server:22/12/05 09:19:24 INFO org.sparkproject.jetty.server.handler.ContextHandler: Started o.s.j.s.ServletContextHandler@32cf3eed{/storage/rdd/json,null,AVAILABLE,@Spark}
INFO:apache_beam.utils.subprocess_server:22/12/05 09:19:24 INFO org.sparkproject.jetty.server.handler.ContextHandler: Started o.s.j.s.ServletContextHandler@1ca54577{/environment,null,AVAILABLE,@Spark}
INFO:apache_beam.utils.subprocess_server:22/12/05 09:19:24 INFO org.sparkproject.jetty.server.handler.ContextHandler: Started o.s.j.s.ServletContextHandler@37ddeebf{/environment/json,null,AVAILABLE,@Spark}
INFO:apache_beam.utils.subprocess_server:22/12/05 09:19:24 INFO org.sparkproject.jetty.server.handler.ContextHandler: Started o.s.j.s.ServletContextHandler@324a5489{/executors,null,AVAILABLE,@Spark}
INFO:apache_beam.utils.subprocess_server:22/12/05 09:19:24 INFO org.sparkproject.jetty.server.handler.ContextHandler: Started o.s.j.s.ServletContextHandler@62e03e2d{/executors/json,null,AVAILABLE,@Spark}
INFO:apache_beam.utils.subprocess_server:22/12/05 09:19:24 INFO org.sparkproject.jetty.server.handler.ContextHandler: Started o.s.j.s.ServletContextHandler@1735dfc1{/executors/threadDump,null,AVAILABLE,@Spark}
INFO:apache_beam.utils.subprocess_server:22/12/05 09:19:24 INFO org.sparkproject.jetty.server.handler.ContextHandler: Started o.s.j.s.ServletContextHandler@4a579609{/executors/threadDump/json,null,AVAILABLE,@Spark}
INFO:apache_beam.utils.subprocess_server:22/12/05 09:19:24 INFO org.sparkproject.jetty.server.handler.ContextHandler: Started o.s.j.s.ServletContextHandler@5d2d02c6{/static,null,AVAILABLE,@Spark}
INFO:apache_beam.utils.subprocess_server:22/12/05 09:19:24 INFO org.sparkproject.jetty.server.handler.ContextHandler: Started o.s.j.s.ServletContextHandler@2e448068{/,null,AVAILABLE,@Spark}
INFO:apache_beam.utils.subprocess_server:22/12/05 09:19:24 INFO org.sparkproject.jetty.server.handler.ContextHandler: Started o.s.j.s.ServletContextHandler@759f1394{/api,null,AVAILABLE,@Spark}
INFO:apache_beam.utils.subprocess_server:22/12/05 09:19:24 INFO org.sparkproject.jetty.server.handler.ContextHandler: Started o.s.j.s.ServletContextHandler@6743f8f4{/jobs/job/kill,null,AVAILABLE,@Spark}
INFO:apache_beam.utils.subprocess_server:22/12/05 09:19:24 INFO org.sparkproject.jetty.server.handler.ContextHandler: Started o.s.j.s.ServletContextHandler@61a204ec{/stages/stage/kill,null,AVAILABLE,@Spark}
INFO:apache_beam.utils.subprocess_server:22/12/05 09:19:24 INFO org.sparkproject.jetty.server.handler.ContextHandler: Started o.s.j.s.ServletContextHandler@76ba11e8{/metrics/json,null,AVAILABLE,@Spark}
INFO:apache_beam.utils.subprocess_server:22/12/05 09:19:25 INFO org.apache.beam.runners.spark.aggregators.AggregatorsAccumulator: Instantiated aggregators accumulator:
INFO:apache_beam.utils.subprocess_server:22/12/05 09:19:25 INFO org.apache.beam.runners.spark.metrics.MetricsAccumulator: Instantiated metrics accumulator: MetricQueryResults()
INFO:apache_beam.utils.subprocess_server:22/12/05 09:19:25 WARN software.amazon.awssdk.regions.internal.util.EC2MetadataUtils: Unable to retrieve the requested metadata.
INFO:apache_beam.utils.subprocess_server:22/12/05 09:19:25 INFO org.apache.beam.runners.spark.SparkPipelineRunner: Running job BeamApp-jenkins-1205091922-2e6e8d05_c90bc1f2-2905-4ec7-ac5f-ae534d60b93d on Spark master local[4]
INFO:apache_beam.utils.subprocess_server:22/12/05 09:19:26 WARN software.amazon.awssdk.regions.internal.util.EC2MetadataUtils: Unable to retrieve the requested metadata.
INFO:apache_beam.utils.subprocess_server:22/12/05 09:19:26 WARN software.amazon.awssdk.regions.internal.util.EC2MetadataUtils: Unable to retrieve the requested metadata.
INFO:apache_beam.utils.subprocess_server:22/12/05 09:19:26 WARN software.amazon.awssdk.regions.internal.util.EC2MetadataUtils: Unable to retrieve the requested metadata.
INFO:apache_beam.utils.subprocess_server:22/12/05 09:19:26 WARN software.amazon.awssdk.regions.internal.util.EC2MetadataUtils: Unable to retrieve the requested metadata.
INFO:apache_beam.runners.worker.statecache:Creating state cache with size 0
INFO:apache_beam.runners.worker.sdk_worker:Creating insecure control channel for localhost:40081.
INFO:apache_beam.runners.worker.sdk_worker:Control channel established.
INFO:apache_beam.runners.worker.sdk_worker:Initializing SDKHarness with unbounded number of workers.
INFO:apache_beam.utils.subprocess_server:22/12/05 09:19:26 INFO org.apache.beam.runners.fnexecution.control.FnApiControlClientPoolService: Beam Fn Control client connected with id 1-1
INFO:apache_beam.utils.subprocess_server:22/12/05 09:19:26 INFO org.apache.beam.runners.fnexecution.control.FnApiControlClientPoolService: getProcessBundleDescriptor request with id 1-2
INFO:apache_beam.runners.worker.sdk_worker:Creating insecure state channel for localhost:43981.
INFO:apache_beam.runners.worker.sdk_worker:State channel established.
INFO:apache_beam.runners.worker.data_plane:Creating client data channel for localhost:35705
INFO:apache_beam.utils.subprocess_server:22/12/05 09:19:26 INFO org.apache.beam.runners.fnexecution.data.GrpcDataService: Beam Fn Data client connected.
INFO:apache_beam.utils.subprocess_server:22/12/05 09:19:26 INFO org.apache.beam.runners.fnexecution.control.FnApiControlClientPoolService: getProcessBundleDescriptor request with id 1-3
INFO:apache_beam.utils.subprocess_server:22/12/05 09:19:27 WARN software.amazon.awssdk.regions.internal.util.EC2MetadataUtils: Unable to retrieve the requested metadata.
INFO:apache_beam.utils.subprocess_server:22/12/05 09:19:27 WARN software.amazon.awssdk.regions.internal.util.EC2MetadataUtils: Unable to retrieve the requested metadata.
INFO:apache_beam.utils.subprocess_server:22/12/05 09:19:27 WARN software.amazon.awssdk.regions.internal.util.EC2MetadataUtils: Unable to retrieve the requested metadata.
INFO:apache_beam.utils.subprocess_server:22/12/05 09:19:27 WARN software.amazon.awssdk.regions.internal.util.EC2MetadataUtils: Unable to retrieve the requested metadata.
INFO:apache_beam.utils.subprocess_server:22/12/05 09:19:27 INFO org.apache.beam.runners.fnexecution.control.FnApiControlClientPoolService: getProcessBundleDescriptor request with id 1-4
INFO:apache_beam.utils.subprocess_server:22/12/05 09:19:27 INFO org.apache.beam.runners.fnexecution.control.FnApiControlClientPoolService: getProcessBundleDescriptor request with id 1-5
INFO:apache_beam.utils.subprocess_server:22/12/05 09:19:27 WARN software.amazon.awssdk.regions.internal.util.EC2MetadataUtils: Unable to retrieve the requested metadata.
INFO:apache_beam.utils.subprocess_server:22/12/05 09:19:27 WARN software.amazon.awssdk.regions.internal.util.EC2MetadataUtils: Unable to retrieve the requested metadata.
INFO:apache_beam.utils.subprocess_server:22/12/05 09:19:27 WARN software.amazon.awssdk.regions.internal.util.EC2MetadataUtils: Unable to retrieve the requested metadata.
INFO:apache_beam.utils.subprocess_server:22/12/05 09:19:27 WARN software.amazon.awssdk.regions.internal.util.EC2MetadataUtils: Unable to retrieve the requested metadata.
INFO:apache_beam.utils.subprocess_server:22/12/05 09:19:27 INFO org.apache.beam.runners.fnexecution.control.FnApiControlClientPoolService: getProcessBundleDescriptor request with id 1-7
INFO:apache_beam.utils.subprocess_server:22/12/05 09:19:27 INFO org.apache.beam.runners.fnexecution.control.FnApiControlClientPoolService: getProcessBundleDescriptor request with id 1-6
INFO:apache_beam.utils.subprocess_server:22/12/05 09:19:27 INFO org.apache.beam.runners.fnexecution.control.FnApiControlClientPoolService: getProcessBundleDescriptor request with id 1-8
INFO:apache_beam.utils.subprocess_server:22/12/05 09:19:27 INFO org.apache.beam.runners.fnexecution.control.FnApiControlClientPoolService: getProcessBundleDescriptor request with id 1-9
INFO:apache_beam.utils.subprocess_server:22/12/05 09:19:27 INFO org.apache.beam.runners.fnexecution.control.FnApiControlClientPoolService: getProcessBundleDescriptor request with id 1-10
INFO:apache_beam.utils.subprocess_server:22/12/05 09:19:27 INFO org.apache.beam.runners.fnexecution.control.FnApiControlClientPoolService: getProcessBundleDescriptor request with id 1-11
INFO:apache_beam.utils.subprocess_server:22/12/05 09:19:27 INFO org.apache.beam.runners.fnexecution.control.FnApiControlClientPoolService: getProcessBundleDescriptor request with id 1-13
INFO:apache_beam.utils.subprocess_server:22/12/05 09:19:27 INFO org.apache.beam.runners.fnexecution.control.FnApiControlClientPoolService: getProcessBundleDescriptor request with id 1-12
INFO:apache_beam.utils.subprocess_server:22/12/05 09:19:28 WARN software.amazon.awssdk.regions.internal.util.EC2MetadataUtils: Unable to retrieve the requested metadata.
INFO:apache_beam.utils.subprocess_server:22/12/05 09:19:28 WARN software.amazon.awssdk.regions.internal.util.EC2MetadataUtils: Unable to retrieve the requested metadata.
INFO:apache_beam.utils.subprocess_server:22/12/05 09:19:28 WARN software.amazon.awssdk.regions.internal.util.EC2MetadataUtils: Unable to retrieve the requested metadata.
INFO:apache_beam.utils.subprocess_server:22/12/05 09:19:28 WARN software.amazon.awssdk.regions.internal.util.EC2MetadataUtils: Unable to retrieve the requested metadata.
INFO:apache_beam.utils.subprocess_server:22/12/05 09:19:28 INFO org.apache.beam.runners.fnexecution.control.FnApiControlClientPoolService: getProcessBundleDescriptor request with id 1-14
INFO:apache_beam.utils.subprocess_server:22/12/05 09:19:28 WARN software.amazon.awssdk.regions.internal.util.EC2MetadataUtils: Unable to retrieve the requested metadata.
INFO:apache_beam.utils.subprocess_server:22/12/05 09:19:28 WARN software.amazon.awssdk.regions.internal.util.EC2MetadataUtils: Unable to retrieve the requested metadata.
INFO:apache_beam.utils.subprocess_server:22/12/05 09:19:28 WARN software.amazon.awssdk.regions.internal.util.EC2MetadataUtils: Unable to retrieve the requested metadata.
INFO:apache_beam.utils.subprocess_server:22/12/05 09:19:28 WARN software.amazon.awssdk.regions.internal.util.EC2MetadataUtils: Unable to retrieve the requested metadata.
INFO:apache_beam.utils.subprocess_server:22/12/05 09:19:28 INFO org.apache.beam.runners.fnexecution.control.FnApiControlClientPoolService: getProcessBundleDescriptor request with id 1-15
INFO:apache_beam.utils.subprocess_server:22/12/05 09:19:28 INFO org.apache.beam.runners.spark.SparkPipelineRunner: Job BeamApp-jenkins-1205091922-2e6e8d05_c90bc1f2-2905-4ec7-ac5f-ae534d60b93d: Pipeline translated successfully. Computing outputs
INFO:apache_beam.utils.subprocess_server:22/12/05 09:19:28 WARN software.amazon.awssdk.regions.internal.util.EC2MetadataUtils: Unable to retrieve the requested metadata.
INFO:apache_beam.utils.subprocess_server:22/12/05 09:19:28 WARN software.amazon.awssdk.regions.internal.util.EC2MetadataUtils: Unable to retrieve the requested metadata.
INFO:apache_beam.utils.subprocess_server:22/12/05 09:19:28 WARN software.amazon.awssdk.regions.internal.util.EC2MetadataUtils: Unable to retrieve the requested metadata.
INFO:apache_beam.utils.subprocess_server:22/12/05 09:19:28 WARN software.amazon.awssdk.regions.internal.util.EC2MetadataUtils: Unable to retrieve the requested metadata.
INFO:apache_beam.utils.subprocess_server:22/12/05 09:19:28 INFO org.apache.beam.runners.fnexecution.control.FnApiControlClientPoolService: getProcessBundleDescriptor request with id 1-16
INFO:apache_beam.io.filebasedsink:Starting finalize_write threads with num_shards: 4 (skipped: 0), batches: 4, num_threads: 4
INFO:apache_beam.io.filebasedsink:Renamed 4 shards in 0.01 seconds.
INFO:apache_beam.utils.subprocess_server:22/12/05 09:19:28 INFO org.apache.beam.runners.spark.SparkPipelineRunner: Job BeamApp-jenkins-1205091922-2e6e8d05_c90bc1f2-2905-4ec7-ac5f-ae534d60b93d finished.
INFO:apache_beam.utils.subprocess_server:22/12/05 09:19:28 INFO org.sparkproject.jetty.server.AbstractConnector: Stopped Spark@4d9cae72{HTTP/1.1, (http/1.1)}{127.0.0.1:4040}
INFO:apache_beam.runners.portability.portable_runner:Job state changed to DONE
Exception in thread run_worker_1-1:
Traceback (most recent call last):
File "/usr/lib/python3.10/threading.py", line 1009, in _bootstrap_inner
Exception in thread read_state:
Traceback (most recent call last):
File "/usr/lib/python3.10/threading.py", line 1009, in _bootstrap_inner
self.run()
File "/usr/lib/python3.10/threading.py", line 946, in run
self._target(*self._args, **self._kwargs)
File "<https://ci-beam.apache.org/job/beam_PostCommit_Python310/ws/src/sdks/python/apache_beam/runners/worker/sdk_worker.py",> line 254, in run
for work_request in self._control_stub.Control(get_responses()):
File "<https://ci-beam.apache.org/job/beam_PostCommit_Python310/ws/src/build/gradleenv/-1720702907/lib/python3.10/site-packages/grpc/_channel.py",> line 426, in __next__
self.run()
ERROR:apache_beam.runners.worker.data_plane:Failed to read inputs in the data plane.
Traceback (most recent call last):
File "<https://ci-beam.apache.org/job/beam_PostCommit_Python310/ws/src/sdks/python/apache_beam/runners/worker/data_plane.py",> line 654, in _read_inputs
for elements in elements_iterator:
File "<https://ci-beam.apache.org/job/beam_PostCommit_Python310/ws/src/build/gradleenv/-1720702907/lib/python3.10/site-packages/grpc/_channel.py",> line 426, in __next__
return self._next()
File "<https://ci-beam.apache.org/job/beam_PostCommit_Python310/ws/src/build/gradleenv/-1720702907/lib/python3.10/site-packages/grpc/_channel.py",> line 826, in _next
raise self
grpc._channel._MultiThreadedRendezvous: <_MultiThreadedRendezvous of RPC that terminated with:
status = StatusCode.UNAVAILABLE
details = "recvmsg:Connection reset by peer"
debug_error_string = "UNKNOWN:Error received from peer ipv6:%5B::1%5D:35705 {grpc_message:"recvmsg:Connection reset by peer", grpc_status:14, created_time:"2022-12-05T09:19:28.917018652+00:00"}"
>
File "/usr/lib/python3.10/threading.py", line 946, in run
return self._next()
Exception in thread read_grpc_client_inputs:
File "<https://ci-beam.apache.org/job/beam_PostCommit_Python310/ws/src/build/gradleenv/-1720702907/lib/python3.10/site-packages/grpc/_channel.py",> line 826, in _next
Traceback (most recent call last):
self._target(*self._args, **self._kwargs)
File "/usr/lib/python3.10/threading.py", line 1009, in _bootstrap_inner
File "<https://ci-beam.apache.org/job/beam_PostCommit_Python310/ws/src/sdks/python/apache_beam/runners/worker/sdk_worker.py",> line 1006, in pull_responses
raise self
self.run()
grpc._channel._MultiThreadedRendezvous: <_MultiThreadedRendezvous of RPC that terminated with:
status = StatusCode.UNAVAILABLE
details = "Socket closed"
debug_error_string = "UNKNOWN:Error received from peer ipv6:%5B::1%5D:40081 {created_time:"2022-12-05T09:19:28.916950007+00:00", grpc_status:14, grpc_message:"Socket closed"}"
>
for response in responses:
File "/usr/lib/python3.10/threading.py", line 946, in run
File "<https://ci-beam.apache.org/job/beam_PostCommit_Python310/ws/src/build/gradleenv/-1720702907/lib/python3.10/site-packages/grpc/_channel.py",> line 426, in __next__
self._target(*self._args, **self._kwargs)
File "<https://ci-beam.apache.org/job/beam_PostCommit_Python310/ws/src/sdks/python/apache_beam/runners/worker/data_plane.py",> line 671, in <lambda>
return self._next()
target=lambda: self._read_inputs(elements_iterator),
File "<https://ci-beam.apache.org/job/beam_PostCommit_Python310/ws/src/build/gradleenv/-1720702907/lib/python3.10/site-packages/grpc/_channel.py",> line 826, in _next
File "<https://ci-beam.apache.org/job/beam_PostCommit_Python310/ws/src/sdks/python/apache_beam/runners/worker/data_plane.py",> line 654, in _read_inputs
for elements in elements_iterator:
raise self
File "<https://ci-beam.apache.org/job/beam_PostCommit_Python310/ws/src/build/gradleenv/-1720702907/lib/python3.10/site-packages/grpc/_channel.py",> line 426, in __next__
grpc._channel._MultiThreadedRendezvous: <_MultiThreadedRendezvous of RPC that terminated with:
status = StatusCode.UNAVAILABLE
details = "Socket closed"
debug_error_string = "UNKNOWN:Error received from peer ipv6:%5B::1%5D:43981 {created_time:"2022-12-05T09:19:28.916880785+00:00", grpc_status:14, grpc_message:"Socket closed"}"
> return self._next()
File "<https://ci-beam.apache.org/job/beam_PostCommit_Python310/ws/src/build/gradleenv/-1720702907/lib/python3.10/site-packages/grpc/_channel.py",> line 826, in _next
raise self
grpc._channel._MultiThreadedRendezvous: <_MultiThreadedRendezvous of RPC that terminated with:
status = StatusCode.UNAVAILABLE
details = "recvmsg:Connection reset by peer"
debug_error_string = "UNKNOWN:Error received from peer ipv6:%5B::1%5D:35705 {grpc_message:"recvmsg:Connection reset by peer", grpc_status:14, created_time:"2022-12-05T09:19:28.917018652+00:00"}"
>
> Task :sdks:python:test-suites:portable:py310:postCommitPy310
> Task :sdks:python:test-suites:dataflow:py310:postCommitIT
warning: sdist: standard file not found: should have one of README, README.rst, README.txt, README.md
warning: check: missing required meta-data: url
warning: check: missing meta-data: either (author and author_email) or (maintainer and maintainer_email) should be supplied
> Task :sdks:python:test-suites:dataflow:py310:postCommitIT FAILED
FAILURE: Build failed with an exception.
* Where:
Script '<https://ci-beam.apache.org/job/beam_PostCommit_Python310/ws/src/sdks/python/test-suites/dataflow/common.gradle'> line: 121
* What went wrong:
Execution failed for task ':sdks:python:test-suites:dataflow:py310:postCommitIT'.
> Process 'command 'sh'' finished with non-zero exit value 1
* Try:
> Run with --stacktrace option to get the stack trace.
> Run with --info or --debug option to get more log output.
* Get more help at https://help.gradle.org
Deprecated Gradle features were used in this build, making it incompatible with Gradle 8.0.
You can use '--warning-mode all' to show the individual deprecation warnings and determine if they come from your own scripts or plugins.
See https://docs.gradle.org/7.5.1/userguide/command_line_interface.html#sec:command_line_warnings
Execution optimizations have been disabled for 1 invalid unit(s) of work during this build to ensure correctness.
Please consult deprecation warnings for more details.
BUILD FAILED in 4h 24m 1s
218 actionable tasks: 148 executed, 64 from cache, 6 up-to-date
Publishing build scan...
https://gradle.com/s/osnlljtjir4w2
Build step 'Invoke Gradle script' changed build result to FAILURE
Build step 'Invoke Gradle script' marked build as failure
---------------------------------------------------------------------
To unsubscribe, e-mail: builds-unsubscribe@beam.apache.org
For additional commands, e-mail: builds-help@beam.apache.org
Jenkins build is back to normal : beam_PostCommit_Python310 #194
Posted by Apache Jenkins Server <je...@builds.apache.org>.
See <https://ci-beam.apache.org/job/beam_PostCommit_Python310/194/display/redirect?page=changes>
---------------------------------------------------------------------
To unsubscribe, e-mail: builds-unsubscribe@beam.apache.org
For additional commands, e-mail: builds-help@beam.apache.org
Build failed in Jenkins: beam_PostCommit_Python310 #193
Posted by Apache Jenkins Server <je...@builds.apache.org>.
See <https://ci-beam.apache.org/job/beam_PostCommit_Python310/193/display/redirect?page=changes>
Changes:
[noreply] Update nbconvert requirement in /sdks/python
[noreply] Replaced deprecated finalize with DoFn Teardown (#24516)
[noreply] Bump cloud.google.com/go/storage from 1.28.0 to 1.28.1 in /sdks (#24517)
[noreply] add clarifier to error message (#24449)
[noreply] Batch rename requests in fileio.WriteToFiles (#24341)
[noreply] Bump golang.org/x/text from 0.4.0 to 0.5.0 in /sdks (#24520)
[noreply] Support for JsonSchema in Kafka Read Schema Transform (#24272)
[noreply] Run go fmt over full go directory with go 1.19 (#24525)
[noreply] Cloudbuild+manualsetup+playground (#24144)
[noreply] Bump golang.org/x/sys from 0.2.0 to 0.3.0 in /sdks (#24519)
[noreply] Bump cloud.google.com/go/bigtable from 1.18.0 to 1.18.1 in /sdks
[noreply] Update from interface{} -> any for core packages (#24505)
[noreply] Implement FileWriteSchemaTransformConfiguration (#24479)
------------------------------------------
[...truncated 11.03 MB...]
File "/usr/local/lib/python3.10/site-packages/apache_beam/runners/worker/bundle_processor.py", line 911, in get_operation
return transform_factory.create_operation(
File "/usr/local/lib/python3.10/site-packages/apache_beam/runners/worker/bundle_processor.py", line 1206, in create_operation
return creator(self, transform_id, transform_proto, payload, consumers)
File "/usr/local/lib/python3.10/site-packages/apache_beam/runners/worker/bundle_processor.py", line 1553, in create_par_do
return _create_pardo_operation(
File "/usr/local/lib/python3.10/site-packages/apache_beam/runners/worker/bundle_processor.py", line 1596, in _create_pardo_operation
dofn_data = pickler.loads(serialized_fn)
File "/usr/local/lib/python3.10/site-packages/apache_beam/internal/pickler.py", line 51, in loads
return desired_pickle_lib.loads(
File "/usr/local/lib/python3.10/site-packages/apache_beam/internal/dill_pickler.py", line 289, in loads
return dill.loads(s)
File "/usr/local/lib/python3.10/site-packages/dill/_dill.py", line 275, in loads
return load(file, ignore, **kwds)
File "/usr/local/lib/python3.10/site-packages/dill/_dill.py", line 270, in load
return Unpickler(file, ignore=ignore, **kwds).load()
File "/usr/local/lib/python3.10/site-packages/dill/_dill.py", line 472, in load
obj = StockUnpickler.load(self)
File "/usr/local/lib/python3.10/site-packages/dill/_dill.py", line 462, in find_class
return StockUnpickler.find_class(self, module, name)
AttributeError: Can't get attribute '_NoDefault' on <module 'pandas._libs.lib' from '/usr/local/lib/python3.10/site-packages/pandas/_libs/lib.cpython-310-x86_64-linux-gnu.so'>
[31mFAILED[0m apache_beam/dataframe/io_it_test.py::[1mReadUsingReadGbqTests::test_ReadGbq_with_computation[0m - apache_beam.runners.dataflow.dataflow_runner.DataflowRuntimeException: Dataflow pipeline failed. State: FAILED, Error:
Traceback (most recent call last):
File "/usr/local/lib/python3.10/site-packages/apache_beam/internal/dill_pickler.py", line 285, in loads
return dill.loads(s)
File "/usr/local/lib/python3.10/site-packages/dill/_dill.py", line 275, in loads
return load(file, ignore, **kwds)
File "/usr/local/lib/python3.10/site-packages/dill/_dill.py", line 270, in load
return Unpickler(file, ignore=ignore, **kwds).load()
File "/usr/local/lib/python3.10/site-packages/dill/_dill.py", line 472, in load
obj = StockUnpickler.load(self)
File "/usr/local/lib/python3.10/site-packages/dill/_dill.py", line 462, in find_class
return StockUnpickler.find_class(self, module, name)
AttributeError: Can't get attribute '_NoDefault' on <module 'pandas._libs.lib' from '/usr/local/lib/python3.10/site-packages/pandas/_libs/lib.cpython-310-x86_64-linux-gnu.so'>
During handling of the above exception, another exception occurred:
Traceback (most recent call last):
File "/usr/local/lib/python3.10/site-packages/apache_beam/runners/worker/sdk_worker.py", line 287, in _execute
response = task()
File "/usr/local/lib/python3.10/site-packages/apache_beam/runners/worker/sdk_worker.py", line 360, in <lambda>
lambda: self.create_worker().do_instruction(request), request)
File "/usr/local/lib/python3.10/site-packages/apache_beam/runners/worker/sdk_worker.py", line 596, in do_instruction
return getattr(self, request_type)(
File "/usr/local/lib/python3.10/site-packages/apache_beam/runners/worker/sdk_worker.py", line 627, in process_bundle
bundle_processor = self.bundle_processor_cache.get(
File "/usr/local/lib/python3.10/site-packages/apache_beam/runners/worker/sdk_worker.py", line 459, in get
processor = bundle_processor.BundleProcessor(
File "/usr/local/lib/python3.10/site-packages/apache_beam/runners/worker/bundle_processor.py", line 871, in __init__
self.ops = self.create_execution_tree(self.process_bundle_descriptor)
File "/usr/local/lib/python3.10/site-packages/apache_beam/runners/worker/bundle_processor.py", line 924, in create_execution_tree
return collections.OrderedDict([(
File "/usr/local/lib/python3.10/site-packages/apache_beam/runners/worker/bundle_processor.py", line 927, in <listcomp>
get_operation(transform_id))) for transform_id in sorted(
File "/usr/local/lib/python3.10/site-packages/apache_beam/runners/worker/bundle_processor.py", line 814, in wrapper
result = cache[args] = func(*args)
File "/usr/local/lib/python3.10/site-packages/apache_beam/runners/worker/bundle_processor.py", line 906, in get_operation
transform_consumers = {
File "/usr/local/lib/python3.10/site-packages/apache_beam/runners/worker/bundle_processor.py", line 907, in <dictcomp>
tag: [get_operation(op) for op in pcoll_consumers[pcoll_id]]
File "/usr/local/lib/python3.10/site-packages/apache_beam/runners/worker/bundle_processor.py", line 907, in <listcomp>
tag: [get_operation(op) for op in pcoll_consumers[pcoll_id]]
File "/usr/local/lib/python3.10/site-packages/apache_beam/runners/worker/bundle_processor.py", line 814, in wrapper
result = cache[args] = func(*args)
File "/usr/local/lib/python3.10/site-packages/apache_beam/runners/worker/bundle_processor.py", line 906, in get_operation
transform_consumers = {
File "/usr/local/lib/python3.10/site-packages/apache_beam/runners/worker/bundle_processor.py", line 907, in <dictcomp>
tag: [get_operation(op) for op in pcoll_consumers[pcoll_id]]
File "/usr/local/lib/python3.10/site-packages/apache_beam/runners/worker/bundle_processor.py", line 907, in <listcomp>
tag: [get_operation(op) for op in pcoll_consumers[pcoll_id]]
File "/usr/local/lib/python3.10/site-packages/apache_beam/runners/worker/bundle_processor.py", line 814, in wrapper
result = cache[args] = func(*args)
File "/usr/local/lib/python3.10/site-packages/apache_beam/runners/worker/bundle_processor.py", line 906, in get_operation
transform_consumers = {
File "/usr/local/lib/python3.10/site-packages/apache_beam/runners/worker/bundle_processor.py", line 907, in <dictcomp>
tag: [get_operation(op) for op in pcoll_consumers[pcoll_id]]
File "/usr/local/lib/python3.10/site-packages/apache_beam/runners/worker/bundle_processor.py", line 907, in <listcomp>
tag: [get_operation(op) for op in pcoll_consumers[pcoll_id]]
File "/usr/local/lib/python3.10/site-packages/apache_beam/runners/worker/bundle_processor.py", line 814, in wrapper
result = cache[args] = func(*args)
File "/usr/local/lib/python3.10/site-packages/apache_beam/runners/worker/bundle_processor.py", line 906, in get_operation
transform_consumers = {
File "/usr/local/lib/python3.10/site-packages/apache_beam/runners/worker/bundle_processor.py", line 907, in <dictcomp>
tag: [get_operation(op) for op in pcoll_consumers[pcoll_id]]
File "/usr/local/lib/python3.10/site-packages/apache_beam/runners/worker/bundle_processor.py", line 907, in <listcomp>
tag: [get_operation(op) for op in pcoll_consumers[pcoll_id]]
File "/usr/local/lib/python3.10/site-packages/apache_beam/runners/worker/bundle_processor.py", line 814, in wrapper
result = cache[args] = func(*args)
File "/usr/local/lib/python3.10/site-packages/apache_beam/runners/worker/bundle_processor.py", line 906, in get_operation
transform_consumers = {
File "/usr/local/lib/python3.10/site-packages/apache_beam/runners/worker/bundle_processor.py", line 907, in <dictcomp>
tag: [get_operation(op) for op in pcoll_consumers[pcoll_id]]
File "/usr/local/lib/python3.10/site-packages/apache_beam/runners/worker/bundle_processor.py", line 907, in <listcomp>
tag: [get_operation(op) for op in pcoll_consumers[pcoll_id]]
File "/usr/local/lib/python3.10/site-packages/apache_beam/runners/worker/bundle_processor.py", line 814, in wrapper
result = cache[args] = func(*args)
File "/usr/local/lib/python3.10/site-packages/apache_beam/runners/worker/bundle_processor.py", line 906, in get_operation
transform_consumers = {
File "/usr/local/lib/python3.10/site-packages/apache_beam/runners/worker/bundle_processor.py", line 907, in <dictcomp>
tag: [get_operation(op) for op in pcoll_consumers[pcoll_id]]
File "/usr/local/lib/python3.10/site-packages/apache_beam/runners/worker/bundle_processor.py", line 907, in <listcomp>
tag: [get_operation(op) for op in pcoll_consumers[pcoll_id]]
File "/usr/local/lib/python3.10/site-packages/apache_beam/runners/worker/bundle_processor.py", line 814, in wrapper
result = cache[args] = func(*args)
File "/usr/local/lib/python3.10/site-packages/apache_beam/runners/worker/bundle_processor.py", line 911, in get_operation
return transform_factory.create_operation(
File "/usr/local/lib/python3.10/site-packages/apache_beam/runners/worker/bundle_processor.py", line 1206, in create_operation
return creator(self, transform_id, transform_proto, payload, consumers)
File "/usr/local/lib/python3.10/site-packages/apache_beam/runners/worker/bundle_processor.py", line 1553, in create_par_do
return _create_pardo_operation(
File "/usr/local/lib/python3.10/site-packages/apache_beam/runners/worker/bundle_processor.py", line 1596, in _create_pardo_operation
dofn_data = pickler.loads(serialized_fn)
File "/usr/local/lib/python3.10/site-packages/apache_beam/internal/pickler.py", line 51, in loads
return desired_pickle_lib.loads(
File "/usr/local/lib/python3.10/site-packages/apache_beam/internal/dill_pickler.py", line 289, in loads
return dill.loads(s)
File "/usr/local/lib/python3.10/site-packages/dill/_dill.py", line 275, in loads
return load(file, ignore, **kwds)
File "/usr/local/lib/python3.10/site-packages/dill/_dill.py", line 270, in load
return Unpickler(file, ignore=ignore, **kwds).load()
File "/usr/local/lib/python3.10/site-packages/dill/_dill.py", line 472, in load
obj = StockUnpickler.load(self)
File "/usr/local/lib/python3.10/site-packages/dill/_dill.py", line 462, in find_class
return StockUnpickler.find_class(self, module, name)
AttributeError: Can't get attribute '_NoDefault' on <module 'pandas._libs.lib' from '/usr/local/lib/python3.10/site-packages/pandas/_libs/lib.cpython-310-x86_64-linux-gnu.so'>
[31mFAILED[0m apache_beam/examples/dataframe/taxiride_it_test.py::[1mTaxirideIT::test_enrich[0m - apache_beam.runners.dataflow.dataflow_runner.DataflowRuntimeException: Dataflow pipeline failed. State: FAILED, Error:
Traceback (most recent call last):
File "/usr/local/lib/python3.10/site-packages/apache_beam/internal/dill_pickler.py", line 285, in loads
return dill.loads(s)
File "/usr/local/lib/python3.10/site-packages/dill/_dill.py", line 275, in loads
return load(file, ignore, **kwds)
File "/usr/local/lib/python3.10/site-packages/dill/_dill.py", line 270, in load
return Unpickler(file, ignore=ignore, **kwds).load()
File "/usr/local/lib/python3.10/site-packages/dill/_dill.py", line 472, in load
obj = StockUnpickler.load(self)
File "/usr/local/lib/python3.10/site-packages/dill/_dill.py", line 462, in find_class
return StockUnpickler.find_class(self, module, name)
AttributeError: Can't get attribute '_NoDefault' on <module 'pandas._libs.lib' from '/usr/local/lib/python3.10/site-packages/pandas/_libs/lib.cpython-310-x86_64-linux-gnu.so'>
During handling of the above exception, another exception occurred:
Traceback (most recent call last):
File "/usr/local/lib/python3.10/site-packages/apache_beam/runners/worker/sdk_worker.py", line 287, in _execute
response = task()
File "/usr/local/lib/python3.10/site-packages/apache_beam/runners/worker/sdk_worker.py", line 360, in <lambda>
lambda: self.create_worker().do_instruction(request), request)
File "/usr/local/lib/python3.10/site-packages/apache_beam/runners/worker/sdk_worker.py", line 596, in do_instruction
return getattr(self, request_type)(
File "/usr/local/lib/python3.10/site-packages/apache_beam/runners/worker/sdk_worker.py", line 627, in process_bundle
bundle_processor = self.bundle_processor_cache.get(
File "/usr/local/lib/python3.10/site-packages/apache_beam/runners/worker/sdk_worker.py", line 459, in get
processor = bundle_processor.BundleProcessor(
File "/usr/local/lib/python3.10/site-packages/apache_beam/runners/worker/bundle_processor.py", line 871, in __init__
self.ops = self.create_execution_tree(self.process_bundle_descriptor)
File "/usr/local/lib/python3.10/site-packages/apache_beam/runners/worker/bundle_processor.py", line 924, in create_execution_tree
return collections.OrderedDict([(
File "/usr/local/lib/python3.10/site-packages/apache_beam/runners/worker/bundle_processor.py", line 927, in <listcomp>
get_operation(transform_id))) for transform_id in sorted(
File "/usr/local/lib/python3.10/site-packages/apache_beam/runners/worker/bundle_processor.py", line 814, in wrapper
result = cache[args] = func(*args)
File "/usr/local/lib/python3.10/site-packages/apache_beam/runners/worker/bundle_processor.py", line 906, in get_operation
transform_consumers = {
File "/usr/local/lib/python3.10/site-packages/apache_beam/runners/worker/bundle_processor.py", line 907, in <dictcomp>
tag: [get_operation(op) for op in pcoll_consumers[pcoll_id]]
File "/usr/local/lib/python3.10/site-packages/apache_beam/runners/worker/bundle_processor.py", line 907, in <listcomp>
tag: [get_operation(op) for op in pcoll_consumers[pcoll_id]]
File "/usr/local/lib/python3.10/site-packages/apache_beam/runners/worker/bundle_processor.py", line 814, in wrapper
result = cache[args] = func(*args)
File "/usr/local/lib/python3.10/site-packages/apache_beam/runners/worker/bundle_processor.py", line 906, in get_operation
transform_consumers = {
File "/usr/local/lib/python3.10/site-packages/apache_beam/runners/worker/bundle_processor.py", line 907, in <dictcomp>
tag: [get_operation(op) for op in pcoll_consumers[pcoll_id]]
File "/usr/local/lib/python3.10/site-packages/apache_beam/runners/worker/bundle_processor.py", line 907, in <listcomp>
tag: [get_operation(op) for op in pcoll_consumers[pcoll_id]]
File "/usr/local/lib/python3.10/site-packages/apache_beam/runners/worker/bundle_processor.py", line 814, in wrapper
result = cache[args] = func(*args)
File "/usr/local/lib/python3.10/site-packages/apache_beam/runners/worker/bundle_processor.py", line 906, in get_operation
transform_consumers = {
File "/usr/local/lib/python3.10/site-packages/apache_beam/runners/worker/bundle_processor.py", line 907, in <dictcomp>
tag: [get_operation(op) for op in pcoll_consumers[pcoll_id]]
File "/usr/local/lib/python3.10/site-packages/apache_beam/runners/worker/bundle_processor.py", line 907, in <listcomp>
tag: [get_operation(op) for op in pcoll_consumers[pcoll_id]]
File "/usr/local/lib/python3.10/site-packages/apache_beam/runners/worker/bundle_processor.py", line 814, in wrapper
result = cache[args] = func(*args)
File "/usr/local/lib/python3.10/site-packages/apache_beam/runners/worker/bundle_processor.py", line 906, in get_operation
transform_consumers = {
File "/usr/local/lib/python3.10/site-packages/apache_beam/runners/worker/bundle_processor.py", line 907, in <dictcomp>
tag: [get_operation(op) for op in pcoll_consumers[pcoll_id]]
File "/usr/local/lib/python3.10/site-packages/apache_beam/runners/worker/bundle_processor.py", line 907, in <listcomp>
tag: [get_operation(op) for op in pcoll_consumers[pcoll_id]]
File "/usr/local/lib/python3.10/site-packages/apache_beam/runners/worker/bundle_processor.py", line 814, in wrapper
result = cache[args] = func(*args)
File "/usr/local/lib/python3.10/site-packages/apache_beam/runners/worker/bundle_processor.py", line 911, in get_operation
return transform_factory.create_operation(
File "/usr/local/lib/python3.10/site-packages/apache_beam/runners/worker/bundle_processor.py", line 1206, in create_operation
return creator(self, transform_id, transform_proto, payload, consumers)
File "/usr/local/lib/python3.10/site-packages/apache_beam/runners/worker/bundle_processor.py", line 1553, in create_par_do
return _create_pardo_operation(
File "/usr/local/lib/python3.10/site-packages/apache_beam/runners/worker/bundle_processor.py", line 1596, in _create_pardo_operation
dofn_data = pickler.loads(serialized_fn)
File "/usr/local/lib/python3.10/site-packages/apache_beam/internal/pickler.py", line 51, in loads
return desired_pickle_lib.loads(
File "/usr/local/lib/python3.10/site-packages/apache_beam/internal/dill_pickler.py", line 289, in loads
return dill.loads(s)
File "/usr/local/lib/python3.10/site-packages/dill/_dill.py", line 275, in loads
return load(file, ignore, **kwds)
File "/usr/local/lib/python3.10/site-packages/dill/_dill.py", line 270, in load
return Unpickler(file, ignore=ignore, **kwds).load()
File "/usr/local/lib/python3.10/site-packages/dill/_dill.py", line 472, in load
obj = StockUnpickler.load(self)
File "/usr/local/lib/python3.10/site-packages/dill/_dill.py", line 462, in find_class
return StockUnpickler.find_class(self, module, name)
AttributeError: Can't get attribute '_NoDefault' on <module 'pandas._libs.lib' from '/usr/local/lib/python3.10/site-packages/pandas/_libs/lib.cpython-310-x86_64-linux-gnu.so'>
[31m===== [31m[1m4 failed[0m, [32m82 passed[0m, [33m19 skipped[0m, [33m651 warnings[0m[31m in 13686.03s (3:48:06)[0m[31m =====[0m
> Task :sdks:python:test-suites:dataflow:py310:postCommitIT FAILED
FAILURE: Build failed with an exception.
* Where:
Script '<https://ci-beam.apache.org/job/beam_PostCommit_Python310/ws/src/sdks/python/test-suites/dataflow/common.gradle'> line: 121
* What went wrong:
Execution failed for task ':sdks:python:test-suites:dataflow:py310:postCommitIT'.
> Process 'command 'sh'' finished with non-zero exit value 1
* Try:
> Run with --stacktrace option to get the stack trace.
> Run with --info or --debug option to get more log output.
* Get more help at https://help.gradle.org
Deprecated Gradle features were used in this build, making it incompatible with Gradle 8.0.
You can use '--warning-mode all' to show the individual deprecation warnings and determine if they come from your own scripts or plugins.
See https://docs.gradle.org/7.5.1/userguide/command_line_interface.html#sec:command_line_warnings
Execution optimizations have been disabled for 1 invalid unit(s) of work during this build to ensure correctness.
Please consult deprecation warnings for more details.
BUILD FAILED in 3h 50m 28s
218 actionable tasks: 148 executed, 64 from cache, 6 up-to-date
Publishing build scan...
https://gradle.com/s/gmphomarjqyxc
Build step 'Invoke Gradle script' changed build result to FAILURE
Build step 'Invoke Gradle script' marked build as failure
---------------------------------------------------------------------
To unsubscribe, e-mail: builds-unsubscribe@beam.apache.org
For additional commands, e-mail: builds-help@beam.apache.org
Build failed in Jenkins: beam_PostCommit_Python310 #192
Posted by Apache Jenkins Server <je...@builds.apache.org>.
See <https://ci-beam.apache.org/job/beam_PostCommit_Python310/192/display/redirect?page=changes>
Changes:
[noreply] [CdapIO] Add readme for CdapIO. Update readme for SparkReceiverIO.
[Moritz Mack] [Spark Dataset runner] Add @Experimental and reduce visibility where
[noreply] Fix grafana dashboard id (#24524)
[noreply] [Spark runner] Support running (VR) tests with Java 17 (closes #24400)
------------------------------------------
[...truncated 10.96 MB...]
File "/usr/local/lib/python3.10/site-packages/apache_beam/runners/worker/bundle_processor.py", line 911, in get_operation
return transform_factory.create_operation(
File "/usr/local/lib/python3.10/site-packages/apache_beam/runners/worker/bundle_processor.py", line 1206, in create_operation
return creator(self, transform_id, transform_proto, payload, consumers)
File "/usr/local/lib/python3.10/site-packages/apache_beam/runners/worker/bundle_processor.py", line 1553, in create_par_do
return _create_pardo_operation(
File "/usr/local/lib/python3.10/site-packages/apache_beam/runners/worker/bundle_processor.py", line 1596, in _create_pardo_operation
dofn_data = pickler.loads(serialized_fn)
File "/usr/local/lib/python3.10/site-packages/apache_beam/internal/pickler.py", line 51, in loads
return desired_pickle_lib.loads(
File "/usr/local/lib/python3.10/site-packages/apache_beam/internal/dill_pickler.py", line 289, in loads
return dill.loads(s)
File "/usr/local/lib/python3.10/site-packages/dill/_dill.py", line 275, in loads
return load(file, ignore, **kwds)
File "/usr/local/lib/python3.10/site-packages/dill/_dill.py", line 270, in load
return Unpickler(file, ignore=ignore, **kwds).load()
File "/usr/local/lib/python3.10/site-packages/dill/_dill.py", line 472, in load
obj = StockUnpickler.load(self)
File "/usr/local/lib/python3.10/site-packages/dill/_dill.py", line 462, in find_class
return StockUnpickler.find_class(self, module, name)
AttributeError: Can't get attribute '_NoDefault' on <module 'pandas._libs.lib' from '/usr/local/lib/python3.10/site-packages/pandas/_libs/lib.cpython-310-x86_64-linux-gnu.so'>
[31mFAILED[0m apache_beam/examples/dataframe/taxiride_it_test.py::[1mTaxirideIT::test_enrich[0m - apache_beam.runners.dataflow.dataflow_runner.DataflowRuntimeException: Dataflow pipeline failed. State: FAILED, Error:
Traceback (most recent call last):
File "/usr/local/lib/python3.10/site-packages/apache_beam/internal/dill_pickler.py", line 285, in loads
return dill.loads(s)
File "/usr/local/lib/python3.10/site-packages/dill/_dill.py", line 275, in loads
return load(file, ignore, **kwds)
File "/usr/local/lib/python3.10/site-packages/dill/_dill.py", line 270, in load
return Unpickler(file, ignore=ignore, **kwds).load()
File "/usr/local/lib/python3.10/site-packages/dill/_dill.py", line 472, in load
obj = StockUnpickler.load(self)
File "/usr/local/lib/python3.10/site-packages/dill/_dill.py", line 462, in find_class
return StockUnpickler.find_class(self, module, name)
AttributeError: Can't get attribute '_NoDefault' on <module 'pandas._libs.lib' from '/usr/local/lib/python3.10/site-packages/pandas/_libs/lib.cpython-310-x86_64-linux-gnu.so'>
During handling of the above exception, another exception occurred:
Traceback (most recent call last):
File "/usr/local/lib/python3.10/site-packages/apache_beam/runners/worker/sdk_worker.py", line 287, in _execute
response = task()
File "/usr/local/lib/python3.10/site-packages/apache_beam/runners/worker/sdk_worker.py", line 360, in <lambda>
lambda: self.create_worker().do_instruction(request), request)
File "/usr/local/lib/python3.10/site-packages/apache_beam/runners/worker/sdk_worker.py", line 596, in do_instruction
return getattr(self, request_type)(
File "/usr/local/lib/python3.10/site-packages/apache_beam/runners/worker/sdk_worker.py", line 627, in process_bundle
bundle_processor = self.bundle_processor_cache.get(
File "/usr/local/lib/python3.10/site-packages/apache_beam/runners/worker/sdk_worker.py", line 459, in get
processor = bundle_processor.BundleProcessor(
File "/usr/local/lib/python3.10/site-packages/apache_beam/runners/worker/bundle_processor.py", line 871, in __init__
self.ops = self.create_execution_tree(self.process_bundle_descriptor)
File "/usr/local/lib/python3.10/site-packages/apache_beam/runners/worker/bundle_processor.py", line 924, in create_execution_tree
return collections.OrderedDict([(
File "/usr/local/lib/python3.10/site-packages/apache_beam/runners/worker/bundle_processor.py", line 927, in <listcomp>
get_operation(transform_id))) for transform_id in sorted(
File "/usr/local/lib/python3.10/site-packages/apache_beam/runners/worker/bundle_processor.py", line 814, in wrapper
result = cache[args] = func(*args)
File "/usr/local/lib/python3.10/site-packages/apache_beam/runners/worker/bundle_processor.py", line 906, in get_operation
transform_consumers = {
File "/usr/local/lib/python3.10/site-packages/apache_beam/runners/worker/bundle_processor.py", line 907, in <dictcomp>
tag: [get_operation(op) for op in pcoll_consumers[pcoll_id]]
File "/usr/local/lib/python3.10/site-packages/apache_beam/runners/worker/bundle_processor.py", line 907, in <listcomp>
tag: [get_operation(op) for op in pcoll_consumers[pcoll_id]]
File "/usr/local/lib/python3.10/site-packages/apache_beam/runners/worker/bundle_processor.py", line 814, in wrapper
result = cache[args] = func(*args)
File "/usr/local/lib/python3.10/site-packages/apache_beam/runners/worker/bundle_processor.py", line 906, in get_operation
transform_consumers = {
File "/usr/local/lib/python3.10/site-packages/apache_beam/runners/worker/bundle_processor.py", line 907, in <dictcomp>
tag: [get_operation(op) for op in pcoll_consumers[pcoll_id]]
File "/usr/local/lib/python3.10/site-packages/apache_beam/runners/worker/bundle_processor.py", line 907, in <listcomp>
tag: [get_operation(op) for op in pcoll_consumers[pcoll_id]]
File "/usr/local/lib/python3.10/site-packages/apache_beam/runners/worker/bundle_processor.py", line 814, in wrapper
result = cache[args] = func(*args)
File "/usr/local/lib/python3.10/site-packages/apache_beam/runners/worker/bundle_processor.py", line 906, in get_operation
transform_consumers = {
File "/usr/local/lib/python3.10/site-packages/apache_beam/runners/worker/bundle_processor.py", line 907, in <dictcomp>
tag: [get_operation(op) for op in pcoll_consumers[pcoll_id]]
File "/usr/local/lib/python3.10/site-packages/apache_beam/runners/worker/bundle_processor.py", line 907, in <listcomp>
tag: [get_operation(op) for op in pcoll_consumers[pcoll_id]]
File "/usr/local/lib/python3.10/site-packages/apache_beam/runners/worker/bundle_processor.py", line 814, in wrapper
result = cache[args] = func(*args)
File "/usr/local/lib/python3.10/site-packages/apache_beam/runners/worker/bundle_processor.py", line 906, in get_operation
transform_consumers = {
File "/usr/local/lib/python3.10/site-packages/apache_beam/runners/worker/bundle_processor.py", line 907, in <dictcomp>
tag: [get_operation(op) for op in pcoll_consumers[pcoll_id]]
File "/usr/local/lib/python3.10/site-packages/apache_beam/runners/worker/bundle_processor.py", line 907, in <listcomp>
tag: [get_operation(op) for op in pcoll_consumers[pcoll_id]]
File "/usr/local/lib/python3.10/site-packages/apache_beam/runners/worker/bundle_processor.py", line 814, in wrapper
result = cache[args] = func(*args)
File "/usr/local/lib/python3.10/site-packages/apache_beam/runners/worker/bundle_processor.py", line 911, in get_operation
return transform_factory.create_operation(
File "/usr/local/lib/python3.10/site-packages/apache_beam/runners/worker/bundle_processor.py", line 1206, in create_operation
return creator(self, transform_id, transform_proto, payload, consumers)
File "/usr/local/lib/python3.10/site-packages/apache_beam/runners/worker/bundle_processor.py", line 1553, in create_par_do
return _create_pardo_operation(
File "/usr/local/lib/python3.10/site-packages/apache_beam/runners/worker/bundle_processor.py", line 1596, in _create_pardo_operation
dofn_data = pickler.loads(serialized_fn)
File "/usr/local/lib/python3.10/site-packages/apache_beam/internal/pickler.py", line 51, in loads
return desired_pickle_lib.loads(
File "/usr/local/lib/python3.10/site-packages/apache_beam/internal/dill_pickler.py", line 289, in loads
return dill.loads(s)
File "/usr/local/lib/python3.10/site-packages/dill/_dill.py", line 275, in loads
return load(file, ignore, **kwds)
File "/usr/local/lib/python3.10/site-packages/dill/_dill.py", line 270, in load
return Unpickler(file, ignore=ignore, **kwds).load()
File "/usr/local/lib/python3.10/site-packages/dill/_dill.py", line 472, in load
obj = StockUnpickler.load(self)
File "/usr/local/lib/python3.10/site-packages/dill/_dill.py", line 462, in find_class
return StockUnpickler.find_class(self, module, name)
AttributeError: Can't get attribute '_NoDefault' on <module 'pandas._libs.lib' from '/usr/local/lib/python3.10/site-packages/pandas/_libs/lib.cpython-310-x86_64-linux-gnu.so'>
[31mFAILED[0m apache_beam/dataframe/io_it_test.py::[1mReadUsingReadGbqTests::test_ReadGbq_with_computation[0m - apache_beam.runners.dataflow.dataflow_runner.DataflowRuntimeException: Dataflow pipeline failed. State: FAILED, Error:
Traceback (most recent call last):
File "/usr/local/lib/python3.10/site-packages/apache_beam/internal/dill_pickler.py", line 285, in loads
return dill.loads(s)
File "/usr/local/lib/python3.10/site-packages/dill/_dill.py", line 275, in loads
return load(file, ignore, **kwds)
File "/usr/local/lib/python3.10/site-packages/dill/_dill.py", line 270, in load
return Unpickler(file, ignore=ignore, **kwds).load()
File "/usr/local/lib/python3.10/site-packages/dill/_dill.py", line 472, in load
obj = StockUnpickler.load(self)
File "/usr/local/lib/python3.10/site-packages/dill/_dill.py", line 462, in find_class
return StockUnpickler.find_class(self, module, name)
AttributeError: Can't get attribute '_NoDefault' on <module 'pandas._libs.lib' from '/usr/local/lib/python3.10/site-packages/pandas/_libs/lib.cpython-310-x86_64-linux-gnu.so'>
During handling of the above exception, another exception occurred:
Traceback (most recent call last):
File "/usr/local/lib/python3.10/site-packages/apache_beam/runners/worker/sdk_worker.py", line 287, in _execute
response = task()
File "/usr/local/lib/python3.10/site-packages/apache_beam/runners/worker/sdk_worker.py", line 360, in <lambda>
lambda: self.create_worker().do_instruction(request), request)
File "/usr/local/lib/python3.10/site-packages/apache_beam/runners/worker/sdk_worker.py", line 596, in do_instruction
return getattr(self, request_type)(
File "/usr/local/lib/python3.10/site-packages/apache_beam/runners/worker/sdk_worker.py", line 627, in process_bundle
bundle_processor = self.bundle_processor_cache.get(
File "/usr/local/lib/python3.10/site-packages/apache_beam/runners/worker/sdk_worker.py", line 459, in get
processor = bundle_processor.BundleProcessor(
File "/usr/local/lib/python3.10/site-packages/apache_beam/runners/worker/bundle_processor.py", line 871, in __init__
self.ops = self.create_execution_tree(self.process_bundle_descriptor)
File "/usr/local/lib/python3.10/site-packages/apache_beam/runners/worker/bundle_processor.py", line 924, in create_execution_tree
return collections.OrderedDict([(
File "/usr/local/lib/python3.10/site-packages/apache_beam/runners/worker/bundle_processor.py", line 927, in <listcomp>
get_operation(transform_id))) for transform_id in sorted(
File "/usr/local/lib/python3.10/site-packages/apache_beam/runners/worker/bundle_processor.py", line 814, in wrapper
result = cache[args] = func(*args)
File "/usr/local/lib/python3.10/site-packages/apache_beam/runners/worker/bundle_processor.py", line 906, in get_operation
transform_consumers = {
File "/usr/local/lib/python3.10/site-packages/apache_beam/runners/worker/bundle_processor.py", line 907, in <dictcomp>
tag: [get_operation(op) for op in pcoll_consumers[pcoll_id]]
File "/usr/local/lib/python3.10/site-packages/apache_beam/runners/worker/bundle_processor.py", line 907, in <listcomp>
tag: [get_operation(op) for op in pcoll_consumers[pcoll_id]]
File "/usr/local/lib/python3.10/site-packages/apache_beam/runners/worker/bundle_processor.py", line 814, in wrapper
result = cache[args] = func(*args)
File "/usr/local/lib/python3.10/site-packages/apache_beam/runners/worker/bundle_processor.py", line 906, in get_operation
transform_consumers = {
File "/usr/local/lib/python3.10/site-packages/apache_beam/runners/worker/bundle_processor.py", line 907, in <dictcomp>
tag: [get_operation(op) for op in pcoll_consumers[pcoll_id]]
File "/usr/local/lib/python3.10/site-packages/apache_beam/runners/worker/bundle_processor.py", line 907, in <listcomp>
tag: [get_operation(op) for op in pcoll_consumers[pcoll_id]]
File "/usr/local/lib/python3.10/site-packages/apache_beam/runners/worker/bundle_processor.py", line 814, in wrapper
result = cache[args] = func(*args)
File "/usr/local/lib/python3.10/site-packages/apache_beam/runners/worker/bundle_processor.py", line 906, in get_operation
transform_consumers = {
File "/usr/local/lib/python3.10/site-packages/apache_beam/runners/worker/bundle_processor.py", line 907, in <dictcomp>
tag: [get_operation(op) for op in pcoll_consumers[pcoll_id]]
File "/usr/local/lib/python3.10/site-packages/apache_beam/runners/worker/bundle_processor.py", line 907, in <listcomp>
tag: [get_operation(op) for op in pcoll_consumers[pcoll_id]]
File "/usr/local/lib/python3.10/site-packages/apache_beam/runners/worker/bundle_processor.py", line 814, in wrapper
result = cache[args] = func(*args)
File "/usr/local/lib/python3.10/site-packages/apache_beam/runners/worker/bundle_processor.py", line 906, in get_operation
transform_consumers = {
File "/usr/local/lib/python3.10/site-packages/apache_beam/runners/worker/bundle_processor.py", line 907, in <dictcomp>
tag: [get_operation(op) for op in pcoll_consumers[pcoll_id]]
File "/usr/local/lib/python3.10/site-packages/apache_beam/runners/worker/bundle_processor.py", line 907, in <listcomp>
tag: [get_operation(op) for op in pcoll_consumers[pcoll_id]]
File "/usr/local/lib/python3.10/site-packages/apache_beam/runners/worker/bundle_processor.py", line 814, in wrapper
result = cache[args] = func(*args)
File "/usr/local/lib/python3.10/site-packages/apache_beam/runners/worker/bundle_processor.py", line 906, in get_operation
transform_consumers = {
File "/usr/local/lib/python3.10/site-packages/apache_beam/runners/worker/bundle_processor.py", line 907, in <dictcomp>
tag: [get_operation(op) for op in pcoll_consumers[pcoll_id]]
File "/usr/local/lib/python3.10/site-packages/apache_beam/runners/worker/bundle_processor.py", line 907, in <listcomp>
tag: [get_operation(op) for op in pcoll_consumers[pcoll_id]]
File "/usr/local/lib/python3.10/site-packages/apache_beam/runners/worker/bundle_processor.py", line 814, in wrapper
result = cache[args] = func(*args)
File "/usr/local/lib/python3.10/site-packages/apache_beam/runners/worker/bundle_processor.py", line 906, in get_operation
transform_consumers = {
File "/usr/local/lib/python3.10/site-packages/apache_beam/runners/worker/bundle_processor.py", line 907, in <dictcomp>
tag: [get_operation(op) for op in pcoll_consumers[pcoll_id]]
File "/usr/local/lib/python3.10/site-packages/apache_beam/runners/worker/bundle_processor.py", line 907, in <listcomp>
tag: [get_operation(op) for op in pcoll_consumers[pcoll_id]]
File "/usr/local/lib/python3.10/site-packages/apache_beam/runners/worker/bundle_processor.py", line 814, in wrapper
result = cache[args] = func(*args)
File "/usr/local/lib/python3.10/site-packages/apache_beam/runners/worker/bundle_processor.py", line 911, in get_operation
return transform_factory.create_operation(
File "/usr/local/lib/python3.10/site-packages/apache_beam/runners/worker/bundle_processor.py", line 1206, in create_operation
return creator(self, transform_id, transform_proto, payload, consumers)
File "/usr/local/lib/python3.10/site-packages/apache_beam/runners/worker/bundle_processor.py", line 1553, in create_par_do
return _create_pardo_operation(
File "/usr/local/lib/python3.10/site-packages/apache_beam/runners/worker/bundle_processor.py", line 1596, in _create_pardo_operation
dofn_data = pickler.loads(serialized_fn)
File "/usr/local/lib/python3.10/site-packages/apache_beam/internal/pickler.py", line 51, in loads
return desired_pickle_lib.loads(
File "/usr/local/lib/python3.10/site-packages/apache_beam/internal/dill_pickler.py", line 289, in loads
return dill.loads(s)
File "/usr/local/lib/python3.10/site-packages/dill/_dill.py", line 275, in loads
return load(file, ignore, **kwds)
File "/usr/local/lib/python3.10/site-packages/dill/_dill.py", line 270, in load
return Unpickler(file, ignore=ignore, **kwds).load()
File "/usr/local/lib/python3.10/site-packages/dill/_dill.py", line 472, in load
obj = StockUnpickler.load(self)
File "/usr/local/lib/python3.10/site-packages/dill/_dill.py", line 462, in find_class
return StockUnpickler.find_class(self, module, name)
AttributeError: Can't get attribute '_NoDefault' on <module 'pandas._libs.lib' from '/usr/local/lib/python3.10/site-packages/pandas/_libs/lib.cpython-310-x86_64-linux-gnu.so'>
[31m===== [31m[1m4 failed[0m, [32m82 passed[0m, [33m19 skipped[0m, [33m651 warnings[0m[31m in 15337.02s (4:15:37)[0m[31m =====[0m
> Task :sdks:python:test-suites:dataflow:py310:postCommitIT FAILED
FAILURE: Build failed with an exception.
* Where:
Script '<https://ci-beam.apache.org/job/beam_PostCommit_Python310/ws/src/sdks/python/test-suites/dataflow/common.gradle'> line: 121
* What went wrong:
Execution failed for task ':sdks:python:test-suites:dataflow:py310:postCommitIT'.
> Process 'command 'sh'' finished with non-zero exit value 1
* Try:
> Run with --stacktrace option to get the stack trace.
> Run with --info or --debug option to get more log output.
* Get more help at https://help.gradle.org
Deprecated Gradle features were used in this build, making it incompatible with Gradle 8.0.
You can use '--warning-mode all' to show the individual deprecation warnings and determine if they come from your own scripts or plugins.
See https://docs.gradle.org/7.5.1/userguide/command_line_interface.html#sec:command_line_warnings
Execution optimizations have been disabled for 1 invalid unit(s) of work during this build to ensure correctness.
Please consult deprecation warnings for more details.
BUILD FAILED in 4h 18m 25s
218 actionable tasks: 150 executed, 62 from cache, 6 up-to-date
Publishing build scan...
https://gradle.com/s/rxjm43hjwsfqw
Build step 'Invoke Gradle script' changed build result to FAILURE
Build step 'Invoke Gradle script' marked build as failure
---------------------------------------------------------------------
To unsubscribe, e-mail: builds-unsubscribe@beam.apache.org
For additional commands, e-mail: builds-help@beam.apache.org