You are viewing a plain text version of this content. The canonical link for it is here.
Posted to builds@solr.apache.org by Apache Jenkins Server <je...@builds.apache.org> on 2024/12/11 02:06:53 UTC

[JENKINS] Solr » Solr-Test-9.x - Build # 6395 - Unstable!

Build: https://ci-builds.apache.org/job/Solr/job/Solr-Test-9.x/6395/

3 tests failed.
FAILED:  org.apache.solr.cloud.CollectionStateZnodeTest.testZkNodeLocation

Error Message:
com.carrotsearch.randomizedtesting.UncaughtExceptionError: Captured an uncaught exception in thread: Thread[id=2446, name=zkCallback-1537-thread-2, state=RUNNABLE, group=TGRP-CollectionStateZnodeTest]

Stack Trace:
com.carrotsearch.randomizedtesting.UncaughtExceptionError: Captured an uncaught exception in thread: Thread[id=2446, name=zkCallback-1537-thread-2, state=RUNNABLE, group=TGRP-CollectionStateZnodeTest]
	at __randomizedtesting.SeedInfo.seed([CED74A3376CFA727:817AC093DBA029D3]:0)
Caused by: org.apache.solr.common.SolrException: Error updating shard term for collection: myExternColl
	at __randomizedtesting.SeedInfo.seed([CED74A3376CFA727]:0)
	at app//org.apache.solr.cloud.ZkShardTerms.refreshTerms(ZkShardTerms.java:377)
	at app//org.apache.solr.cloud.ZkShardTerms.lambda$registerWatcher$8(ZkShardTerms.java:430)
	at app//org.apache.solr.common.cloud.SolrZkClient$ProcessWatchWithExecutor.lambda$process$1(SolrZkClient.java:1086)
	at app//org.apache.solr.common.util.ExecutorUtil$MDCAwareThreadPoolExecutor.lambda$execute$0(ExecutorUtil.java:380)
	at java.base@11.0.16.1/java.util.concurrent.ThreadPoolExecutor.runWorker(ThreadPoolExecutor.java:1128)
	at java.base@11.0.16.1/java.util.concurrent.ThreadPoolExecutor$Worker.run(ThreadPoolExecutor.java:628)
	at java.base@11.0.16.1/java.lang.Thread.run(Thread.java:829)
Caused by: org.apache.zookeeper.KeeperException$NoNodeException: KeeperErrorCode = NoNode for /collections/myExternColl/terms/shard1
	at app//org.apache.zookeeper.KeeperException.create(KeeperException.java:117)
	at app//org.apache.zookeeper.KeeperException.create(KeeperException.java:53)
	at app//org.apache.zookeeper.ZooKeeper.getData(ZooKeeper.java:1972)
	at app//org.apache.solr.common.cloud.SolrZkClient.lambda$getData$6(SolrZkClient.java:451)
	at app//org.apache.solr.common.cloud.ZkCmdExecutor.retryOperation(ZkCmdExecutor.java:70)
	at app//org.apache.solr.common.cloud.SolrZkClient.getData(SolrZkClient.java:451)
	at app//org.apache.solr.cloud.ZkShardTerms.refreshTerms(ZkShardTerms.java:373)
	... 6 more


FAILED:  org.apache.solr.cloud.FullSolrCloudDistribCmdsTest.testConcurrentIndexing

Error Message:
com.carrotsearch.randomizedtesting.UncaughtExceptionError: Captured an uncaught exception in thread: Thread[id=4713, name=zkCallback-2541-thread-3, state=RUNNABLE, group=TGRP-FullSolrCloudDistribCmdsTest]

Stack Trace:
com.carrotsearch.randomizedtesting.UncaughtExceptionError: Captured an uncaught exception in thread: Thread[id=4713, name=zkCallback-2541-thread-3, state=RUNNABLE, group=TGRP-FullSolrCloudDistribCmdsTest]
	at __randomizedtesting.SeedInfo.seed([CED74A3376CFA727:7FF468AD70560E47]:0)
Caused by: org.apache.solr.common.SolrException: Error updating shard term for collection: composite_collection_with_routerfield_2
	at __randomizedtesting.SeedInfo.seed([CED74A3376CFA727]:0)
	at app//org.apache.solr.cloud.ZkShardTerms.refreshTerms(ZkShardTerms.java:377)
	at app//org.apache.solr.cloud.ZkShardTerms.lambda$registerWatcher$8(ZkShardTerms.java:430)
	at app//org.apache.solr.common.cloud.SolrZkClient$ProcessWatchWithExecutor.lambda$process$1(SolrZkClient.java:1086)
	at app//org.apache.solr.common.util.ExecutorUtil$MDCAwareThreadPoolExecutor.lambda$execute$0(ExecutorUtil.java:380)
	at java.base@11.0.16.1/java.util.concurrent.ThreadPoolExecutor.runWorker(ThreadPoolExecutor.java:1128)
	at java.base@11.0.16.1/java.util.concurrent.ThreadPoolExecutor$Worker.run(ThreadPoolExecutor.java:628)
	at java.base@11.0.16.1/java.lang.Thread.run(Thread.java:829)
Caused by: org.apache.zookeeper.KeeperException$NoNodeException: KeeperErrorCode = NoNode for /collections/composite_collection_with_routerfield_2/terms/shard1
	at app//org.apache.zookeeper.KeeperException.create(KeeperException.java:117)
	at app//org.apache.zookeeper.KeeperException.create(KeeperException.java:53)
	at app//org.apache.zookeeper.ZooKeeper.getData(ZooKeeper.java:1972)
	at app//org.apache.solr.common.cloud.SolrZkClient.lambda$getData$6(SolrZkClient.java:451)
	at app//org.apache.solr.common.cloud.ZkCmdExecutor.retryOperation(ZkCmdExecutor.java:70)
	at app//org.apache.solr.common.cloud.SolrZkClient.getData(SolrZkClient.java:451)
	at app//org.apache.solr.cloud.ZkShardTerms.refreshTerms(ZkShardTerms.java:373)
	... 6 more


FAILED:  org.apache.solr.cloud.OverseerTest.testShardLeaderChange

Error Message:
com.carrotsearch.randomizedtesting.UncaughtExceptionError: Captured an uncaught exception in thread: Thread[id=7558, name=OverseerCollectionConfigSetProcessor-72470704624893958-127.0.0.1:40129_solr-n_0000000000, state=RUNNABLE, group=Overseer collection creation process.]

Stack Trace:
com.carrotsearch.randomizedtesting.UncaughtExceptionError: Captured an uncaught exception in thread: Thread[id=7558, name=OverseerCollectionConfigSetProcessor-72470704624893958-127.0.0.1:40129_solr-n_0000000000, state=RUNNABLE, group=Overseer collection creation process.]
	at __randomizedtesting.SeedInfo.seed([CED74A3376CFA727:1084CDC46C5752D6]:0)
Caused by: org.apache.solr.common.AlreadyClosedException
	at __randomizedtesting.SeedInfo.seed([CED74A3376CFA727]:0)
	at app//org.apache.solr.common.cloud.ZkCmdExecutor.retryOperation(ZkCmdExecutor.java:68)
	at app//org.apache.solr.common.cloud.SolrZkClient.getData(SolrZkClient.java:451)
	at app//org.apache.solr.cloud.OverseerTaskProcessor.amILeader(OverseerTaskProcessor.java:486)
	at app//org.apache.solr.cloud.OverseerTaskProcessor.run(OverseerTaskProcessor.java:171)
	at java.base@11.0.16.1/java.lang.Thread.run(Thread.java:829)




Build Log:
[...truncated 61234 lines...]
ERROR: The following test(s) have failed:
  - org.apache.solr.cloud.CollectionStateZnodeTest.testZkNodeLocation (:solr:core)
    Test history: https://ge.apache.org/scans/tests?search.rootProjectNames=solr-root&tests.container=org.apache.solr.cloud.CollectionStateZnodeTest&tests.test=testZkNodeLocation http://fucit.org/solr-jenkins-reports/history-trend-of-recent-failures.html#series/org.apache.solr.cloud.CollectionStateZnodeTest.testZkNodeLocation
    Test output: /home/jenkins/jenkins-slave/workspace/Solr/Solr-Test-9.x/solr/core/build/test-results/test/outputs/OUTPUT-org.apache.solr.cloud.CollectionStateZnodeTest.txt
    Reproduce with: ./gradlew :solr:core:test --tests "org.apache.solr.cloud.CollectionStateZnodeTest.testZkNodeLocation" -Ptests.jvms=4 -Ptests.haltonfailure=false "-Ptests.jvmargs=-XX:TieredStopAtLevel=1 -XX:+UseParallelGC -XX:ActiveProcessorCount=1 -XX:ReservedCodeCacheSize=120m" -Ptests.seed=CED74A3376CFA727 -Ptests.multiplier=2 -Ptests.badapples=false -Ptests.file.encoding=ISO-8859-1

  - org.apache.solr.cloud.FullSolrCloudDistribCmdsTest.testConcurrentIndexing (:solr:core)
    Test history: https://ge.apache.org/scans/tests?search.rootProjectNames=solr-root&tests.container=org.apache.solr.cloud.FullSolrCloudDistribCmdsTest&tests.test=testConcurrentIndexing http://fucit.org/solr-jenkins-reports/history-trend-of-recent-failures.html#series/org.apache.solr.cloud.FullSolrCloudDistribCmdsTest.testConcurrentIndexing
    Test output: /home/jenkins/jenkins-slave/workspace/Solr/Solr-Test-9.x/solr/core/build/test-results/test/outputs/OUTPUT-org.apache.solr.cloud.FullSolrCloudDistribCmdsTest.txt
    Reproduce with: ./gradlew :solr:core:test --tests "org.apache.solr.cloud.FullSolrCloudDistribCmdsTest.testConcurrentIndexing" -Ptests.jvms=4 -Ptests.haltonfailure=false "-Ptests.jvmargs=-XX:TieredStopAtLevel=1 -XX:+UseParallelGC -XX:ActiveProcessorCount=1 -XX:ReservedCodeCacheSize=120m" -Ptests.seed=CED74A3376CFA727 -Ptests.multiplier=2 -Ptests.badapples=false -Ptests.file.encoding=ISO-8859-1

  - org.apache.solr.cloud.OverseerTest.testShardLeaderChange (:solr:core)
    Test history: https://ge.apache.org/scans/tests?search.rootProjectNames=solr-root&tests.container=org.apache.solr.cloud.OverseerTest&tests.test=testShardLeaderChange http://fucit.org/solr-jenkins-reports/history-trend-of-recent-failures.html#series/org.apache.solr.cloud.OverseerTest.testShardLeaderChange
    Test output: /home/jenkins/jenkins-slave/workspace/Solr/Solr-Test-9.x/solr/core/build/test-results/test/outputs/OUTPUT-org.apache.solr.cloud.OverseerTest.txt
    Reproduce with: ./gradlew :solr:core:test --tests "org.apache.solr.cloud.OverseerTest.testShardLeaderChange" -Ptests.jvms=4 -Ptests.haltonfailure=false "-Ptests.jvmargs=-XX:TieredStopAtLevel=1 -XX:+UseParallelGC -XX:ActiveProcessorCount=1 -XX:ReservedCodeCacheSize=120m" -Ptests.seed=CED74A3376CFA727 -Ptests.multiplier=2 -Ptests.badapples=false -Ptests.file.encoding=ISO-8859-1


Deprecated Gradle features were used in this build, making it incompatible with Gradle 9.0.

You can use '--warning-mode all' to show the individual deprecation warnings and determine if they come from your own scripts or plugins.

For more on this, please refer to https://docs.gradle.org/8.10/userguide/command_line_interface.html#sec:command_line_warnings in the Gradle documentation.

BUILD SUCCESSFUL in 48m 45s
162 actionable tasks: 162 executed

Publishing build scan...
https://ge.apache.org/s/x7bnwu3cbo57m

Build step 'Invoke Gradle script' changed build result to SUCCESS
Archiving artifacts
‘**/*.events’ doesn’t match anything: ‘**’ exists but not ‘**/*.events’
No artifacts found that match the file pattern "**/*.events,heapdumps/**,**/hs_err_pid*". Configuration error?
Recording test results
[Checks API] No suitable checks publisher found.
Build step 'Publish JUnit test result report' changed build result to UNSTABLE
Email was triggered for: Unstable (Test Failures)
Sending email for trigger: Unstable (Test Failures)

[JENKINS] Solr » Solr-Test-9.x - Build # 6396 - Still Unstable!

Posted by Apache Jenkins Server <je...@builds.apache.org>.
Build: https://ci-builds.apache.org/job/Solr/job/Solr-Test-9.x/6396/

4 tests failed.
FAILED:  org.apache.solr.cloud.ReindexCollectionTest.testSameTargetReindexing

Error Message:
com.carrotsearch.randomizedtesting.UncaughtExceptionError: Captured an uncaught exception in thread: Thread[id=8825, name=zkCallback-5081-thread-3, state=RUNNABLE, group=TGRP-ReindexCollectionTest]

Stack Trace:
com.carrotsearch.randomizedtesting.UncaughtExceptionError: Captured an uncaught exception in thread: Thread[id=8825, name=zkCallback-5081-thread-3, state=RUNNABLE, group=TGRP-ReindexCollectionTest]
Caused by: org.apache.solr.common.SolrException: Error updating shard term for collection: sameTargetReindexing_true_true
	at __randomizedtesting.SeedInfo.seed([93FD14A2AA4444F9]:0)
	at app//org.apache.solr.cloud.ZkShardTerms.refreshTerms(ZkShardTerms.java:377)
	at app//org.apache.solr.cloud.ZkShardTerms.lambda$registerWatcher$8(ZkShardTerms.java:430)
	at app//org.apache.solr.common.cloud.SolrZkClient$ProcessWatchWithExecutor.lambda$process$1(SolrZkClient.java:1086)
	at app//org.apache.solr.common.util.ExecutorUtil$MDCAwareThreadPoolExecutor.lambda$execute$0(ExecutorUtil.java:380)
	at java.base@11.0.16.1/java.util.concurrent.ThreadPoolExecutor.runWorker(ThreadPoolExecutor.java:1128)
	at java.base@11.0.16.1/java.util.concurrent.ThreadPoolExecutor$Worker.run(ThreadPoolExecutor.java:628)
	at java.base@11.0.16.1/java.lang.Thread.run(Thread.java:829)
Caused by: org.apache.zookeeper.KeeperException$NoNodeException: KeeperErrorCode = NoNode for /collections/sameTargetReindexing_true_true/terms/shard1
	at app//org.apache.zookeeper.KeeperException.create(KeeperException.java:117)
	at app//org.apache.zookeeper.KeeperException.create(KeeperException.java:53)
	at app//org.apache.zookeeper.ZooKeeper.getData(ZooKeeper.java:1972)
	at app//org.apache.solr.common.cloud.SolrZkClient.lambda$getData$6(SolrZkClient.java:451)
	at app//org.apache.solr.common.cloud.ZkCmdExecutor.retryOperation(ZkCmdExecutor.java:70)
	at app//org.apache.solr.common.cloud.SolrZkClient.getData(SolrZkClient.java:451)
	at app//org.apache.solr.cloud.ZkShardTerms.refreshTerms(ZkShardTerms.java:373)
	... 6 more


FAILED:  org.apache.solr.cloud.TestAuthenticationFramework.testBasics

Error Message:
com.carrotsearch.randomizedtesting.UncaughtExceptionError: Captured an uncaught exception in thread: Thread[id=5766, name=zkCallback-3462-thread-3, state=RUNNABLE, group=TGRP-TestAuthenticationFramework]

Stack Trace:
com.carrotsearch.randomizedtesting.UncaughtExceptionError: Captured an uncaught exception in thread: Thread[id=5766, name=zkCallback-3462-thread-3, state=RUNNABLE, group=TGRP-TestAuthenticationFramework]
	at __randomizedtesting.SeedInfo.seed([93FD14A2AA4444F9:AE25BA8E92AA1A89]:0)
Caused by: org.apache.solr.common.SolrException: Error updating shard term for collection: testcollection
	at __randomizedtesting.SeedInfo.seed([93FD14A2AA4444F9]:0)
	at app//org.apache.solr.cloud.ZkShardTerms.refreshTerms(ZkShardTerms.java:377)
	at app//org.apache.solr.cloud.ZkShardTerms.lambda$registerWatcher$8(ZkShardTerms.java:430)
	at app//org.apache.solr.common.cloud.SolrZkClient$ProcessWatchWithExecutor.lambda$process$1(SolrZkClient.java:1086)
	at app//org.apache.solr.common.util.ExecutorUtil$MDCAwareThreadPoolExecutor.lambda$execute$0(ExecutorUtil.java:380)
	at java.base@11.0.16.1/java.util.concurrent.ThreadPoolExecutor.runWorker(ThreadPoolExecutor.java:1128)
	at java.base@11.0.16.1/java.util.concurrent.ThreadPoolExecutor$Worker.run(ThreadPoolExecutor.java:628)
	at java.base@11.0.16.1/java.lang.Thread.run(Thread.java:829)
Caused by: org.apache.zookeeper.KeeperException$NoNodeException: KeeperErrorCode = NoNode for /collections/testcollection/terms/shard2
	at app//org.apache.zookeeper.KeeperException.create(KeeperException.java:117)
	at app//org.apache.zookeeper.KeeperException.create(KeeperException.java:53)
	at app//org.apache.zookeeper.ZooKeeper.getData(ZooKeeper.java:1972)
	at app//org.apache.solr.common.cloud.SolrZkClient.lambda$getData$6(SolrZkClient.java:451)
	at app//org.apache.solr.common.cloud.ZkCmdExecutor.retryOperation(ZkCmdExecutor.java:70)
	at app//org.apache.solr.common.cloud.SolrZkClient.getData(SolrZkClient.java:451)
	at app//org.apache.solr.cloud.ZkShardTerms.refreshTerms(ZkShardTerms.java:373)
	... 6 more


FAILED:  org.apache.solr.cloud.TestTlogReplica.testCreateDelete {seed=[93FD14A2AA4444F9:3CBB5912687677E5]}

Error Message:
com.carrotsearch.randomizedtesting.UncaughtExceptionError: Captured an uncaught exception in thread: Thread[id=8635, name=zkCallback-5210-thread-1, state=RUNNABLE, group=TGRP-TestTlogReplica]

Stack Trace:
com.carrotsearch.randomizedtesting.UncaughtExceptionError: Captured an uncaught exception in thread: Thread[id=8635, name=zkCallback-5210-thread-1, state=RUNNABLE, group=TGRP-TestTlogReplica]
Caused by: org.apache.solr.common.SolrException: Error updating shard term for collection: tlog_replica_test_create_delete
	at __randomizedtesting.SeedInfo.seed([93FD14A2AA4444F9]:0)
	at app//org.apache.solr.cloud.ZkShardTerms.refreshTerms(ZkShardTerms.java:377)
	at app//org.apache.solr.cloud.ZkShardTerms.lambda$registerWatcher$8(ZkShardTerms.java:430)
	at app//org.apache.solr.common.cloud.SolrZkClient$ProcessWatchWithExecutor.lambda$process$1(SolrZkClient.java:1086)
	at app//org.apache.solr.common.util.ExecutorUtil$MDCAwareThreadPoolExecutor.lambda$execute$0(ExecutorUtil.java:380)
	at java.base@11.0.16.1/java.util.concurrent.ThreadPoolExecutor.runWorker(ThreadPoolExecutor.java:1128)
	at java.base@11.0.16.1/java.util.concurrent.ThreadPoolExecutor$Worker.run(ThreadPoolExecutor.java:628)
	at java.base@11.0.16.1/java.lang.Thread.run(Thread.java:829)
Caused by: org.apache.zookeeper.KeeperException$NoNodeException: KeeperErrorCode = NoNode for /collections/tlog_replica_test_create_delete/terms/shard2
	at app//org.apache.zookeeper.KeeperException.create(KeeperException.java:117)
	at app//org.apache.zookeeper.KeeperException.create(KeeperException.java:53)
	at app//org.apache.zookeeper.ZooKeeper.getData(ZooKeeper.java:1972)
	at app//org.apache.solr.common.cloud.SolrZkClient.lambda$getData$6(SolrZkClient.java:451)
	at app//org.apache.solr.common.cloud.ZkCmdExecutor.retryOperation(ZkCmdExecutor.java:70)
	at app//org.apache.solr.common.cloud.SolrZkClient.getData(SolrZkClient.java:451)
	at app//org.apache.solr.cloud.ZkShardTerms.refreshTerms(ZkShardTerms.java:373)
	... 6 more


FAILED:  org.apache.solr.cloud.api.collections.SplitByPrefixTest.doTest

Error Message:
com.carrotsearch.randomizedtesting.UncaughtExceptionError: Captured an uncaught exception in thread: Thread[id=16972, name=zkCallback-12726-thread-5, state=RUNNABLE, group=TGRP-SplitByPrefixTest]

Stack Trace:
com.carrotsearch.randomizedtesting.UncaughtExceptionError: Captured an uncaught exception in thread: Thread[id=16972, name=zkCallback-12726-thread-5, state=RUNNABLE, group=TGRP-SplitByPrefixTest]
	at __randomizedtesting.SeedInfo.seed([93FD14A2AA4444F9:34B9AC06C7FF5740]:0)
Caused by: org.apache.solr.common.SolrException: Error updating shard term for collection: c1
	at __randomizedtesting.SeedInfo.seed([93FD14A2AA4444F9]:0)
	at app//org.apache.solr.cloud.ZkShardTerms.refreshTerms(ZkShardTerms.java:377)
	at app//org.apache.solr.cloud.ZkShardTerms.lambda$registerWatcher$8(ZkShardTerms.java:430)
	at app//org.apache.solr.common.cloud.SolrZkClient$ProcessWatchWithExecutor.lambda$process$1(SolrZkClient.java:1086)
	at app//org.apache.solr.common.util.ExecutorUtil$MDCAwareThreadPoolExecutor.lambda$execute$0(ExecutorUtil.java:380)
	at java.base@11.0.16.1/java.util.concurrent.ThreadPoolExecutor.runWorker(ThreadPoolExecutor.java:1128)
	at java.base@11.0.16.1/java.util.concurrent.ThreadPoolExecutor$Worker.run(ThreadPoolExecutor.java:628)
	at java.base@11.0.16.1/java.lang.Thread.run(Thread.java:829)
Caused by: org.apache.zookeeper.KeeperException$NoNodeException: KeeperErrorCode = NoNode for /collections/c1/terms/shard1_1_0_0_0_1
	at app//org.apache.zookeeper.KeeperException.create(KeeperException.java:117)
	at app//org.apache.zookeeper.KeeperException.create(KeeperException.java:53)
	at app//org.apache.zookeeper.ZooKeeper.getData(ZooKeeper.java:1972)
	at app//org.apache.solr.common.cloud.SolrZkClient.lambda$getData$6(SolrZkClient.java:451)
	at app//org.apache.solr.common.cloud.ZkCmdExecutor.retryOperation(ZkCmdExecutor.java:70)
	at app//org.apache.solr.common.cloud.SolrZkClient.getData(SolrZkClient.java:451)
	at app//org.apache.solr.cloud.ZkShardTerms.refreshTerms(ZkShardTerms.java:373)
	... 6 more




Build Log:
[...truncated 13148 lines...]
ERROR: The following test(s) have failed:
  - org.apache.solr.cloud.TestAuthenticationFramework.testBasics (:solr:core)
    Test history: https://ge.apache.org/scans/tests?search.rootProjectNames=solr-root&tests.container=org.apache.solr.cloud.TestAuthenticationFramework&tests.test=testBasics http://fucit.org/solr-jenkins-reports/history-trend-of-recent-failures.html#series/org.apache.solr.cloud.TestAuthenticationFramework.testBasics
    Test output: /home/jenkins/jenkins-slave/workspace/Solr/Solr-Test-9.x/solr/core/build/test-results/test/outputs/OUTPUT-org.apache.solr.cloud.TestAuthenticationFramework.txt
    Reproduce with: ./gradlew :solr:core:test --tests "org.apache.solr.cloud.TestAuthenticationFramework.testBasics" -Ptests.jvms=4 -Ptests.haltonfailure=false "-Ptests.jvmargs=-XX:TieredStopAtLevel=1 -XX:+UseParallelGC -XX:ActiveProcessorCount=1 -XX:ReservedCodeCacheSize=120m" -Ptests.seed=93FD14A2AA4444F9 -Ptests.multiplier=2 -Ptests.badapples=false -Ptests.file.encoding=US-ASCII

  - org.apache.solr.cloud.TestTlogReplica.testCreateDelete {seed=[93FD14A2AA4444F9:3CBB5912687677E5]} (:solr:core)
    Test history: https://ge.apache.org/scans/tests?search.rootProjectNames=solr-root&tests.container=org.apache.solr.cloud.TestTlogReplica&tests.test=testCreateDelete {seed=[93FD14A2AA4444F9:3CBB5912687677E5]} http://fucit.org/solr-jenkins-reports/history-trend-of-recent-failures.html#series/org.apache.solr.cloud.TestTlogReplica.testCreateDelete {seed=[93FD14A2AA4444F9:3CBB5912687677E5]}
    Test output: /home/jenkins/jenkins-slave/workspace/Solr/Solr-Test-9.x/solr/core/build/test-results/test/outputs/OUTPUT-org.apache.solr.cloud.TestTlogReplica.txt
    Reproduce with: ./gradlew :solr:core:test --tests "org.apache.solr.cloud.TestTlogReplica.testCreateDelete {seed=[93FD14A2AA4444F9:3CBB5912687677E5]}" -Ptests.jvms=4 -Ptests.haltonfailure=false "-Ptests.jvmargs=-XX:TieredStopAtLevel=1 -XX:+UseParallelGC -XX:ActiveProcessorCount=1 -XX:ReservedCodeCacheSize=120m" -Ptests.seed=93FD14A2AA4444F9 -Ptests.multiplier=2 -Ptests.badapples=false -Ptests.file.encoding=US-ASCII

  - org.apache.solr.cloud.ReindexCollectionTest.testSameTargetReindexing (:solr:core)
    Test history: https://ge.apache.org/scans/tests?search.rootProjectNames=solr-root&tests.container=org.apache.solr.cloud.ReindexCollectionTest&tests.test=testSameTargetReindexing http://fucit.org/solr-jenkins-reports/history-trend-of-recent-failures.html#series/org.apache.solr.cloud.ReindexCollectionTest.testSameTargetReindexing
    Test output: /home/jenkins/jenkins-slave/workspace/Solr/Solr-Test-9.x/solr/core/build/test-results/test/outputs/OUTPUT-org.apache.solr.cloud.ReindexCollectionTest.txt
    Reproduce with: ./gradlew :solr:core:test --tests "org.apache.solr.cloud.ReindexCollectionTest.testSameTargetReindexing" -Ptests.jvms=4 -Ptests.haltonfailure=false "-Ptests.jvmargs=-XX:TieredStopAtLevel=1 -XX:+UseParallelGC -XX:ActiveProcessorCount=1 -XX:ReservedCodeCacheSize=120m" -Ptests.seed=93FD14A2AA4444F9 -Ptests.multiplier=2 -Ptests.badapples=false -Ptests.file.encoding=US-ASCII

  - org.apache.solr.cloud.api.collections.SplitByPrefixTest.doTest (:solr:core)
    Test history: https://ge.apache.org/scans/tests?search.rootProjectNames=solr-root&tests.container=org.apache.solr.cloud.api.collections.SplitByPrefixTest&tests.test=doTest http://fucit.org/solr-jenkins-reports/history-trend-of-recent-failures.html#series/org.apache.solr.cloud.api.collections.SplitByPrefixTest.doTest
    Test output: /home/jenkins/jenkins-slave/workspace/Solr/Solr-Test-9.x/solr/core/build/test-results/test/outputs/OUTPUT-org.apache.solr.cloud.api.collections.SplitByPrefixTest.txt
    Reproduce with: ./gradlew :solr:core:test --tests "org.apache.solr.cloud.api.collections.SplitByPrefixTest.doTest" -Ptests.jvms=4 -Ptests.haltonfailure=false "-Ptests.jvmargs=-XX:TieredStopAtLevel=1 -XX:+UseParallelGC -XX:ActiveProcessorCount=1 -XX:ReservedCodeCacheSize=120m" -Ptests.seed=93FD14A2AA4444F9 -Ptests.multiplier=2 -Ptests.badapples=false -Ptests.file.encoding=US-ASCII


Deprecated Gradle features were used in this build, making it incompatible with Gradle 9.0.

You can use '--warning-mode all' to show the individual deprecation warnings and determine if they come from your own scripts or plugins.

For more on this, please refer to https://docs.gradle.org/8.10/userguide/command_line_interface.html#sec:command_line_warnings in the Gradle documentation.

BUILD SUCCESSFUL in 47m 38s
162 actionable tasks: 162 executed

Publishing build scan...
https://ge.apache.org/s/ueg5gnl36wjdk

Build step 'Invoke Gradle script' changed build result to SUCCESS
Archiving artifacts
‘**/*.events’ doesn’t match anything: ‘**’ exists but not ‘**/*.events’
No artifacts found that match the file pattern "**/*.events,heapdumps/**,**/hs_err_pid*". Configuration error?
Recording test results
[Checks API] No suitable checks publisher found.
Build step 'Publish JUnit test result report' changed build result to UNSTABLE
Email was triggered for: Unstable (Test Failures)
Sending email for trigger: Unstable (Test Failures)