You are viewing a plain text version of this content. The canonical link for it is here.
Posted to dev@lucene.apache.org by Apache Hudson Server <hu...@hudson.apache.org> on 2011/01/29 17:43:53 UTC

[HUDSON] Lucene-Solr-tests-only-trunk - Build # 4281 - Still Failing

Build: https://hudson.apache.org/hudson/job/Lucene-Solr-tests-only-trunk/4281/

4 tests failed.
FAILED:  org.apache.solr.client.solrj.SolrExampleBinaryTest.testPivotFacet

Error Message:
expected:<1> but was:<2>

Stack Trace:
junit.framework.AssertionFailedError: expected:<1> but was:<2>
	at org.apache.lucene.util.LuceneTestCase$LuceneTestCaseRunner.runChild(LuceneTestCase.java:1127)
	at org.apache.lucene.util.LuceneTestCase$LuceneTestCaseRunner.runChild(LuceneTestCase.java:1059)
	at org.apache.solr.client.solrj.SolrExampleTests.testPivotFacet(SolrExampleTests.java:650)


FAILED:  org.apache.solr.client.solrj.embedded.SolrExampleEmbeddedTest.testPivotFacet

Error Message:
expected:<1> but was:<2>

Stack Trace:
junit.framework.AssertionFailedError: expected:<1> but was:<2>
	at org.apache.lucene.util.LuceneTestCase$LuceneTestCaseRunner.runChild(LuceneTestCase.java:1127)
	at org.apache.lucene.util.LuceneTestCase$LuceneTestCaseRunner.runChild(LuceneTestCase.java:1059)
	at org.apache.solr.client.solrj.SolrExampleTests.testPivotFacet(SolrExampleTests.java:650)


FAILED:  org.apache.solr.client.solrj.embedded.SolrExampleJettyTest.testPivotFacet

Error Message:
expected:<1> but was:<2>

Stack Trace:
junit.framework.AssertionFailedError: expected:<1> but was:<2>
	at org.apache.lucene.util.LuceneTestCase$LuceneTestCaseRunner.runChild(LuceneTestCase.java:1127)
	at org.apache.lucene.util.LuceneTestCase$LuceneTestCaseRunner.runChild(LuceneTestCase.java:1059)
	at org.apache.solr.client.solrj.SolrExampleTests.testPivotFacet(SolrExampleTests.java:650)


FAILED:  org.apache.solr.client.solrj.embedded.SolrExampleStreamingTest.testPivotFacet

Error Message:
expected:<1> but was:<2>

Stack Trace:
junit.framework.AssertionFailedError: expected:<1> but was:<2>
	at org.apache.lucene.util.LuceneTestCase$LuceneTestCaseRunner.runChild(LuceneTestCase.java:1127)
	at org.apache.lucene.util.LuceneTestCase$LuceneTestCaseRunner.runChild(LuceneTestCase.java:1059)
	at org.apache.solr.client.solrj.SolrExampleTests.testPivotFacet(SolrExampleTests.java:650)




Build Log (for compile errors):
[...truncated 8295 lines...]



---------------------------------------------------------------------
To unsubscribe, e-mail: dev-unsubscribe@lucene.apache.org
For additional commands, e-mail: dev-help@lucene.apache.org