You are viewing a plain text version of this content. The canonical link for it is here.
Posted to dev@kafka.apache.org by Apache Jenkins Server <je...@builds.apache.org> on 2015/12/09 11:00:15 UTC

Build failed in Jenkins: kafka-trunk-jdk8 #215

See <https://builds.apache.org/job/kafka-trunk-jdk8/215/changes>

Changes:

[wangguoz] KAFKA-2962: stream-table table-table joins

------------------------------------------
[...truncated 1425 lines...]

kafka.api.PlaintextConsumerTest > testPartitionsForAutoCreate PASSED

kafka.api.PlaintextConsumerTest > testShrinkingTopicSubscriptions PASSED

kafka.api.PlaintextConsumerTest > testMultiConsumerSessionTimeoutOnStopPolling PASSED

kafka.api.PlaintextConsumerTest > testPartitionsForInvalidTopic PASSED

kafka.api.PlaintextConsumerTest > testSeek PASSED

kafka.api.PlaintextConsumerTest > testMultiConsumerSessionTimeoutOnClose PASSED

kafka.api.PlaintextConsumerTest > testFetchRecordTooLarge PASSED

kafka.api.PlaintextConsumerTest > testMultiConsumerDefaultAssignment PASSED

kafka.api.PlaintextConsumerTest > testAutoCommitOnClose PASSED

kafka.api.PlaintextConsumerTest > testExpandingTopicSubscriptions PASSED

kafka.api.PlaintextConsumerTest > testPatternUnsubscription PASSED

kafka.api.PlaintextConsumerTest > testGroupConsumption PASSED

kafka.api.PlaintextConsumerTest > testPartitionsFor PASSED

kafka.api.PlaintextConsumerTest > testMultiConsumerRoundRobinAssignment PASSED

kafka.api.PlaintextConsumerTest > testPartitionPauseAndResume PASSED

kafka.api.PlaintextConsumerTest > testAutoCommitOnCloseAfterWakeup PASSED

kafka.api.PlaintextConsumerTest > testAutoOffsetReset PASSED

kafka.api.PlaintextConsumerTest > testFetchInvalidOffset PASSED

kafka.api.PlaintextConsumerTest > testCommitMetadata PASSED

kafka.api.PlaintextConsumerTest > testRoundRobinAssignment PASSED

kafka.api.PlaintextConsumerTest > testPatternSubscription PASSED

kafka.api.PlaintextConsumerTest > testPauseStateNotPreservedByRebalance PASSED

kafka.api.PlaintextConsumerTest > testUnsubscribeTopic PASSED

kafka.api.PlaintextConsumerTest > testListTopics PASSED

kafka.api.PlaintextConsumerTest > testAutoCommitOnRebalance PASSED

kafka.api.PlaintextConsumerTest > testSimpleConsumption PASSED

kafka.api.PlaintextConsumerTest > testPartitionReassignmentCallback PASSED

kafka.api.PlaintextConsumerTest > testCommitSpecifiedOffsets PASSED

kafka.api.ProducerBounceTest > testBrokerFailure PASSED

kafka.api.ProducerFailureHandlingTest > testCannotSendToInternalTopic PASSED

kafka.api.ProducerFailureHandlingTest > testTooLargeRecordWithAckOne PASSED

kafka.api.ProducerFailureHandlingTest > testWrongBrokerList PASSED

kafka.api.ProducerFailureHandlingTest > testNotEnoughReplicas PASSED

kafka.api.ProducerFailureHandlingTest > testNonExistentTopic PASSED

kafka.api.ProducerFailureHandlingTest > testInvalidPartition PASSED

kafka.api.ProducerFailureHandlingTest > testSendAfterClosed PASSED

kafka.api.ProducerFailureHandlingTest > testTooLargeRecordWithAckZero PASSED

kafka.api.ProducerFailureHandlingTest > testNotEnoughReplicasAfterBrokerShutdown PASSED

kafka.api.SaslPlaintextConsumerTest > testPauseStateNotPreservedByRebalance PASSED

kafka.api.SaslPlaintextConsumerTest > testUnsubscribeTopic PASSED

kafka.api.SaslPlaintextConsumerTest > testListTopics PASSED

kafka.api.SaslPlaintextConsumerTest > testAutoCommitOnRebalance PASSED

kafka.api.SaslPlaintextConsumerTest > testSimpleConsumption PASSED

kafka.api.SaslPlaintextConsumerTest > testPartitionReassignmentCallback PASSED

kafka.api.SaslPlaintextConsumerTest > testCommitSpecifiedOffsets PASSED

kafka.api.SslConsumerTest > testPauseStateNotPreservedByRebalance PASSED

kafka.api.SslConsumerTest > testUnsubscribeTopic PASSED

kafka.api.SslConsumerTest > testListTopics PASSED

kafka.api.SslConsumerTest > testAutoCommitOnRebalance PASSED

kafka.api.SslConsumerTest > testSimpleConsumption PASSED

kafka.api.SslConsumerTest > testPartitionReassignmentCallback PASSED

kafka.api.SslConsumerTest > testCommitSpecifiedOffsets PASSED

kafka.api.ConsumerBounceTest > testSeekAndCommitWithBrokerFailures PASSED

kafka.api.ConsumerBounceTest > testConsumptionWithBrokerFailures PASSED

kafka.api.AuthorizerIntegrationTest > testCommitWithTopicWrite PASSED

kafka.api.AuthorizerIntegrationTest > testConsumeWithNoTopicAccess PASSED

kafka.api.AuthorizerIntegrationTest > testCreatePermissionNeededToReadFromNonExistentTopic PASSED

kafka.api.AuthorizerIntegrationTest > testOffsetFetchWithNoAccess PASSED

kafka.api.AuthorizerIntegrationTest > testListOfsetsWithTopicDescribe PASSED

kafka.api.AuthorizerIntegrationTest > testProduceWithTopicRead PASSED

kafka.api.AuthorizerIntegrationTest > testListOffsetsWithNoTopicAccess PASSED

kafka.api.AuthorizerIntegrationTest > testCreatePermissionNeededForWritingToNonExistentTopic PASSED

kafka.api.AuthorizerIntegrationTest > testConsumeWithNoGroupAccess PASSED

kafka.api.AuthorizerIntegrationTest > testConsumeWithTopicDescribe PASSED

kafka.api.AuthorizerIntegrationTest > testOffsetFetchWithNoTopicAccess PASSED

kafka.api.AuthorizerIntegrationTest > testCommitWithNoTopicAccess PASSED

kafka.api.AuthorizerIntegrationTest > testProduceWithNoTopicAccess PASSED

kafka.api.AuthorizerIntegrationTest > testProduceWithTopicWrite PASSED

kafka.api.AuthorizerIntegrationTest > testAuthorization PASSED

kafka.api.AuthorizerIntegrationTest > testConsumeWithTopicAndGroupRead PASSED

kafka.api.AuthorizerIntegrationTest > testConsumeWithTopicWrite PASSED

kafka.api.AuthorizerIntegrationTest > testOffsetFetchWithNoGroupAccess PASSED

kafka.api.AuthorizerIntegrationTest > testCommitWithNoAccess PASSED

kafka.api.AuthorizerIntegrationTest > testCommitWithNoGroupAccess PASSED

kafka.api.AuthorizerIntegrationTest > testConsumeWithNoAccess PASSED

kafka.api.AuthorizerIntegrationTest > testOffsetFetchWithTopicAndGroupRead PASSED

kafka.api.AuthorizerIntegrationTest > testCommitWithTopicDescribe PASSED

kafka.api.AuthorizerIntegrationTest > testProduceWithTopicDescribe PASSED

kafka.api.AuthorizerIntegrationTest > testOffsetFetchTopicDescribe PASSED

kafka.api.AuthorizerIntegrationTest > testCommitWithTopicAndGroupRead PASSED

kafka.api.RequestResponseSerializationTest > testSerializationAndDeserialization PASSED

kafka.api.RequestResponseSerializationTest > testFetchResponseVersion PASSED

kafka.api.RequestResponseSerializationTest > testProduceResponseVersion PASSED

kafka.api.SaslSslConsumerTest > testPauseStateNotPreservedByRebalance PASSED

kafka.api.SaslSslConsumerTest > testUnsubscribeTopic PASSED

kafka.api.SaslSslConsumerTest > testListTopics PASSED

kafka.api.SaslSslConsumerTest > testAutoCommitOnRebalance PASSED

kafka.api.SaslSslConsumerTest > testSimpleConsumption PASSED

kafka.api.SaslSslConsumerTest > testPartitionReassignmentCallback PASSED

kafka.api.SaslSslConsumerTest > testCommitSpecifiedOffsets PASSED

kafka.api.test.ProducerCompressionTest > testCompression[0] PASSED

kafka.api.test.ProducerCompressionTest > testCompression[1] PASSED

kafka.api.test.ProducerCompressionTest > testCompression[2] PASSED

kafka.api.test.ProducerCompressionTest > testCompression[3] PASSED

kafka.controller.ControllerFailoverTest > testMetadataUpdate PASSED

kafka.tools.ConsoleProducerTest > testParseKeyProp PASSED

kafka.tools.ConsoleProducerTest > testValidConfigsOldProducer PASSED

kafka.tools.ConsoleProducerTest > testInvalidConfigs PASSED

kafka.tools.ConsoleProducerTest > testValidConfigsNewProducer PASSED

unit.kafka.admin.AclCommandTest > testAclCli PASSED

unit.kafka.admin.AclCommandTest > testProducerConsumerCli PASSED

unit.kafka.security.auth.OperationTest > testFromString PASSED

unit.kafka.security.auth.AclTest > testAclJsonConversion PASSED

unit.kafka.security.auth.ResourceTypeTest > testFromString PASSED

unit.kafka.security.auth.PermissionTypeTest > testFromString PASSED

unit.kafka.tools.ConsoleConsumerTest > shouldLimitReadsToMaxMessageLimit PASSED

unit.kafka.tools.ConsoleConsumerTest > shouldParseValidNewConsumerValidConfig PASSED

unit.kafka.tools.ConsoleConsumerTest > shouldParseConfigsFromFile PASSED

unit.kafka.tools.ConsoleConsumerTest > shouldParseValidOldConsumerValidConfig PASSED

integration.kafka.api.AdminClientTest > testDescribeGroup PASSED

integration.kafka.api.AdminClientTest > testDescribeConsumerGroup PASSED

integration.kafka.api.AdminClientTest > testListGroups PASSED

integration.kafka.api.AdminClientTest > testDescribeConsumerGroupForNonExistentGroup PASSED

647 tests completed, 1 failed
:kafka-trunk-jdk8:core:test FAILED
:test_core_2_10 FAILED

FAILURE: Build failed with an exception.

* What went wrong:
Execution failed for task ':core:test'.
> There were failing tests. See the report at: file://<https://builds.apache.org/job/kafka-trunk-jdk8/ws/core/build/reports/tests/index.html>

* Try:
Run with --stacktrace option to get the stack trace. Run with --info or --debug option to get more log output.

BUILD FAILED

Total time: 47 mins 3.296 secs
Build step 'Execute shell' marked build as failure
Recording test results
Setting JDK1_8_0_45_HOME=/home/jenkins/jenkins-slave/tools/hudson.model.JDK/jdk1.8.0_45
Setting GRADLE_2_4_RC_2_HOME=/home/jenkins/jenkins-slave/tools/hudson.plugins.gradle.GradleInstallation/Gradle_2.4-rc-2
Setting JDK1_8_0_45_HOME=/home/jenkins/jenkins-slave/tools/hudson.model.JDK/jdk1.8.0_45
Setting GRADLE_2_4_RC_2_HOME=/home/jenkins/jenkins-slave/tools/hudson.plugins.gradle.GradleInstallation/Gradle_2.4-rc-2

Jenkins build is back to normal : kafka-trunk-jdk8 #217

Posted by Apache Jenkins Server <je...@builds.apache.org>.
See <https://builds.apache.org/job/kafka-trunk-jdk8/217/changes>


Build failed in Jenkins: kafka-trunk-jdk8 #216

Posted by Apache Jenkins Server <je...@builds.apache.org>.
See <https://builds.apache.org/job/kafka-trunk-jdk8/216/>

------------------------------------------
Started by an SCM change
[EnvInject] - Loading node environment variables.
Building remotely on ubuntu-2 (docker Ubuntu ubuntu) in workspace <https://builds.apache.org/job/kafka-trunk-jdk8/ws/>
 > git rev-parse --is-inside-work-tree # timeout=10
Fetching changes from the remote Git repository
 > git config remote.origin.url https://git-wip-us.apache.org/repos/asf/kafka.git # timeout=10
Fetching upstream changes from https://git-wip-us.apache.org/repos/asf/kafka.git
 > git --version # timeout=10
 > git -c core.askpass=true fetch --tags --progress https://git-wip-us.apache.org/repos/asf/kafka.git +refs/heads/*:refs/remotes/origin/*
 > git rev-parse refs/remotes/origin/trunk^{commit} # timeout=10
 > git rev-parse refs/remotes/origin/origin/trunk^{commit} # timeout=10
Checking out Revision 991aad23baa2f55d405d374b0a01785acdc63974 (refs/remotes/origin/trunk)
 > git config core.sparsecheckout # timeout=10
 > git checkout -f 991aad23baa2f55d405d374b0a01785acdc63974
 > git rev-list 991aad23baa2f55d405d374b0a01785acdc63974 # timeout=10
Setting JDK1_8_0_45_HOME=/home/jenkins/jenkins-slave/tools/hudson.model.JDK/jdk1.8.0_45
Setting GRADLE_2_4_RC_2_HOME=/home/jenkins/jenkins-slave/tools/hudson.plugins.gradle.GradleInstallation/Gradle_2.4-rc-2
[kafka-trunk-jdk8] $ /bin/bash -xe /tmp/hudson1396873671346001689.sh
+ /home/jenkins/jenkins-slave/tools/hudson.plugins.gradle.GradleInstallation/Gradle_2.4-rc-2/bin/gradle
To honour the JVM settings for this build a new JVM will be forked. Please consider using the daemon: http://gradle.org/docs/2.4-rc-2/userguide/gradle_daemon.html.
Building project 'core' with Scala version 2.10.6
:downloadWrapper

BUILD SUCCESSFUL

Total time: 16.613 secs
Setting JDK1_8_0_45_HOME=/home/jenkins/jenkins-slave/tools/hudson.model.JDK/jdk1.8.0_45
Setting GRADLE_2_4_RC_2_HOME=/home/jenkins/jenkins-slave/tools/hudson.plugins.gradle.GradleInstallation/Gradle_2.4-rc-2
[kafka-trunk-jdk8] $ /bin/bash -xe /tmp/hudson684939694480473527.sh
+ export GRADLE_OPTS=-Xmx1024m
+ GRADLE_OPTS=-Xmx1024m
+ ./gradlew -Dorg.gradle.project.maxParallelForks=1 clean jarAll testAll
To honour the JVM settings for this build a new JVM will be forked. Please consider using the daemon: https://docs.gradle.org/2.9/userguide/gradle_daemon.html.
Building project 'core' with Scala version 2.10.6
:clean UP-TO-DATE
:clients:clean UP-TO-DATE
:connect:clean UP-TO-DATE
:core:clean UP-TO-DATE
:examples:clean UP-TO-DATE
:log4j-appender:clean UP-TO-DATE
:streams:clean UP-TO-DATE
:tools:clean UP-TO-DATE
:connect:api:clean UP-TO-DATE
:connect:file:clean UP-TO-DATE
:connect:json:clean UP-TO-DATE
:connect:runtime:clean UP-TO-DATE
:jar_core_2_10
Building project 'core' with Scala version 2.10.6
:kafka-trunk-jdk8:clients:compileJava
:jar_core_2_10 FAILED

FAILURE: Build failed with an exception.

* What went wrong:
Failed to capture snapshot of input files for task 'compileJava' during up-to-date check.  See stacktrace for details.
> Could not add entry '/home/jenkins/.gradle/caches/modules-2/files-2.1/net.jpountz.lz4/lz4/1.3/792d5e592f6f3f0c1a3337cd0ac84309b544f8f4/lz4-1.3.jar' to cache fileHashes.bin (<https://builds.apache.org/job/kafka-trunk-jdk8/ws/.gradle/2.9/taskArtifacts/fileHashes.bin).>

* Try:
Run with --stacktrace option to get the stack trace. Run with --info or --debug option to get more log output.

BUILD FAILED

Total time: 14.259 secs
Build step 'Execute shell' marked build as failure
Recording test results
Setting JDK1_8_0_45_HOME=/home/jenkins/jenkins-slave/tools/hudson.model.JDK/jdk1.8.0_45
Setting GRADLE_2_4_RC_2_HOME=/home/jenkins/jenkins-slave/tools/hudson.plugins.gradle.GradleInstallation/Gradle_2.4-rc-2
ERROR: Publisher 'Publish JUnit test result report' failed: No test report files were found. Configuration error?
Setting JDK1_8_0_45_HOME=/home/jenkins/jenkins-slave/tools/hudson.model.JDK/jdk1.8.0_45
Setting GRADLE_2_4_RC_2_HOME=/home/jenkins/jenkins-slave/tools/hudson.plugins.gradle.GradleInstallation/Gradle_2.4-rc-2