You are viewing a plain text version of this content. The canonical link for it is here.
Posted to dev@trafodion.apache.org by st...@esgyn.com on 2016/04/06 13:02:13 UTC
Trafodion master Daily Test Result - 167 - Still Failing
Daily Automated Testing master
Jenkins Job: https://jenkins.esgyn.com/job/Check-Daily-master/167/
Archived Logs: http://traf-testlogs.esgyn.com/Daily-master/167
Bld Downloads: http://traf-builds.esgyn.com
Changes since previous daily build:
[Steve Varnau] [TRAFODION-1816] License info for binary distribution of REST bundle
[selvaganesang] [TRAFODION-1918] Remove auto flush concept in Trafodion
[selvaganesang] [TRAFODION-1918] Remove disabling auto flush concept in Trafodion
Test Job Results:
FAILURE core-regress-core-cdh (1 hr 34 min)
FAILURE core-regress-hive-cdh (22 min)
FAILURE core-regress-privs1-cdh (41 min)
FAILURE phoenix_part1_T2-cdh (11 min)
FAILURE phoenix_part1_T2-hdp (39 min)
FAILURE phoenix_part2_T2-cdh (11 min)
FAILURE phoenix_part2_T2-hdp (38 min)
SUCCESS build-master-debug (25 min)
SUCCESS build-master-release (26 min)
SUCCESS core-regress-charsets-cdh (27 min)
SUCCESS core-regress-charsets-hdp (1 hr 29 min)
SUCCESS core-regress-compGeneral-cdh (1 hr 25 min)
SUCCESS core-regress-compGeneral-hdp (47 min)
SUCCESS core-regress-core-hdp (1 hr 1 min)
SUCCESS core-regress-executor-cdh (49 min)
SUCCESS core-regress-executor-hdp (1 hr 3 min)
SUCCESS core-regress-fullstack2-cdh (1 hr 2 min)
SUCCESS core-regress-fullstack2-hdp (14 min)
SUCCESS core-regress-hive-hdp (41 min)
SUCCESS core-regress-privs1-hdp (1 hr 1 min)
SUCCESS core-regress-privs2-cdh (35 min)
SUCCESS core-regress-privs2-hdp (43 min)
SUCCESS core-regress-qat-cdh (14 min)
SUCCESS core-regress-qat-hdp (1 hr 13 min)
SUCCESS core-regress-seabase-cdh (1 hr 45 min)
SUCCESS core-regress-seabase-hdp (2 hr 7 min)
SUCCESS core-regress-udr-cdh (18 min)
SUCCESS core-regress-udr-hdp (40 min)
SUCCESS jdbc_test-cdh (50 min)
SUCCESS jdbc_test-hdp (57 min)
SUCCESS phoenix_part1_T4-cdh (42 min)
SUCCESS phoenix_part1_T4-hdp (1 hr 26 min)
SUCCESS phoenix_part2_T4-cdh (44 min)
SUCCESS phoenix_part2_T4-hdp (1 hr 4 min)
SUCCESS pyodbc_test-cdh (10 min)
SUCCESS pyodbc_test-hdp (38 min)
Re: Trafodion master Daily Test Result - 177 - Fixed
Posted by Carol Pearson <ca...@gmail.com>.
Woooohooooooo! Congratulations!
Trafodion Dragon does a happy dance!
(Hey, did we ever name the dragon? It's Friday, so I'm indulging in a tiny
bit of frivolity...)
Seriously, this is great news! Let's get a streak going - any way to
record that in the headline? (25 consecutive days of daily build/test
success).
-Carol P.
---------------------------------------------------------------
Email: carol.pearson234@gmail.com
Twitter: @CarolP222
---------------------------------------------------------------
On Fri, Apr 15, 2016 at 4:15 AM, <st...@esgyn.com> wrote:
> Daily Automated Testing master
>
> Jenkins Job: https://jenkins.esgyn.com/job/Check-Daily-master/177/
> Archived Logs: http://traf-testlogs.esgyn.com/Daily-master/177
> Bld Downloads: http://traf-builds.esgyn.com
>
> Changes since previous daily build:
> No changes
>
>
> Test Job Results:
>
> SUCCESS build-master-debug (23 min)
> SUCCESS build-master-release (26 min)
> SUCCESS core-regress-charsets-cdh (28 min)
> SUCCESS core-regress-charsets-hdp (39 min)
> SUCCESS core-regress-compGeneral-cdh (1 hr 21 min)
> SUCCESS core-regress-compGeneral-hdp (1 hr 37 min)
> SUCCESS core-regress-core-cdh (43 min)
> SUCCESS core-regress-core-hdp (59 min)
> SUCCESS core-regress-executor-cdh (1 hr 38 min)
> SUCCESS core-regress-executor-hdp (1 hr 4 min)
> SUCCESS core-regress-fullstack2-cdh (57 min)
> SUCCESS core-regress-fullstack2-hdp (1 hr 3 min)
> SUCCESS core-regress-hive-cdh (36 min)
> SUCCESS core-regress-hive-hdp (41 min)
> SUCCESS core-regress-privs1-cdh (34 min)
> SUCCESS core-regress-privs1-hdp (1 hr 38 min)
> SUCCESS core-regress-privs2-cdh (40 min)
> SUCCESS core-regress-privs2-hdp (46 min)
> SUCCESS core-regress-qat-cdh (16 min)
> SUCCESS core-regress-qat-hdp (1 hr 9 min)
> SUCCESS core-regress-seabase-cdh (1 hr 42 min)
> SUCCESS core-regress-seabase-hdp (1 hr 12 min)
> SUCCESS core-regress-udr-cdh (25 min)
> SUCCESS core-regress-udr-hdp (30 min)
> SUCCESS jdbc_test-cdh (22 min)
> SUCCESS jdbc_test-hdp (55 min)
> SUCCESS phoenix_part1_T2-cdh (1 hr 19 min)
> SUCCESS phoenix_part1_T2-hdp (1 hr 41 min)
> SUCCESS phoenix_part1_T4-cdh (41 min)
> SUCCESS phoenix_part1_T4-hdp (1 hr 26 min)
> SUCCESS phoenix_part2_T2-cdh (1 hr 15 min)
> SUCCESS phoenix_part2_T2-hdp (1 hr 41 min)
> SUCCESS phoenix_part2_T4-cdh (1 hr 6 min)
> SUCCESS phoenix_part2_T4-hdp (1 hr 3 min)
> SUCCESS pyodbc_test-cdh (10 min)
> SUCCESS pyodbc_test-hdp (14 min)
>
>
Trafodion master Daily Test Result - 177 - Fixed
Posted by st...@esgyn.com.
Daily Automated Testing master
Jenkins Job: https://jenkins.esgyn.com/job/Check-Daily-master/177/
Archived Logs: http://traf-testlogs.esgyn.com/Daily-master/177
Bld Downloads: http://traf-builds.esgyn.com
Changes since previous daily build:
No changes
Test Job Results:
SUCCESS build-master-debug (23 min)
SUCCESS build-master-release (26 min)
SUCCESS core-regress-charsets-cdh (28 min)
SUCCESS core-regress-charsets-hdp (39 min)
SUCCESS core-regress-compGeneral-cdh (1 hr 21 min)
SUCCESS core-regress-compGeneral-hdp (1 hr 37 min)
SUCCESS core-regress-core-cdh (43 min)
SUCCESS core-regress-core-hdp (59 min)
SUCCESS core-regress-executor-cdh (1 hr 38 min)
SUCCESS core-regress-executor-hdp (1 hr 4 min)
SUCCESS core-regress-fullstack2-cdh (57 min)
SUCCESS core-regress-fullstack2-hdp (1 hr 3 min)
SUCCESS core-regress-hive-cdh (36 min)
SUCCESS core-regress-hive-hdp (41 min)
SUCCESS core-regress-privs1-cdh (34 min)
SUCCESS core-regress-privs1-hdp (1 hr 38 min)
SUCCESS core-regress-privs2-cdh (40 min)
SUCCESS core-regress-privs2-hdp (46 min)
SUCCESS core-regress-qat-cdh (16 min)
SUCCESS core-regress-qat-hdp (1 hr 9 min)
SUCCESS core-regress-seabase-cdh (1 hr 42 min)
SUCCESS core-regress-seabase-hdp (1 hr 12 min)
SUCCESS core-regress-udr-cdh (25 min)
SUCCESS core-regress-udr-hdp (30 min)
SUCCESS jdbc_test-cdh (22 min)
SUCCESS jdbc_test-hdp (55 min)
SUCCESS phoenix_part1_T2-cdh (1 hr 19 min)
SUCCESS phoenix_part1_T2-hdp (1 hr 41 min)
SUCCESS phoenix_part1_T4-cdh (41 min)
SUCCESS phoenix_part1_T4-hdp (1 hr 26 min)
SUCCESS phoenix_part2_T2-cdh (1 hr 15 min)
SUCCESS phoenix_part2_T2-hdp (1 hr 41 min)
SUCCESS phoenix_part2_T4-cdh (1 hr 6 min)
SUCCESS phoenix_part2_T4-hdp (1 hr 3 min)
SUCCESS pyodbc_test-cdh (10 min)
SUCCESS pyodbc_test-hdp (14 min)
Trafodion master Daily Test Result - 176 - Still Failing
Posted by st...@esgyn.com.
Daily Automated Testing master
Jenkins Job: https://jenkins.esgyn.com/job/Check-Daily-master/176/
Archived Logs: http://traf-testlogs.esgyn.com/Daily-master/176
Bld Downloads: http://traf-builds.esgyn.com
Changes since previous daily build:
No changes
Test Job Results:
FAILURE phoenix_part1_T2-cdh (54 min)
FAILURE phoenix_part1_T2-hdp (1 hr 17 min)
FAILURE phoenix_part2_T2-cdh (50 min)
FAILURE phoenix_part2_T2-hdp (1 hr 17 min)
SUCCESS build-master-debug (20 min)
SUCCESS build-master-release (25 min)
SUCCESS core-regress-charsets-cdh (27 min)
SUCCESS core-regress-charsets-hdp (39 min)
SUCCESS core-regress-compGeneral-cdh (31 min)
SUCCESS core-regress-compGeneral-hdp (45 min)
SUCCESS core-regress-core-cdh (39 min)
SUCCESS core-regress-core-hdp (59 min)
SUCCESS core-regress-executor-cdh (48 min)
SUCCESS core-regress-executor-hdp (1 hr 4 min)
SUCCESS core-regress-fullstack2-cdh (9 min 16 sec)
SUCCESS core-regress-fullstack2-hdp (14 min)
SUCCESS core-regress-hive-cdh (32 min)
SUCCESS core-regress-hive-hdp (41 min)
SUCCESS core-regress-privs1-cdh (34 min)
SUCCESS core-regress-privs1-hdp (45 min)
SUCCESS core-regress-privs2-cdh (36 min)
SUCCESS core-regress-privs2-hdp (45 min)
SUCCESS core-regress-qat-cdh (15 min)
SUCCESS core-regress-qat-hdp (22 min)
SUCCESS core-regress-seabase-cdh (52 min)
SUCCESS core-regress-seabase-hdp (1 hr 23 min)
SUCCESS core-regress-udr-cdh (23 min)
SUCCESS core-regress-udr-hdp (30 min)
SUCCESS jdbc_test-cdh (22 min)
SUCCESS jdbc_test-hdp (32 min)
SUCCESS phoenix_part1_T4-cdh (40 min)
SUCCESS phoenix_part1_T4-hdp (1 hr 2 min)
SUCCESS phoenix_part2_T4-cdh (42 min)
SUCCESS phoenix_part2_T4-hdp (1 hr 2 min)
SUCCESS pyodbc_test-cdh (10 min)
SUCCESS pyodbc_test-hdp (14 min)
RE: Trafodion master Daily Test Result - 175 - Still Failing
Posted by Steve Varnau <st...@esgyn.com>.
FYI, The tweaks Arvind and I did enabled the T2 tests to run and they are
passing. Unfortunately, jenkins is expecting the results in junit format
from maven. So running the T2 tests without maven is confusing the pass/fail
status. We'll take a look at changing the pass/fail detection for those
test jobs.
--Steve
> -----Original Message-----
> From: steve.varnau@esgyn.com [mailto:steve.varnau@esgyn.com]
> Sent: Thursday, April 14, 2016 3:15 AM
> To: dev@trafodion.incubator.apache.org
> Subject: Trafodion master Daily Test Result - 175 - Still Failing
>
> Daily Automated Testing master
>
> Jenkins Job: https://jenkins.esgyn.com/job/Check-Daily-master/175/
> Archived Logs: http://traf-testlogs.esgyn.com/Daily-master/175
> Bld Downloads: http://traf-builds.esgyn.com
>
> Changes since previous daily build:
> [Steve Varnau] [TRAFODION-1924] Add license/notice files to jdbc driver
> jars
>
> [Steve Varnau] [TRAFODION-1929] Set correct working dir for phx dependency
> builds
>
>
>
> Test Job Results:
>
> FAILURE phoenix_part1_T2-cdh (1 hr 6 min)
> FAILURE phoenix_part1_T2-hdp (51 min)
> FAILURE phoenix_part2_T2-cdh (1 hr 13 min)
> FAILURE phoenix_part2_T2-hdp (50 min)
> SUCCESS build-master-debug (22 min)
> SUCCESS build-master-release (29 min)
> SUCCESS core-regress-charsets-cdh (43 min)
> SUCCESS core-regress-charsets-hdp (40 min)
> SUCCESS core-regress-compGeneral-cdh (59 min)
> SUCCESS core-regress-compGeneral-hdp (1 hr 14 min)
> SUCCESS core-regress-core-cdh (52 min)
> SUCCESS core-regress-core-hdp (1 hr 2 min)
> SUCCESS core-regress-executor-cdh (1 hr 18 min)
> SUCCESS core-regress-executor-hdp (1 hr 9 min)
> SUCCESS core-regress-fullstack2-cdh (38 min)
> SUCCESS core-regress-fullstack2-hdp (13 min)
> SUCCESS core-regress-hive-cdh (1 hr 4 min)
> SUCCESS core-regress-hive-hdp (41 min)
> SUCCESS core-regress-privs1-cdh (1 hr 3 min)
> SUCCESS core-regress-privs1-hdp (1 hr 18 min)
> SUCCESS core-regress-privs2-cdh (36 min)
> SUCCESS core-regress-privs2-hdp (1 hr 15 min)
> SUCCESS core-regress-qat-cdh (43 min)
> SUCCESS core-regress-qat-hdp (49 min)
> SUCCESS core-regress-seabase-cdh (1 hr 20 min)
> SUCCESS core-regress-seabase-hdp (1 hr 42 min)
> SUCCESS core-regress-udr-cdh (53 min)
> SUCCESS core-regress-udr-hdp (34 min)
> SUCCESS jdbc_test-cdh (1 hr 8 min)
> SUCCESS jdbc_test-hdp (51 min)
> SUCCESS phoenix_part1_T4-cdh (1 hr 0 min)
> SUCCESS phoenix_part1_T4-hdp (1 hr 25 min)
> SUCCESS phoenix_part2_T4-cdh (1 hr 4 min)
> SUCCESS phoenix_part2_T4-hdp (1 hr 47 min)
> SUCCESS pyodbc_test-cdh (28 min)
> SUCCESS pyodbc_test-hdp (1 hr 0 min)
Trafodion master Daily Test Result - 175 - Still Failing
Posted by st...@esgyn.com.
Daily Automated Testing master
Jenkins Job: https://jenkins.esgyn.com/job/Check-Daily-master/175/
Archived Logs: http://traf-testlogs.esgyn.com/Daily-master/175
Bld Downloads: http://traf-builds.esgyn.com
Changes since previous daily build:
[Steve Varnau] [TRAFODION-1924] Add license/notice files to jdbc driver jars
[Steve Varnau] [TRAFODION-1929] Set correct working dir for phx dependency builds
Test Job Results:
FAILURE phoenix_part1_T2-cdh (1 hr 6 min)
FAILURE phoenix_part1_T2-hdp (51 min)
FAILURE phoenix_part2_T2-cdh (1 hr 13 min)
FAILURE phoenix_part2_T2-hdp (50 min)
SUCCESS build-master-debug (22 min)
SUCCESS build-master-release (29 min)
SUCCESS core-regress-charsets-cdh (43 min)
SUCCESS core-regress-charsets-hdp (40 min)
SUCCESS core-regress-compGeneral-cdh (59 min)
SUCCESS core-regress-compGeneral-hdp (1 hr 14 min)
SUCCESS core-regress-core-cdh (52 min)
SUCCESS core-regress-core-hdp (1 hr 2 min)
SUCCESS core-regress-executor-cdh (1 hr 18 min)
SUCCESS core-regress-executor-hdp (1 hr 9 min)
SUCCESS core-regress-fullstack2-cdh (38 min)
SUCCESS core-regress-fullstack2-hdp (13 min)
SUCCESS core-regress-hive-cdh (1 hr 4 min)
SUCCESS core-regress-hive-hdp (41 min)
SUCCESS core-regress-privs1-cdh (1 hr 3 min)
SUCCESS core-regress-privs1-hdp (1 hr 18 min)
SUCCESS core-regress-privs2-cdh (36 min)
SUCCESS core-regress-privs2-hdp (1 hr 15 min)
SUCCESS core-regress-qat-cdh (43 min)
SUCCESS core-regress-qat-hdp (49 min)
SUCCESS core-regress-seabase-cdh (1 hr 20 min)
SUCCESS core-regress-seabase-hdp (1 hr 42 min)
SUCCESS core-regress-udr-cdh (53 min)
SUCCESS core-regress-udr-hdp (34 min)
SUCCESS jdbc_test-cdh (1 hr 8 min)
SUCCESS jdbc_test-hdp (51 min)
SUCCESS phoenix_part1_T4-cdh (1 hr 0 min)
SUCCESS phoenix_part1_T4-hdp (1 hr 25 min)
SUCCESS phoenix_part2_T4-cdh (1 hr 4 min)
SUCCESS phoenix_part2_T4-hdp (1 hr 47 min)
SUCCESS pyodbc_test-cdh (28 min)
SUCCESS pyodbc_test-hdp (1 hr 0 min)
Trafodion master Daily Test Result - 174 - Still Failing
Posted by st...@esgyn.com.
Daily Automated Testing master
Jenkins Job: https://jenkins.esgyn.com/job/Check-Daily-master/174/
Archived Logs: http://traf-testlogs.esgyn.com/Daily-master/174
Bld Downloads: http://traf-builds.esgyn.com
Changes since previous daily build:
[ovis_poly] [TRAFODION-1912] rework to fix hive regress test failure
[ovis_poly] [TRAFODION-1912] git add forgot again
[narain.arvind] Phoenix T2 tests failing with CDH
[narain.arvind] [TRAFODION-1930] Phoenix T2 tests failing with HDP during build phase
Test Job Results:
FAILURE build-master-release (22 min)
FAILURE core-regress-charsets-cdh (24 min)
FAILURE core-regress-charsets-hdp (21 min)
FAILURE core-regress-compGeneral-cdh (23 min)
FAILURE core-regress-compGeneral-hdp (1 min 32 sec)
FAILURE core-regress-core-cdh (1 min 37 sec)
FAILURE core-regress-core-hdp (24 min)
FAILURE core-regress-executor-cdh (24 min)
FAILURE core-regress-executor-hdp (1 min 40 sec)
FAILURE core-regress-fullstack2-cdh (1 min 34 sec)
FAILURE core-regress-fullstack2-hdp (1 min 23 sec)
FAILURE core-regress-hive-cdh (1 min 34 sec)
FAILURE core-regress-hive-hdp (1 min 26 sec)
FAILURE core-regress-privs1-cdh (1 min 34 sec)
FAILURE core-regress-privs1-hdp (1 min 34 sec)
FAILURE core-regress-privs2-cdh (23 min)
FAILURE core-regress-privs2-hdp (1 min 29 sec)
FAILURE core-regress-qat-cdh (24 min)
FAILURE core-regress-qat-hdp (23 min)
FAILURE core-regress-seabase-cdh (1 min 37 sec)
FAILURE core-regress-seabase-hdp (23 min)
FAILURE core-regress-udr-cdh (1 min 36 sec)
FAILURE core-regress-udr-hdp (1 min 35 sec)
FAILURE phoenix_part1_T2-cdh (53 min)
FAILURE phoenix_part1_T2-hdp (58 min)
FAILURE phoenix_part2_T2-cdh (29 min)
FAILURE phoenix_part2_T2-hdp (59 min)
SUCCESS build-master-debug (22 min)
SUCCESS jdbc_test-cdh (1 hr 8 min)
SUCCESS jdbc_test-hdp (51 min)
SUCCESS phoenix_part1_T4-cdh (1 hr 0 min)
SUCCESS phoenix_part1_T4-hdp (1 hr 25 min)
SUCCESS phoenix_part2_T4-cdh (1 hr 4 min)
SUCCESS phoenix_part2_T4-hdp (1 hr 47 min)
SUCCESS pyodbc_test-cdh (28 min)
SUCCESS pyodbc_test-hdp (1 hr 0 min)
Trafodion master Daily Test Result - 173 - Still Failing
Posted by st...@esgyn.com.
Daily Automated Testing master
Jenkins Job: https://jenkins.esgyn.com/job/Check-Daily-master/173/
Archived Logs: http://traf-testlogs.esgyn.com/Daily-master/173
Bld Downloads: http://traf-builds.esgyn.com
Changes since previous daily build:
[centos] commit #1
[selvaganesang] [TRAFODION-1917] Trafodion fails to build HDP related jar files
[centos] Various fixes
[venkat.muthuswamy] test pom.xml.apache repo change
[centos] changed maven repos location
[gtapper] Fixed a problem that prevented the built document from being published.
[centos] added enhanced check to handle default values copy
[selvaganesang] [TRAFODION-1928] Trafodion daily build regression in CDH distro fails in
Test Job Results:
FAILURE core-regress-hive-cdh (1 hr 4 min)
FAILURE core-regress-hive-hdp (42 min)
FAILURE phoenix_part1_T2-cdh (12 min)
FAILURE phoenix_part1_T2-hdp (1 hr 7 min)
FAILURE phoenix_part2_T2-cdh (11 min)
FAILURE phoenix_part2_T2-hdp (15 min)
SUCCESS build-master-debug (22 min)
SUCCESS build-master-release (29 min)
SUCCESS core-regress-charsets-cdh (55 min)
SUCCESS core-regress-charsets-hdp (39 min)
SUCCESS core-regress-compGeneral-cdh (31 min)
SUCCESS core-regress-compGeneral-hdp (46 min)
SUCCESS core-regress-core-cdh (1 hr 10 min)
SUCCESS core-regress-core-hdp (1 hr 29 min)
SUCCESS core-regress-executor-cdh (1 hr 17 min)
SUCCESS core-regress-executor-hdp (1 hr 35 min)
SUCCESS core-regress-fullstack2-cdh (9 min 59 sec)
SUCCESS core-regress-fullstack2-hdp (41 min)
SUCCESS core-regress-privs1-cdh (1 hr 6 min)
SUCCESS core-regress-privs1-hdp (1 hr 18 min)
SUCCESS core-regress-privs2-cdh (1 hr 3 min)
SUCCESS core-regress-privs2-hdp (45 min)
SUCCESS core-regress-qat-cdh (15 min)
SUCCESS core-regress-qat-hdp (21 min)
SUCCESS core-regress-seabase-cdh (52 min)
SUCCESS core-regress-seabase-hdp (1 hr 13 min)
SUCCESS core-regress-udr-cdh (24 min)
SUCCESS core-regress-udr-hdp (31 min)
SUCCESS jdbc_test-cdh (1 hr 15 min)
SUCCESS jdbc_test-hdp (41 min)
SUCCESS phoenix_part1_T4-cdh (1 hr 34 min)
SUCCESS phoenix_part1_T4-hdp (1 hr 55 min)
SUCCESS phoenix_part2_T4-cdh (40 min)
SUCCESS phoenix_part2_T4-hdp (1 hr 54 min)
SUCCESS pyodbc_test-cdh (10 min)
SUCCESS pyodbc_test-hdp (1 hr 4 min)
Trafodion master Daily Test Result - 172 - Still Failing
Posted by st...@esgyn.com.
Daily Automated Testing master
Jenkins Job: https://jenkins.esgyn.com/job/Check-Daily-master/172/
Archived Logs: http://traf-testlogs.esgyn.com/Daily-master/172
Bld Downloads: http://traf-builds.esgyn.com
Changes since previous daily build:
No changes
Test Job Results:
FAILURE core-regress-core-cdh (41 min)
FAILURE core-regress-hive-cdh (25 min)
FAILURE core-regress-hive-hdp (39 min)
FAILURE core-regress-privs1-cdh (33 min)
FAILURE phoenix_part1_T2-cdh (38 min)
FAILURE phoenix_part1_T2-hdp (15 min)
FAILURE phoenix_part2_T2-cdh (36 min)
FAILURE phoenix_part2_T2-hdp (41 min)
SUCCESS build-master-debug (23 min)
SUCCESS build-master-release (29 min)
SUCCESS core-regress-charsets-cdh (28 min)
SUCCESS core-regress-charsets-hdp (1 hr 6 min)
SUCCESS core-regress-compGeneral-cdh (31 min)
SUCCESS core-regress-compGeneral-hdp (55 min)
SUCCESS core-regress-core-hdp (1 hr 28 min)
SUCCESS core-regress-executor-cdh (48 min)
SUCCESS core-regress-executor-hdp (1 hr 2 min)
SUCCESS core-regress-fullstack2-cdh (37 min)
SUCCESS core-regress-fullstack2-hdp (14 min)
SUCCESS core-regress-privs1-hdp (1 hr 19 min)
SUCCESS core-regress-privs2-cdh (1 hr 0 min)
SUCCESS core-regress-privs2-hdp (45 min)
SUCCESS core-regress-qat-cdh (15 min)
SUCCESS core-regress-qat-hdp (50 min)
SUCCESS core-regress-seabase-cdh (1 hr 18 min)
SUCCESS core-regress-seabase-hdp (1 hr 11 min)
SUCCESS core-regress-udr-cdh (18 min)
SUCCESS core-regress-udr-hdp (55 min)
SUCCESS jdbc_test-cdh (22 min)
SUCCESS jdbc_test-hdp (31 min)
SUCCESS phoenix_part1_T4-cdh (1 hr 9 min)
SUCCESS phoenix_part1_T4-hdp (1 hr 12 min)
SUCCESS phoenix_part2_T4-cdh (1 hr 11 min)
SUCCESS phoenix_part2_T4-hdp (1 hr 4 min)
SUCCESS pyodbc_test-cdh (36 min)
SUCCESS pyodbc_test-hdp (13 min)
Trafodion master Daily Test Result - 171 - Still Failing
Posted by st...@esgyn.com.
Daily Automated Testing master
Jenkins Job: https://jenkins.esgyn.com/job/Check-Daily-master/171/
Archived Logs: http://traf-testlogs.esgyn.com/Daily-master/171
Bld Downloads: http://traf-builds.esgyn.com
Changes since previous daily build:
[ovis_poly] [TRAFODION-1912]support automatic convert DOS format during bulkload
[ovis_poly] a bit performance improvement, but sorry seems forget another change..
[ovis_poly] a refector to improve performance, this api is in hot path
[ovis_poly] [TRAFODION-1912] update according to review comments use TDB flag
[ovis_poly] [TRAFODION-1912] not replace \r with space, but move the return pointer
[ovis_poly] [TRAFODION-1912] add more regression test cases add test for numeric the
Test Job Results:
FAILURE core-regress-core-cdh (1 hr 31 min)
FAILURE core-regress-hive-cdh (1 hr 17 min)
FAILURE core-regress-hive-hdp (40 min)
FAILURE core-regress-privs1-cdh (33 min)
FAILURE phoenix_part1_T2-cdh (36 min)
FAILURE phoenix_part1_T2-hdp (38 min)
FAILURE phoenix_part2_T2-cdh (36 min)
FAILURE phoenix_part2_T2-hdp (14 min)
SUCCESS build-master-debug (24 min)
SUCCESS build-master-release (27 min)
SUCCESS core-regress-charsets-cdh (42 min)
SUCCESS core-regress-charsets-hdp (38 min)
SUCCESS core-regress-compGeneral-cdh (47 min)
SUCCESS core-regress-compGeneral-hdp (1 hr 37 min)
SUCCESS core-regress-core-hdp (1 hr 48 min)
SUCCESS core-regress-executor-cdh (1 hr 39 min)
SUCCESS core-regress-executor-hdp (1 hr 4 min)
SUCCESS core-regress-fullstack2-cdh (8 min 54 sec)
SUCCESS core-regress-fullstack2-hdp (14 min)
SUCCESS core-regress-privs1-hdp (1 hr 0 min)
SUCCESS core-regress-privs2-cdh (34 min)
SUCCESS core-regress-privs2-hdp (1 hr 36 min)
SUCCESS core-regress-qat-cdh (15 min)
SUCCESS core-regress-qat-hdp (1 hr 10 min)
SUCCESS core-regress-seabase-cdh (1 hr 42 min)
SUCCESS core-regress-seabase-hdp (1 hr 26 min)
SUCCESS core-regress-udr-cdh (19 min)
SUCCESS core-regress-udr-hdp (26 min)
SUCCESS jdbc_test-cdh (22 min)
SUCCESS jdbc_test-hdp (56 min)
SUCCESS phoenix_part1_T4-cdh (1 hr 5 min)
SUCCESS phoenix_part1_T4-hdp (1 hr 2 min)
SUCCESS phoenix_part2_T4-cdh (43 min)
SUCCESS phoenix_part2_T4-hdp (1 hr 27 min)
SUCCESS pyodbc_test-cdh (35 min)
SUCCESS pyodbc_test-hdp (15 min)
Trafodion master Daily Test Result - 170 - Still Failing
Posted by st...@esgyn.com.
Daily Automated Testing master
Jenkins Job: https://jenkins.esgyn.com/job/Check-Daily-master/170/
Archived Logs: http://traf-testlogs.esgyn.com/Daily-master/170
Bld Downloads: http://traf-builds.esgyn.com
Changes since previous daily build:
[gtapper] Backup checkin. The basic edit of the guide has been done. Need to
[gtapper] Backup checkin
[gtapper] Backup checkin.
[gtapper] Added new carousel to front page with contributor logos.
[dbirdsall] Added a blank character to tickle github push
Test Job Results:
FAILURE core-regress-core-cdh (1 hr 10 min)
FAILURE core-regress-hive-cdh (53 min)
FAILURE core-regress-privs1-cdh (35 min)
FAILURE phoenix_part1_T2-cdh (11 min)
FAILURE phoenix_part1_T2-hdp (15 min)
FAILURE phoenix_part2_T2-cdh (39 min)
FAILURE phoenix_part2_T2-hdp (42 min)
SUCCESS build-master-debug (24 min)
SUCCESS build-master-release (28 min)
SUCCESS core-regress-charsets-cdh (27 min)
SUCCESS core-regress-charsets-hdp (48 min)
SUCCESS core-regress-compGeneral-cdh (59 min)
SUCCESS core-regress-compGeneral-hdp (47 min)
SUCCESS core-regress-core-hdp (59 min)
SUCCESS core-regress-executor-cdh (49 min)
SUCCESS core-regress-executor-hdp (1 hr 31 min)
SUCCESS core-regress-fullstack2-cdh (9 min 53 sec)
SUCCESS core-regress-fullstack2-hdp (44 min)
SUCCESS core-regress-hive-hdp (42 min)
SUCCESS core-regress-privs1-hdp (50 min)
SUCCESS core-regress-privs2-cdh (34 min)
SUCCESS core-regress-privs2-hdp (44 min)
SUCCESS core-regress-qat-cdh (14 min)
SUCCESS core-regress-qat-hdp (51 min)
SUCCESS core-regress-seabase-cdh (1 hr 20 min)
SUCCESS core-regress-seabase-hdp (1 hr 14 min)
SUCCESS core-regress-udr-cdh (24 min)
SUCCESS core-regress-udr-hdp (54 min)
SUCCESS jdbc_test-cdh (48 min)
SUCCESS jdbc_test-hdp (33 min)
SUCCESS phoenix_part1_T4-cdh (42 min)
SUCCESS phoenix_part1_T4-hdp (1 hr 3 min)
SUCCESS phoenix_part2_T4-cdh (1 hr 7 min)
SUCCESS phoenix_part2_T4-hdp (1 hr 30 min)
SUCCESS pyodbc_test-cdh (10 min)
SUCCESS pyodbc_test-hdp (37 min)
Trafodion master Daily Test Result - 169 - Still Failing
Posted by st...@esgyn.com.
Daily Automated Testing master
Jenkins Job: https://jenkins.esgyn.com/job/Check-Daily-master/169/
Archived Logs: http://traf-testlogs.esgyn.com/Daily-master/169
Bld Downloads: http://traf-builds.esgyn.com
Changes since previous daily build:
No changes
Test Job Results:
FAILURE core-regress-core-cdh (42 min)
FAILURE core-regress-hive-cdh (26 min)
FAILURE core-regress-privs1-cdh (34 min)
FAILURE phoenix_part1_T2-cdh (36 min)
FAILURE phoenix_part1_T2-hdp (14 min)
FAILURE phoenix_part2_T2-cdh (12 min)
FAILURE phoenix_part2_T2-hdp (38 min)
SUCCESS build-master-debug (25 min)
SUCCESS build-master-release (26 min)
SUCCESS core-regress-charsets-cdh (27 min)
SUCCESS core-regress-charsets-hdp (1 hr 32 min)
SUCCESS core-regress-compGeneral-cdh (1 hr 20 min)
SUCCESS core-regress-compGeneral-hdp (57 min)
SUCCESS core-regress-core-hdp (1 hr 49 min)
SUCCESS core-regress-executor-cdh (49 min)
SUCCESS core-regress-executor-hdp (1 hr 3 min)
SUCCESS core-regress-fullstack2-cdh (23 min)
SUCCESS core-regress-fullstack2-hdp (25 min)
SUCCESS core-regress-hive-hdp (51 min)
SUCCESS core-regress-privs1-hdp (1 hr 40 min)
SUCCESS core-regress-privs2-cdh (51 min)
SUCCESS core-regress-privs2-hdp (45 min)
SUCCESS core-regress-qat-cdh (14 min)
SUCCESS core-regress-qat-hdp (20 min)
SUCCESS core-regress-seabase-cdh (1 hr 43 min)
SUCCESS core-regress-seabase-hdp (2 hr 6 min)
SUCCESS core-regress-udr-cdh (1 hr 8 min)
SUCCESS core-regress-udr-hdp (27 min)
SUCCESS jdbc_test-cdh (47 min)
SUCCESS jdbc_test-hdp (58 min)
SUCCESS phoenix_part1_T4-cdh (1 hr 5 min)
SUCCESS phoenix_part1_T4-hdp (1 hr 1 min)
SUCCESS phoenix_part2_T4-cdh (1 hr 7 min)
SUCCESS phoenix_part2_T4-hdp (1 hr 3 min)
SUCCESS pyodbc_test-cdh (34 min)
SUCCESS pyodbc_test-hdp (39 min)
RE: Trafodion master Daily Test Result - 168 - Still Failing
Posted by Selva Govindarajan <se...@esgyn.com>.
Steve,
The hive test failures are already analyzed. I am waiting for the community
input about the change in sqenvcom.sh. Please feel free to make the change
if it looks appropriate for you. The change is
The line 351 is added to sqenvcom.sh.
347 # directories with jar files and list of jar files
348 # (could try to reduce the number of jars in the classpath)
349 export HADOOP_JAR_DIRS="/usr/lib/hadoop
350 /usr/lib/hadoop/lib
351 /usr/lib/hadoop-0.20-mapreduce"
Selva
-----Original Message-----
From: steve.varnau@esgyn.com [mailto:steve.varnau@esgyn.com]
Sent: Thursday, April 7, 2016 4:03 AM
To: dev@trafodion.incubator.apache.org
Subject: Trafodion master Daily Test Result - 168 - Still Failing
Daily Automated Testing master
Jenkins Job: https://jenkins.esgyn.com/job/Check-Daily-master/168/
Archived Logs: http://traf-testlogs.esgyn.com/Daily-master/168
Bld Downloads: http://traf-builds.esgyn.com
Changes since previous daily build:
[amanda] Fixing merge error
[amanda] [[ TRAFODION 1919 ]] Needs -u -p for config.sh
[narain.arvind] [TRAFODION-1473] T4 support for new sqltypecode BLOB(-602)
and
Test Job Results:
FAILURE core-regress-core-cdh (40 min)
FAILURE core-regress-hive-cdh (55 min)
FAILURE core-regress-privs1-cdh (36 min) FAILURE jdbc_test-hdp (1 hr 22 min)
FAILURE phoenix_part1_T2-cdh (11 min) FAILURE phoenix_part1_T2-hdp (1 hr 6
min) FAILURE phoenix_part2_T2-cdh (10 min) FAILURE phoenix_part2_T2-hdp (16
min) SUCCESS build-master-debug (22 min) SUCCESS build-master-release (29
min) SUCCESS core-regress-charsets-cdh (56 min) SUCCESS
core-regress-charsets-hdp (1 hr 11 min) SUCCESS core-regress-compGeneral-cdh
(1 hr 0 min) SUCCESS core-regress-compGeneral-hdp (46 min) SUCCESS
core-regress-core-hdp (1 hr 28 min) SUCCESS core-regress-executor-cdh (47
min) SUCCESS core-regress-executor-hdp (1 hr 3 min) SUCCESS
core-regress-fullstack2-cdh (37 min) SUCCESS core-regress-fullstack2-hdp (41
min) SUCCESS core-regress-hive-hdp (1 hr 10 min) SUCCESS
core-regress-privs1-hdp (46 min) SUCCESS core-regress-privs2-cdh (1 hr 3
min) SUCCESS core-regress-privs2-hdp (46 min) SUCCESS core-regress-qat-cdh
(43 min) SUCCESS core-regress-qat-hdp (48 min) SUCCESS
core-regress-seabase-cdh (52 min) SUCCESS core-regress-seabase-hdp (1 hr 45
min) SUCCESS core-regress-udr-cdh (19 min) SUCCESS core-regress-udr-hdp (27
min) SUCCESS jdbc_test-cdh (29 min) SUCCESS phoenix_part1_T4-cdh (47 min)
SUCCESS phoenix_part1_T4-hdp (1 hr 9 min) SUCCESS phoenix_part2_T4-cdh (1 hr
34 min) SUCCESS phoenix_part2_T4-hdp (1 hr 1 min) SUCCESS pyodbc_test-cdh
(10 min) SUCCESS pyodbc_test-hdp (15 min)
Trafodion master Daily Test Result - 168 - Still Failing
Posted by st...@esgyn.com.
Daily Automated Testing master
Jenkins Job: https://jenkins.esgyn.com/job/Check-Daily-master/168/
Archived Logs: http://traf-testlogs.esgyn.com/Daily-master/168
Bld Downloads: http://traf-builds.esgyn.com
Changes since previous daily build:
[amanda] Fixing merge error
[amanda] [[ TRAFODION 1919 ]] Needs -u -p for config.sh
[narain.arvind] [TRAFODION-1473] T4 support for new sqltypecode BLOB(-602) and
Test Job Results:
FAILURE core-regress-core-cdh (40 min)
FAILURE core-regress-hive-cdh (55 min)
FAILURE core-regress-privs1-cdh (36 min)
FAILURE jdbc_test-hdp (1 hr 22 min)
FAILURE phoenix_part1_T2-cdh (11 min)
FAILURE phoenix_part1_T2-hdp (1 hr 6 min)
FAILURE phoenix_part2_T2-cdh (10 min)
FAILURE phoenix_part2_T2-hdp (16 min)
SUCCESS build-master-debug (22 min)
SUCCESS build-master-release (29 min)
SUCCESS core-regress-charsets-cdh (56 min)
SUCCESS core-regress-charsets-hdp (1 hr 11 min)
SUCCESS core-regress-compGeneral-cdh (1 hr 0 min)
SUCCESS core-regress-compGeneral-hdp (46 min)
SUCCESS core-regress-core-hdp (1 hr 28 min)
SUCCESS core-regress-executor-cdh (47 min)
SUCCESS core-regress-executor-hdp (1 hr 3 min)
SUCCESS core-regress-fullstack2-cdh (37 min)
SUCCESS core-regress-fullstack2-hdp (41 min)
SUCCESS core-regress-hive-hdp (1 hr 10 min)
SUCCESS core-regress-privs1-hdp (46 min)
SUCCESS core-regress-privs2-cdh (1 hr 3 min)
SUCCESS core-regress-privs2-hdp (46 min)
SUCCESS core-regress-qat-cdh (43 min)
SUCCESS core-regress-qat-hdp (48 min)
SUCCESS core-regress-seabase-cdh (52 min)
SUCCESS core-regress-seabase-hdp (1 hr 45 min)
SUCCESS core-regress-udr-cdh (19 min)
SUCCESS core-regress-udr-hdp (27 min)
SUCCESS jdbc_test-cdh (29 min)
SUCCESS phoenix_part1_T4-cdh (47 min)
SUCCESS phoenix_part1_T4-hdp (1 hr 9 min)
SUCCESS phoenix_part2_T4-cdh (1 hr 34 min)
SUCCESS phoenix_part2_T4-hdp (1 hr 1 min)
SUCCESS pyodbc_test-cdh (10 min)
SUCCESS pyodbc_test-hdp (15 min)
RE: Trafodion master Daily Test Result - 167 - Still Failing
Posted by Arvind <na...@gmail.com>.
Yes Sandhya - I'm taking a look at the phoenix test failures.
Regards
Arvind
-----Original Message-----
From: Sandhya Sundaresan [mailto:sandhya.sundaresan@esgyn.com]
Sent: Wednesday, April 6, 2016 7:48 AM
To: dev@trafodion.incubator.apache.org
Subject: RE: Trafodion master Daily Test Result - 167 - Still Failing
The executor suite passed after weeks but the problematic test (TEST106) has been commented out until the new hang for "drop table" is fixed just so the rest of the tests in the suite get run. The old hang seems to be fixed now.
Steve, looks like the Hive metadata is corrupt or not setup properly on the VMs where the core and hive suites are run.
Arvind, I suppose you're following up on the phoenix failures ?
Sandhya
-----Original Message-----
From: steve.varnau@esgyn.com [mailto:steve.varnau@esgyn.com]
Sent: Wednesday, April 6, 2016 4:02 AM
To: dev@trafodion.incubator.apache.org
Subject: Trafodion master Daily Test Result - 167 - Still Failing
Daily Automated Testing master
Jenkins Job: https://jenkins.esgyn.com/job/Check-Daily-master/167/
Archived Logs: http://traf-testlogs.esgyn.com/Daily-master/167
Bld Downloads: http://traf-builds.esgyn.com
Changes since previous daily build:
[Steve Varnau] [TRAFODION-1816] License info for binary distribution of REST bundle
[selvaganesang] [TRAFODION-1918] Remove auto flush concept in Trafodion
[selvaganesang] [TRAFODION-1918] Remove disabling auto flush concept in Trafodion
Test Job Results:
FAILURE core-regress-core-cdh (1 hr 34 min) FAILURE core-regress-hive-cdh
(22 min) FAILURE core-regress-privs1-cdh (41 min) FAILURE phoenix_part1_T2-cdh (11 min) FAILURE phoenix_part1_T2-hdp (39 min) FAILURE phoenix_part2_T2-cdh (11 min) FAILURE phoenix_part2_T2-hdp (38 min) SUCCESS build-master-debug (25 min) SUCCESS build-master-release (26 min) SUCCESS core-regress-charsets-cdh (27 min) SUCCESS core-regress-charsets-hdp (1 hr
29 min) SUCCESS core-regress-compGeneral-cdh (1 hr 25 min) SUCCESS core-regress-compGeneral-hdp (47 min) SUCCESS core-regress-core-hdp (1 hr 1
min) SUCCESS core-regress-executor-cdh (49 min) SUCCESS core-regress-executor-hdp (1 hr 3 min) SUCCESS core-regress-fullstack2-cdh
(1 hr 2 min) SUCCESS core-regress-fullstack2-hdp (14 min) SUCCESS core-regress-hive-hdp (41 min) SUCCESS core-regress-privs1-hdp (1 hr 1 min) SUCCESS core-regress-privs2-cdh (35 min) SUCCESS core-regress-privs2-hdp (43
min) SUCCESS core-regress-qat-cdh (14 min) SUCCESS core-regress-qat-hdp (1 hr 13 min) SUCCESS core-regress-seabase-cdh (1 hr 45 min) SUCCESS core-regress-seabase-hdp (2 hr 7 min) SUCCESS core-regress-udr-cdh (18 min) SUCCESS core-regress-udr-hdp (40 min) SUCCESS jdbc_test-cdh (50 min) SUCCESS jdbc_test-hdp (57 min) SUCCESS phoenix_part1_T4-cdh (42 min) SUCCESS phoenix_part1_T4-hdp (1 hr 26 min) SUCCESS phoenix_part2_T4-cdh (44 min) SUCCESS phoenix_part2_T4-hdp (1 hr 4 min) SUCCESS pyodbc_test-cdh (10 min) SUCCESS pyodbc_test-hdp (38 min)
RE: Trafodion master Daily Test Result - 167 - Still Failing
Posted by Selva Govindarajan <se...@esgyn.com>.
I can look into it.
Selva
-----Original Message-----
From: Steve Varnau [mailto:steve.varnau@esgyn.com]
Sent: Wednesday, April 6, 2016 9:55 AM
To: dev@trafodion.incubator.apache.org
Subject: RE: Trafodion master Daily Test Result - 167 - Still Failing
Yes. Before we hung trying to load the tpc-ds data into hive. That script
seems to be running fine now, and the test suite actually runs, though all
the hive related tests fail. So something else is not right.
Test automation saves the hbase logs, but not hive logs, so I think we will
need to spin up a vm to debug it. Who would like a crack at this one?
--Steve
> -----Original Message-----
> From: Selva Govindarajan [mailto:selva.govindarajan@esgyn.com]
> Sent: Wednesday, April 6, 2016 9:19 AM
> To: dev@trafodion.incubator.apache.org
> Subject: RE: Trafodion master Daily Test Result - 167 - Still Failing
>
> I think it looks like a class path issue for hive tests in CDH. Need
> to be analyzed in CDH vm.
>
> Selva
>
> -----Original Message-----
> From: Sandhya Sundaresan [mailto:sandhya.sundaresan@esgyn.com]
> Sent: Wednesday, April 6, 2016 7:48 AM
> To: dev@trafodion.incubator.apache.org
> Subject: RE: Trafodion master Daily Test Result - 167 - Still Failing
>
> The executor suite passed after weeks but the problematic test
> (TEST106) has been commented out until the new hang for "drop table"
> is fixed just so the rest of the tests in the suite get run. The old
> hang seems to be fixed now.
>
> Steve, looks like the Hive metadata is corrupt or not setup properly
> on the VMs where the core and hive suites are run.
>
> Arvind, I suppose you're following up on the phoenix failures ?
>
> Sandhya
>
> -----Original Message-----
> From: steve.varnau@esgyn.com [mailto:steve.varnau@esgyn.com]
> Sent: Wednesday, April 6, 2016 4:02 AM
> To: dev@trafodion.incubator.apache.org
> Subject: Trafodion master Daily Test Result - 167 - Still Failing
>
> Daily Automated Testing master
>
> Jenkins Job: https://jenkins.esgyn.com/job/Check-Daily-master/167/
> Archived Logs: http://traf-testlogs.esgyn.com/Daily-master/167
> Bld Downloads: http://traf-builds.esgyn.com
>
> Changes since previous daily build:
> [Steve Varnau] [TRAFODION-1816] License info for binary distribution
> of REST bundle
>
> [selvaganesang] [TRAFODION-1918] Remove auto flush concept in
> Trafodion
>
> [selvaganesang] [TRAFODION-1918] Remove disabling auto flush concept
> in Trafodion
>
>
>
> Test Job Results:
>
> FAILURE core-regress-core-cdh (1 hr 34 min) FAILURE
> core-regress-hive-cdh
> (22 min) FAILURE core-regress-privs1-cdh (41 min) FAILURE
> phoenix_part1_T2-cdh (11 min) FAILURE phoenix_part1_T2-hdp (39 min)
> FAILURE phoenix_part2_T2-cdh (11 min) FAILURE phoenix_part2_T2-hdp (38
> min) SUCCESS build-master-debug (25 min) SUCCESS build-master-release
> (26 min) SUCCESS core-regress-charsets-cdh (27 min) SUCCESS
> core-regress-charsets-hdp (1 hr
> 29 min) SUCCESS core-regress-compGeneral-cdh (1 hr 25 min) SUCCESS
> core-regress-compGeneral-hdp (47 min) SUCCESS core-regress-core-hdp (1
> hr
> 1
> min) SUCCESS core-regress-executor-cdh (49 min) SUCCESS
> core-regress-executor-hdp (1 hr 3 min) SUCCESS
> core-regress-fullstack2-cdh
> (1 hr 2 min) SUCCESS core-regress-fullstack2-hdp (14 min) SUCCESS
> core-regress-hive-hdp (41 min) SUCCESS core-regress-privs1-hdp (1 hr 1
> min)
> SUCCESS core-regress-privs2-cdh (35 min) SUCCESS
> core-regress-privs2-hdp
> (43
> min) SUCCESS core-regress-qat-cdh (14 min) SUCCESS
> core-regress-qat-hdp (1 hr 13 min) SUCCESS core-regress-seabase-cdh (1
> hr 45 min) SUCCESS core-regress-seabase-hdp (2 hr 7 min) SUCCESS
> core-regress-udr-cdh (18
> min)
> SUCCESS core-regress-udr-hdp (40 min) SUCCESS jdbc_test-cdh (50 min)
> SUCCESS jdbc_test-hdp (57 min) SUCCESS phoenix_part1_T4-cdh (42 min)
> SUCCESS phoenix_part1_T4-hdp (1 hr 26 min) SUCCESS
> phoenix_part2_T4-cdh (44 min) SUCCESS phoenix_part2_T4-hdp (1 hr 4
> min) SUCCESS pyodbc_test-cdh (10 min) SUCCESS pyodbc_test-hdp (38 min)
RE: Trafodion master Daily Test Result - 167 - Still Failing
Posted by Steve Varnau <st...@esgyn.com>.
Yes. Before we hung trying to load the tpc-ds data into hive. That script
seems to be running fine now, and the test suite actually runs, though all
the hive related tests fail. So something else is not right.
Test automation saves the hbase logs, but not hive logs, so I think we will
need to spin up a vm to debug it. Who would like a crack at this one?
--Steve
> -----Original Message-----
> From: Selva Govindarajan [mailto:selva.govindarajan@esgyn.com]
> Sent: Wednesday, April 6, 2016 9:19 AM
> To: dev@trafodion.incubator.apache.org
> Subject: RE: Trafodion master Daily Test Result - 167 - Still Failing
>
> I think it looks like a class path issue for hive tests in CDH. Need to
> be
> analyzed in CDH vm.
>
> Selva
>
> -----Original Message-----
> From: Sandhya Sundaresan [mailto:sandhya.sundaresan@esgyn.com]
> Sent: Wednesday, April 6, 2016 7:48 AM
> To: dev@trafodion.incubator.apache.org
> Subject: RE: Trafodion master Daily Test Result - 167 - Still Failing
>
> The executor suite passed after weeks but the problematic test (TEST106)
> has
> been commented out until the new hang for "drop table" is fixed just so
> the rest of the tests in the suite get run. The old hang seems to be fixed
> now.
>
> Steve, looks like the Hive metadata is corrupt or not setup properly on
> the
> VMs where the core and hive suites are run.
>
> Arvind, I suppose you're following up on the phoenix failures ?
>
> Sandhya
>
> -----Original Message-----
> From: steve.varnau@esgyn.com [mailto:steve.varnau@esgyn.com]
> Sent: Wednesday, April 6, 2016 4:02 AM
> To: dev@trafodion.incubator.apache.org
> Subject: Trafodion master Daily Test Result - 167 - Still Failing
>
> Daily Automated Testing master
>
> Jenkins Job: https://jenkins.esgyn.com/job/Check-Daily-master/167/
> Archived Logs: http://traf-testlogs.esgyn.com/Daily-master/167
> Bld Downloads: http://traf-builds.esgyn.com
>
> Changes since previous daily build:
> [Steve Varnau] [TRAFODION-1816] License info for binary distribution of
> REST
> bundle
>
> [selvaganesang] [TRAFODION-1918] Remove auto flush concept in Trafodion
>
> [selvaganesang] [TRAFODION-1918] Remove disabling auto flush concept in
> Trafodion
>
>
>
> Test Job Results:
>
> FAILURE core-regress-core-cdh (1 hr 34 min) FAILURE core-regress-hive-cdh
> (22 min) FAILURE core-regress-privs1-cdh (41 min) FAILURE
> phoenix_part1_T2-cdh (11 min) FAILURE phoenix_part1_T2-hdp (39 min)
> FAILURE
> phoenix_part2_T2-cdh (11 min) FAILURE phoenix_part2_T2-hdp (38 min)
> SUCCESS
> build-master-debug (25 min) SUCCESS build-master-release (26 min) SUCCESS
> core-regress-charsets-cdh (27 min) SUCCESS core-regress-charsets-hdp (1 hr
> 29 min) SUCCESS core-regress-compGeneral-cdh (1 hr 25 min) SUCCESS
> core-regress-compGeneral-hdp (47 min) SUCCESS core-regress-core-hdp (1 hr
> 1
> min) SUCCESS core-regress-executor-cdh (49 min) SUCCESS
> core-regress-executor-hdp (1 hr 3 min) SUCCESS core-regress-fullstack2-cdh
> (1 hr 2 min) SUCCESS core-regress-fullstack2-hdp (14 min) SUCCESS
> core-regress-hive-hdp (41 min) SUCCESS core-regress-privs1-hdp (1 hr 1
> min)
> SUCCESS core-regress-privs2-cdh (35 min) SUCCESS core-regress-privs2-hdp
> (43
> min) SUCCESS core-regress-qat-cdh (14 min) SUCCESS core-regress-qat-hdp (1
> hr 13 min) SUCCESS core-regress-seabase-cdh (1 hr 45 min) SUCCESS
> core-regress-seabase-hdp (2 hr 7 min) SUCCESS core-regress-udr-cdh (18
> min)
> SUCCESS core-regress-udr-hdp (40 min) SUCCESS jdbc_test-cdh (50 min)
> SUCCESS
> jdbc_test-hdp (57 min) SUCCESS phoenix_part1_T4-cdh (42 min) SUCCESS
> phoenix_part1_T4-hdp (1 hr 26 min) SUCCESS phoenix_part2_T4-cdh (44 min)
> SUCCESS phoenix_part2_T4-hdp (1 hr 4 min) SUCCESS pyodbc_test-cdh (10 min)
> SUCCESS pyodbc_test-hdp (38 min)
RE: Trafodion master Daily Test Result - 167 - Still Failing
Posted by Selva Govindarajan <se...@esgyn.com>.
I think it looks like a class path issue for hive tests in CDH. Need to be
analyzed in CDH vm.
Selva
-----Original Message-----
From: Sandhya Sundaresan [mailto:sandhya.sundaresan@esgyn.com]
Sent: Wednesday, April 6, 2016 7:48 AM
To: dev@trafodion.incubator.apache.org
Subject: RE: Trafodion master Daily Test Result - 167 - Still Failing
The executor suite passed after weeks but the problematic test (TEST106) has
been commented out until the new hang for "drop table" is fixed just so
the rest of the tests in the suite get run. The old hang seems to be fixed
now.
Steve, looks like the Hive metadata is corrupt or not setup properly on the
VMs where the core and hive suites are run.
Arvind, I suppose you're following up on the phoenix failures ?
Sandhya
-----Original Message-----
From: steve.varnau@esgyn.com [mailto:steve.varnau@esgyn.com]
Sent: Wednesday, April 6, 2016 4:02 AM
To: dev@trafodion.incubator.apache.org
Subject: Trafodion master Daily Test Result - 167 - Still Failing
Daily Automated Testing master
Jenkins Job: https://jenkins.esgyn.com/job/Check-Daily-master/167/
Archived Logs: http://traf-testlogs.esgyn.com/Daily-master/167
Bld Downloads: http://traf-builds.esgyn.com
Changes since previous daily build:
[Steve Varnau] [TRAFODION-1816] License info for binary distribution of REST
bundle
[selvaganesang] [TRAFODION-1918] Remove auto flush concept in Trafodion
[selvaganesang] [TRAFODION-1918] Remove disabling auto flush concept in
Trafodion
Test Job Results:
FAILURE core-regress-core-cdh (1 hr 34 min) FAILURE core-regress-hive-cdh
(22 min) FAILURE core-regress-privs1-cdh (41 min) FAILURE
phoenix_part1_T2-cdh (11 min) FAILURE phoenix_part1_T2-hdp (39 min) FAILURE
phoenix_part2_T2-cdh (11 min) FAILURE phoenix_part2_T2-hdp (38 min) SUCCESS
build-master-debug (25 min) SUCCESS build-master-release (26 min) SUCCESS
core-regress-charsets-cdh (27 min) SUCCESS core-regress-charsets-hdp (1 hr
29 min) SUCCESS core-regress-compGeneral-cdh (1 hr 25 min) SUCCESS
core-regress-compGeneral-hdp (47 min) SUCCESS core-regress-core-hdp (1 hr 1
min) SUCCESS core-regress-executor-cdh (49 min) SUCCESS
core-regress-executor-hdp (1 hr 3 min) SUCCESS core-regress-fullstack2-cdh
(1 hr 2 min) SUCCESS core-regress-fullstack2-hdp (14 min) SUCCESS
core-regress-hive-hdp (41 min) SUCCESS core-regress-privs1-hdp (1 hr 1 min)
SUCCESS core-regress-privs2-cdh (35 min) SUCCESS core-regress-privs2-hdp (43
min) SUCCESS core-regress-qat-cdh (14 min) SUCCESS core-regress-qat-hdp (1
hr 13 min) SUCCESS core-regress-seabase-cdh (1 hr 45 min) SUCCESS
core-regress-seabase-hdp (2 hr 7 min) SUCCESS core-regress-udr-cdh (18 min)
SUCCESS core-regress-udr-hdp (40 min) SUCCESS jdbc_test-cdh (50 min) SUCCESS
jdbc_test-hdp (57 min) SUCCESS phoenix_part1_T4-cdh (42 min) SUCCESS
phoenix_part1_T4-hdp (1 hr 26 min) SUCCESS phoenix_part2_T4-cdh (44 min)
SUCCESS phoenix_part2_T4-hdp (1 hr 4 min) SUCCESS pyodbc_test-cdh (10 min)
SUCCESS pyodbc_test-hdp (38 min)
RE: Trafodion master Daily Test Result - 167 - Still Failing
Posted by Sandhya Sundaresan <sa...@esgyn.com>.
The executor suite passed after weeks but the problematic test (TEST106)
has been commented out until the new hang for "drop table" is fixed just
so the rest of the tests in the suite get run. The old hang seems to be
fixed now.
Steve, looks like the Hive metadata is corrupt or not setup properly on the
VMs where the core and hive suites are run.
Arvind, I suppose you're following up on the phoenix failures ?
Sandhya
-----Original Message-----
From: steve.varnau@esgyn.com [mailto:steve.varnau@esgyn.com]
Sent: Wednesday, April 6, 2016 4:02 AM
To: dev@trafodion.incubator.apache.org
Subject: Trafodion master Daily Test Result - 167 - Still Failing
Daily Automated Testing master
Jenkins Job: https://jenkins.esgyn.com/job/Check-Daily-master/167/
Archived Logs: http://traf-testlogs.esgyn.com/Daily-master/167
Bld Downloads: http://traf-builds.esgyn.com
Changes since previous daily build:
[Steve Varnau] [TRAFODION-1816] License info for binary distribution of REST
bundle
[selvaganesang] [TRAFODION-1918] Remove auto flush concept in Trafodion
[selvaganesang] [TRAFODION-1918] Remove disabling auto flush concept in
Trafodion
Test Job Results:
FAILURE core-regress-core-cdh (1 hr 34 min) FAILURE core-regress-hive-cdh
(22 min) FAILURE core-regress-privs1-cdh (41 min) FAILURE
phoenix_part1_T2-cdh (11 min) FAILURE phoenix_part1_T2-hdp (39 min) FAILURE
phoenix_part2_T2-cdh (11 min) FAILURE phoenix_part2_T2-hdp (38 min) SUCCESS
build-master-debug (25 min) SUCCESS build-master-release (26 min) SUCCESS
core-regress-charsets-cdh (27 min) SUCCESS core-regress-charsets-hdp (1 hr
29 min) SUCCESS core-regress-compGeneral-cdh (1 hr 25 min) SUCCESS
core-regress-compGeneral-hdp (47 min) SUCCESS core-regress-core-hdp (1 hr 1
min) SUCCESS core-regress-executor-cdh (49 min) SUCCESS
core-regress-executor-hdp (1 hr 3 min) SUCCESS core-regress-fullstack2-cdh
(1 hr 2 min) SUCCESS core-regress-fullstack2-hdp (14 min) SUCCESS
core-regress-hive-hdp (41 min) SUCCESS core-regress-privs1-hdp (1 hr 1 min)
SUCCESS core-regress-privs2-cdh (35 min) SUCCESS core-regress-privs2-hdp (43
min) SUCCESS core-regress-qat-cdh (14 min) SUCCESS core-regress-qat-hdp (1
hr 13 min) SUCCESS core-regress-seabase-cdh (1 hr 45 min) SUCCESS
core-regress-seabase-hdp (2 hr 7 min) SUCCESS core-regress-udr-cdh (18 min)
SUCCESS core-regress-udr-hdp (40 min) SUCCESS jdbc_test-cdh (50 min) SUCCESS
jdbc_test-hdp (57 min) SUCCESS phoenix_part1_T4-cdh (42 min) SUCCESS
phoenix_part1_T4-hdp (1 hr 26 min) SUCCESS phoenix_part2_T4-cdh (44 min)
SUCCESS phoenix_part2_T4-hdp (1 hr 4 min) SUCCESS pyodbc_test-cdh (10 min)
SUCCESS pyodbc_test-hdp (38 min)