You are viewing a plain text version of this content. The canonical link for it is here.
Posted to dev@kafka.apache.org by Apache Jenkins Server <je...@builds.apache.org> on 2021/04/03 00:05:22 UTC
Build failed in Jenkins: Kafka » kafka-trunk-jdk11 #665
See <https://ci-builds.apache.org/job/Kafka/job/kafka-trunk-jdk11/665/display/redirect?page=changes>
Changes:
[github] KAFKA-12283: disable flaky testMultipleWorkersRejoining to stabilize build (#10408)
------------------------------------------
[...truncated 3.69 MB...]
KafkaZkClientTest > testCreateRecursive() STARTED
KafkaZkClientTest > testCreateRecursive() PASSED
KafkaZkClientTest > testGetConsumerOffsetNoData() STARTED
KafkaZkClientTest > testGetConsumerOffsetNoData() PASSED
KafkaZkClientTest > testDeleteTopicPathMethods() STARTED
KafkaZkClientTest > testDeleteTopicPathMethods() PASSED
KafkaZkClientTest > testSetTopicPartitionStatesRaw() STARTED
KafkaZkClientTest > testSetTopicPartitionStatesRaw() PASSED
KafkaZkClientTest > testAclManagementMethods() STARTED
KafkaZkClientTest > testAclManagementMethods() PASSED
KafkaZkClientTest > testPreferredReplicaElectionMethods() STARTED
KafkaZkClientTest > testPreferredReplicaElectionMethods() PASSED
KafkaZkClientTest > testPropagateLogDir() STARTED
KafkaZkClientTest > testPropagateLogDir() PASSED
KafkaZkClientTest > testGetDataAndStat() STARTED
KafkaZkClientTest > testGetDataAndStat() PASSED
KafkaZkClientTest > testReassignPartitionsInProgress() STARTED
KafkaZkClientTest > testReassignPartitionsInProgress() PASSED
KafkaZkClientTest > testCreateTopLevelPaths() STARTED
KafkaZkClientTest > testCreateTopLevelPaths() PASSED
KafkaZkClientTest > testGetAllTopicsInClusterDoesNotTriggerWatch() STARTED
KafkaZkClientTest > testGetAllTopicsInClusterDoesNotTriggerWatch() PASSED
KafkaZkClientTest > testIsrChangeNotificationGetters() STARTED
KafkaZkClientTest > testIsrChangeNotificationGetters() PASSED
KafkaZkClientTest > testLogDirEventNotificationsDeletion() STARTED
KafkaZkClientTest > testLogDirEventNotificationsDeletion() PASSED
KafkaZkClientTest > testGetLogConfigs() STARTED
KafkaZkClientTest > testGetLogConfigs() PASSED
KafkaZkClientTest > testBrokerSequenceIdMethods() STARTED
KafkaZkClientTest > testBrokerSequenceIdMethods() PASSED
KafkaZkClientTest > testAclMethods() STARTED
KafkaZkClientTest > testAclMethods() PASSED
KafkaZkClientTest > testCreateSequentialPersistentPath() STARTED
KafkaZkClientTest > testCreateSequentialPersistentPath() PASSED
KafkaZkClientTest > testConditionalUpdatePath() STARTED
KafkaZkClientTest > testConditionalUpdatePath() PASSED
KafkaZkClientTest > testGetAllTopicsInClusterTriggersWatch() STARTED
KafkaZkClientTest > testGetAllTopicsInClusterTriggersWatch() PASSED
KafkaZkClientTest > testDeleteTopicZNode() STARTED
KafkaZkClientTest > testDeleteTopicZNode() PASSED
KafkaZkClientTest > testDeletePath() STARTED
KafkaZkClientTest > testDeletePath() PASSED
KafkaZkClientTest > testGetBrokerMethods() STARTED
KafkaZkClientTest > testGetBrokerMethods() PASSED
KafkaZkClientTest > testCreateTokenChangeNotification() STARTED
KafkaZkClientTest > testCreateTokenChangeNotification() PASSED
KafkaZkClientTest > testGetTopicsAndPartitions() STARTED
KafkaZkClientTest > testGetTopicsAndPartitions() PASSED
KafkaZkClientTest > testRegisterBrokerInfo() STARTED
KafkaZkClientTest > testRegisterBrokerInfo() PASSED
KafkaZkClientTest > testRetryRegisterBrokerInfo() STARTED
KafkaZkClientTest > testRetryRegisterBrokerInfo() PASSED
KafkaZkClientTest > testConsumerOffsetPath() STARTED
KafkaZkClientTest > testConsumerOffsetPath() PASSED
KafkaZkClientTest > testDeleteRecursiveWithControllerEpochVersionCheck() STARTED
KafkaZkClientTest > testDeleteRecursiveWithControllerEpochVersionCheck() PASSED
KafkaZkClientTest > testTopicAssignments() STARTED
KafkaZkClientTest > testTopicAssignments() PASSED
KafkaZkClientTest > testControllerManagementMethods() STARTED
KafkaZkClientTest > testControllerManagementMethods() PASSED
KafkaZkClientTest > testTopicAssignmentMethods() STARTED
KafkaZkClientTest > testTopicAssignmentMethods() PASSED
KafkaZkClientTest > testConnectionViaNettyClient() STARTED
KafkaZkClientTest > testConnectionViaNettyClient() PASSED
KafkaZkClientTest > testPropagateIsrChanges() STARTED
KafkaZkClientTest > testPropagateIsrChanges() PASSED
KafkaZkClientTest > testControllerEpochMethods() STARTED
KafkaZkClientTest > testControllerEpochMethods() PASSED
KafkaZkClientTest > testDeleteRecursive() STARTED
KafkaZkClientTest > testDeleteRecursive() PASSED
KafkaZkClientTest > testGetTopicPartitionStates() STARTED
KafkaZkClientTest > testGetTopicPartitionStates() PASSED
KafkaZkClientTest > testCreateConfigChangeNotification() STARTED
KafkaZkClientTest > testCreateConfigChangeNotification() PASSED
KafkaZkClientTest > testDelegationTokenMethods() STARTED
KafkaZkClientTest > testDelegationTokenMethods() PASSED
LiteralAclStoreTest > shouldHaveCorrectPaths() STARTED
LiteralAclStoreTest > shouldHaveCorrectPaths() PASSED
LiteralAclStoreTest > shouldRoundTripChangeNode() STARTED
LiteralAclStoreTest > shouldRoundTripChangeNode() PASSED
LiteralAclStoreTest > shouldThrowFromEncodeOnNoneLiteral() STARTED
LiteralAclStoreTest > shouldThrowFromEncodeOnNoneLiteral() PASSED
LiteralAclStoreTest > shouldWriteChangesToTheWritePath() STARTED
LiteralAclStoreTest > shouldWriteChangesToTheWritePath() PASSED
LiteralAclStoreTest > shouldHaveCorrectPatternType() STARTED
LiteralAclStoreTest > shouldHaveCorrectPatternType() PASSED
LiteralAclStoreTest > shouldDecodeResourceUsingTwoPartLogic() STARTED
LiteralAclStoreTest > shouldDecodeResourceUsingTwoPartLogic() PASSED
ReassignPartitionsZNodeTest > testDecodeInvalidJson() STARTED
ReassignPartitionsZNodeTest > testDecodeInvalidJson() PASSED
ReassignPartitionsZNodeTest > testEncode() STARTED
ReassignPartitionsZNodeTest > testEncode() PASSED
ReassignPartitionsZNodeTest > testDecodeValidJson() STARTED
ReassignPartitionsZNodeTest > testDecodeValidJson() PASSED
ControllerContextTest > testPartitionFullReplicaAssignmentReturnsEmptyAssignmentIfTopicOrPartitionDoesNotExist() STARTED
ControllerContextTest > testPartitionFullReplicaAssignmentReturnsEmptyAssignmentIfTopicOrPartitionDoesNotExist() PASSED
ControllerContextTest > testPartitionReplicaAssignmentForTopicReturnsEmptyMapIfTopicDoesNotExist() STARTED
ControllerContextTest > testPartitionReplicaAssignmentForTopicReturnsEmptyMapIfTopicDoesNotExist() PASSED
ControllerContextTest > testPreferredReplicaImbalanceMetric() STARTED
ControllerContextTest > testPreferredReplicaImbalanceMetric() PASSED
ControllerContextTest > testPartitionReplicaAssignmentForTopicReturnsExpectedReplicaAssignments() STARTED
ControllerContextTest > testPartitionReplicaAssignmentForTopicReturnsExpectedReplicaAssignments() PASSED
ControllerContextTest > testReassignTo() STARTED
ControllerContextTest > testReassignTo() PASSED
ControllerContextTest > testPartitionReplicaAssignment() STARTED
ControllerContextTest > testPartitionReplicaAssignment() PASSED
ControllerContextTest > testUpdatePartitionFullReplicaAssignmentUpdatesReplicaAssignment() STARTED
ControllerContextTest > testUpdatePartitionFullReplicaAssignmentUpdatesReplicaAssignment() PASSED
ControllerContextTest > testReassignToIdempotence() STARTED
ControllerContextTest > testReassignToIdempotence() PASSED
ControllerContextTest > testPartitionReplicaAssignmentReturnsEmptySeqIfTopicOrPartitionDoesNotExist() STARTED
ControllerContextTest > testPartitionReplicaAssignmentReturnsEmptySeqIfTopicOrPartitionDoesNotExist() PASSED
3493 tests completed, 1 failed, 7 skipped
> Task :core:test FAILED
FAILURE: Build failed with an exception.
* What went wrong:
Execution failed for task ':core:test'.
> There were failing tests. See the report at: file://<https://ci-builds.apache.org/job/Kafka/job/kafka-trunk-jdk11/ws/core/build/reports/tests/test/index.html>
* Try:
Run with --stacktrace option to get the stack trace. Run with --info or --debug option to get more log output. Run with --scan to get full insights.
* Get more help at https://help.gradle.org
Deprecated Gradle features were used in this build, making it incompatible with Gradle 7.0.
Use '--warning-mode all' to show the individual deprecation warnings.
See https://docs.gradle.org/6.8.3/userguide/command_line_interface.html#sec:command_line_warnings
BUILD FAILED in 1h 32m 39s
257 actionable tasks: 220 executed, 37 up-to-date
Build step 'Execute shell' marked build as failure
Recording test results
[Checks API] No suitable checks publisher found.
Not sending mail to unregistered user github@hugo-hirsch.de
Build failed in Jenkins: Kafka » kafka-trunk-jdk11 #673
Posted by Apache Jenkins Server <je...@builds.apache.org>.
See <https://ci-builds.apache.org/job/Kafka/job/kafka-trunk-jdk11/673/display/redirect?page=changes>
Changes:
[github] MINOR: update GroupMetadataManager#getMagic docs (#10442)
------------------------------------------
[...truncated 3.73 MB...]
KafkaZkClientTest > testPropagateLogDir() STARTED
KafkaZkClientTest > testPropagateLogDir() PASSED
KafkaZkClientTest > testGetDataAndStat() STARTED
KafkaZkClientTest > testGetDataAndStat() PASSED
KafkaZkClientTest > testReassignPartitionsInProgress() STARTED
KafkaZkClientTest > testReassignPartitionsInProgress() PASSED
KafkaZkClientTest > testCreateTopLevelPaths() STARTED
KafkaZkClientTest > testCreateTopLevelPaths() PASSED
KafkaZkClientTest > testGetAllTopicsInClusterDoesNotTriggerWatch() STARTED
KafkaZkClientTest > testGetAllTopicsInClusterDoesNotTriggerWatch() PASSED
KafkaZkClientTest > testIsrChangeNotificationGetters() STARTED
KafkaZkClientTest > testIsrChangeNotificationGetters() PASSED
KafkaZkClientTest > testLogDirEventNotificationsDeletion() STARTED
KafkaZkClientTest > testLogDirEventNotificationsDeletion() PASSED
KafkaZkClientTest > testGetLogConfigs() STARTED
KafkaZkClientTest > testGetLogConfigs() PASSED
KafkaZkClientTest > testBrokerSequenceIdMethods() STARTED
KafkaZkClientTest > testBrokerSequenceIdMethods() PASSED
KafkaZkClientTest > testAclMethods() STARTED
KafkaZkClientTest > testAclMethods() PASSED
KafkaZkClientTest > testCreateSequentialPersistentPath() STARTED
KafkaZkClientTest > testCreateSequentialPersistentPath() PASSED
KafkaZkClientTest > testConditionalUpdatePath() STARTED
KafkaZkClientTest > testConditionalUpdatePath() PASSED
KafkaZkClientTest > testGetAllTopicsInClusterTriggersWatch() STARTED
KafkaZkClientTest > testGetAllTopicsInClusterTriggersWatch() PASSED
KafkaZkClientTest > testDeleteTopicZNode() STARTED
KafkaZkClientTest > testDeleteTopicZNode() PASSED
KafkaZkClientTest > testDeletePath() STARTED
KafkaZkClientTest > testDeletePath() PASSED
KafkaZkClientTest > testGetBrokerMethods() STARTED
KafkaZkClientTest > testGetBrokerMethods() PASSED
KafkaZkClientTest > testCreateTokenChangeNotification() STARTED
KafkaZkClientTest > testCreateTokenChangeNotification() PASSED
KafkaZkClientTest > testGetTopicsAndPartitions() STARTED
KafkaZkClientTest > testGetTopicsAndPartitions() PASSED
KafkaZkClientTest > testRegisterBrokerInfo() STARTED
KafkaZkClientTest > testRegisterBrokerInfo() PASSED
KafkaZkClientTest > testRetryRegisterBrokerInfo() STARTED
KafkaZkClientTest > testRetryRegisterBrokerInfo() PASSED
KafkaZkClientTest > testConsumerOffsetPath() STARTED
KafkaZkClientTest > testConsumerOffsetPath() PASSED
KafkaZkClientTest > testDeleteRecursiveWithControllerEpochVersionCheck() STARTED
KafkaZkClientTest > testDeleteRecursiveWithControllerEpochVersionCheck() PASSED
KafkaZkClientTest > testTopicAssignments() STARTED
KafkaZkClientTest > testTopicAssignments() PASSED
KafkaZkClientTest > testControllerManagementMethods() STARTED
KafkaZkClientTest > testControllerManagementMethods() PASSED
KafkaZkClientTest > testTopicAssignmentMethods() STARTED
KafkaZkClientTest > testTopicAssignmentMethods() PASSED
KafkaZkClientTest > testConnectionViaNettyClient() STARTED
KafkaZkClientTest > testConnectionViaNettyClient() PASSED
KafkaZkClientTest > testPropagateIsrChanges() STARTED
KafkaZkClientTest > testPropagateIsrChanges() PASSED
KafkaZkClientTest > testControllerEpochMethods() STARTED
KafkaZkClientTest > testControllerEpochMethods() PASSED
KafkaZkClientTest > testDeleteRecursive() STARTED
KafkaZkClientTest > testDeleteRecursive() PASSED
KafkaZkClientTest > testGetTopicPartitionStates() STARTED
KafkaZkClientTest > testGetTopicPartitionStates() PASSED
KafkaZkClientTest > testCreateConfigChangeNotification() STARTED
KafkaZkClientTest > testCreateConfigChangeNotification() PASSED
KafkaZkClientTest > testDelegationTokenMethods() STARTED
KafkaZkClientTest > testDelegationTokenMethods() PASSED
LiteralAclStoreTest > shouldHaveCorrectPaths() STARTED
LiteralAclStoreTest > shouldHaveCorrectPaths() PASSED
LiteralAclStoreTest > shouldRoundTripChangeNode() STARTED
LiteralAclStoreTest > shouldRoundTripChangeNode() PASSED
LiteralAclStoreTest > shouldThrowFromEncodeOnNoneLiteral() STARTED
LiteralAclStoreTest > shouldThrowFromEncodeOnNoneLiteral() PASSED
LiteralAclStoreTest > shouldWriteChangesToTheWritePath() STARTED
LiteralAclStoreTest > shouldWriteChangesToTheWritePath() PASSED
LiteralAclStoreTest > shouldHaveCorrectPatternType() STARTED
LiteralAclStoreTest > shouldHaveCorrectPatternType() PASSED
LiteralAclStoreTest > shouldDecodeResourceUsingTwoPartLogic() STARTED
LiteralAclStoreTest > shouldDecodeResourceUsingTwoPartLogic() PASSED
ReassignPartitionsZNodeTest > testDecodeInvalidJson() STARTED
ReassignPartitionsZNodeTest > testDecodeInvalidJson() PASSED
ReassignPartitionsZNodeTest > testEncode() STARTED
ReassignPartitionsZNodeTest > testEncode() PASSED
ReassignPartitionsZNodeTest > testDecodeValidJson() STARTED
ReassignPartitionsZNodeTest > testDecodeValidJson() PASSED
ControllerContextTest > testPartitionFullReplicaAssignmentReturnsEmptyAssignmentIfTopicOrPartitionDoesNotExist() STARTED
ControllerContextTest > testPartitionFullReplicaAssignmentReturnsEmptyAssignmentIfTopicOrPartitionDoesNotExist() PASSED
ControllerContextTest > testPartitionReplicaAssignmentForTopicReturnsEmptyMapIfTopicDoesNotExist() STARTED
ControllerContextTest > testPartitionReplicaAssignmentForTopicReturnsEmptyMapIfTopicDoesNotExist() PASSED
ControllerContextTest > testPreferredReplicaImbalanceMetric() STARTED
ControllerContextTest > testPreferredReplicaImbalanceMetric() PASSED
ControllerContextTest > testPartitionReplicaAssignmentForTopicReturnsExpectedReplicaAssignments() STARTED
ControllerContextTest > testPartitionReplicaAssignmentForTopicReturnsExpectedReplicaAssignments() PASSED
ControllerContextTest > testReassignTo() STARTED
ControllerContextTest > testReassignTo() PASSED
ControllerContextTest > testPartitionReplicaAssignment() STARTED
ControllerContextTest > testPartitionReplicaAssignment() PASSED
ControllerContextTest > testUpdatePartitionFullReplicaAssignmentUpdatesReplicaAssignment() STARTED
ControllerContextTest > testUpdatePartitionFullReplicaAssignmentUpdatesReplicaAssignment() PASSED
ControllerContextTest > testReassignToIdempotence() STARTED
ControllerContextTest > testReassignToIdempotence() PASSED
ControllerContextTest > testPartitionReplicaAssignmentReturnsEmptySeqIfTopicOrPartitionDoesNotExist() STARTED
ControllerContextTest > testPartitionReplicaAssignmentReturnsEmptySeqIfTopicOrPartitionDoesNotExist() PASSED
3437 tests completed, 1 failed, 7 skipped
> Task :core:test FAILED
FAILURE: Build completed with 3 failures.
1: Task failed with an exception.
-----------
* What went wrong:
Execution failed for task ':connect:mirror:test'.
> There were failing tests. See the report at: file://<https://ci-builds.apache.org/job/Kafka/job/kafka-trunk-jdk11/ws/connect/mirror/build/reports/tests/test/index.html>
* Try:
Run with --stacktrace option to get the stack trace. Run with --info or --debug option to get more log output. Run with --scan to get full insights.
==============================================================================
2: Task failed with an exception.
-----------
* What went wrong:
Execution failed for task ':streams:test'.
> There were failing tests. See the report at: file://<https://ci-builds.apache.org/job/Kafka/job/kafka-trunk-jdk11/ws/streams/build/reports/tests/test/index.html>
* Try:
Run with --stacktrace option to get the stack trace. Run with --info or --debug option to get more log output. Run with --scan to get full insights.
==============================================================================
3: Task failed with an exception.
-----------
* What went wrong:
Execution failed for task ':core:test'.
> There were failing tests. See the report at: file://<https://ci-builds.apache.org/job/Kafka/job/kafka-trunk-jdk11/ws/core/build/reports/tests/test/index.html>
* Try:
Run with --stacktrace option to get the stack trace. Run with --info or --debug option to get more log output. Run with --scan to get full insights.
==============================================================================
* Get more help at https://help.gradle.org
Deprecated Gradle features were used in this build, making it incompatible with Gradle 7.0.
Use '--warning-mode all' to show the individual deprecation warnings.
See https://docs.gradle.org/6.8.3/userguide/command_line_interface.html#sec:command_line_warnings
BUILD FAILED in 1h 46m 6s
257 actionable tasks: 220 executed, 37 up-to-date
Build step 'Execute shell' marked build as failure
Recording test results
[Checks API] No suitable checks publisher found.
Not sending mail to unregistered user github@hugo-hirsch.de
Build failed in Jenkins: Kafka » kafka-trunk-jdk11 #672
Posted by Apache Jenkins Server <je...@builds.apache.org>.
See <https://ci-builds.apache.org/job/Kafka/job/kafka-trunk-jdk11/672/display/redirect?page=changes>
Changes:
[github] MINOR: Jenkinsfile's `post` needs `agent` to be set (#10479)
------------------------------------------
[...truncated 3.70 MB...]
TransactionMarkerRequestCompletionHandlerTest > shouldThrowIllegalStateExceptionWhenRecordListTooLargeError() STARTED
TransactionMarkerRequestCompletionHandlerTest > shouldThrowIllegalStateExceptionWhenRecordListTooLargeError() PASSED
TransactionMarkerRequestCompletionHandlerTest > shouldCompleteDelayedOperationWhenInvalidProducerEpoch() STARTED
TransactionMarkerRequestCompletionHandlerTest > shouldCompleteDelayedOperationWhenInvalidProducerEpoch() PASSED
TransactionMarkerRequestCompletionHandlerTest > shouldRetryPartitionWhenNotLeaderOrFollowerError() STARTED
TransactionMarkerRequestCompletionHandlerTest > shouldRetryPartitionWhenNotLeaderOrFollowerError() PASSED
TransactionMarkerRequestCompletionHandlerTest > shouldThrowIllegalStateExceptionWhenInvalidRequiredAcksError() STARTED
TransactionMarkerRequestCompletionHandlerTest > shouldThrowIllegalStateExceptionWhenInvalidRequiredAcksError() PASSED
TransactionMarkerRequestCompletionHandlerTest > shouldReEnqueuePartitionsWhenBrokerDisconnected() STARTED
TransactionMarkerRequestCompletionHandlerTest > shouldReEnqueuePartitionsWhenBrokerDisconnected() PASSED
TransactionMarkerRequestCompletionHandlerTest > shouldRetryPartitionWhenNotEnoughReplicasError() STARTED
TransactionMarkerRequestCompletionHandlerTest > shouldRetryPartitionWhenNotEnoughReplicasError() PASSED
TransactionMarkerRequestCompletionHandlerTest > shouldCompleteDelayedOperationWhenNoErrors() STARTED
TransactionMarkerRequestCompletionHandlerTest > shouldCompleteDelayedOperationWhenNoErrors() PASSED
TransactionMarkerRequestCompletionHandlerTest > shouldThrowIllegalStateExceptionWhenCorruptMessageError() STARTED
TransactionMarkerRequestCompletionHandlerTest > shouldThrowIllegalStateExceptionWhenCorruptMessageError() PASSED
TransactionMarkerRequestCompletionHandlerTest > shouldCompleteDelayedOperationWhenCoordinatorLoading() STARTED
TransactionMarkerRequestCompletionHandlerTest > shouldCompleteDelayedOperationWhenCoordinatorLoading() PASSED
TransactionMarkerRequestCompletionHandlerTest > shouldCompleteDelayedOperationWheCoordinatorEpochFenced() STARTED
TransactionMarkerRequestCompletionHandlerTest > shouldCompleteDelayedOperationWheCoordinatorEpochFenced() PASSED
TransactionMarkerRequestCompletionHandlerTest > shouldThrowIllegalStateExceptionWhenUnknownError() STARTED
TransactionMarkerRequestCompletionHandlerTest > shouldThrowIllegalStateExceptionWhenUnknownError() PASSED
TransactionMarkerRequestCompletionHandlerTest > shouldCompleteDelayedOperationWhenNotCoordinator() STARTED
TransactionMarkerRequestCompletionHandlerTest > shouldCompleteDelayedOperationWhenNotCoordinator() PASSED
TransactionMarkerRequestCompletionHandlerTest > shouldCompleteDelayedOperationWhenCoordinatorEpochChanged() STARTED
TransactionMarkerRequestCompletionHandlerTest > shouldCompleteDelayedOperationWhenCoordinatorEpochChanged() PASSED
TransactionMarkerRequestCompletionHandlerTest > shouldRetryPartitionWhenUnknownTopicOrPartitionError() STARTED
TransactionMarkerRequestCompletionHandlerTest > shouldRetryPartitionWhenUnknownTopicOrPartitionError() PASSED
TransactionMarkerRequestCompletionHandlerTest > shouldRetryPartitionWhenNotEnoughReplicasAfterAppendError() STARTED
TransactionMarkerRequestCompletionHandlerTest > shouldRetryPartitionWhenNotEnoughReplicasAfterAppendError() PASSED
TransactionMarkerRequestCompletionHandlerTest > shouldThrowIllegalStateExceptionWhenMessageTooLargeError() STARTED
TransactionMarkerRequestCompletionHandlerTest > shouldThrowIllegalStateExceptionWhenMessageTooLargeError() PASSED
TransactionMarkerRequestCompletionHandlerTest > shouldThrowIllegalStateExceptionIfErrorCodeNotAvailableForPid() STARTED
TransactionMarkerRequestCompletionHandlerTest > shouldThrowIllegalStateExceptionIfErrorCodeNotAvailableForPid() PASSED
TransactionMarkerRequestCompletionHandlerTest > shouldRetryPartitionWhenKafkaStorageError() STARTED
TransactionMarkerRequestCompletionHandlerTest > shouldRetryPartitionWhenKafkaStorageError() PASSED
RequestChannelTest > testNonAlterRequestsNotTransformed() STARTED
RequestChannelTest > testNonAlterRequestsNotTransformed() PASSED
RequestChannelTest > testAlterRequests() STARTED
RequestChannelTest > testAlterRequests() PASSED
RequestChannelTest > testJsonRequests() STARTED
RequestChannelTest > testJsonRequests() PASSED
RequestChannelTest > testIncrementalAlterRequests() STARTED
RequestChannelTest > testIncrementalAlterRequests() PASSED
RequestConvertToJsonTest > testAllResponseTypesHandled() STARTED
RequestConvertToJsonTest > testAllResponseTypesHandled() PASSED
RequestConvertToJsonTest > testAllRequestTypesHandled() STARTED
RequestConvertToJsonTest > testAllRequestTypesHandled() PASSED
RequestConvertToJsonTest > testRequestDescMetrics() STARTED
RequestConvertToJsonTest > testRequestDescMetrics() PASSED
RequestConvertToJsonTest > testClientInfoNode() STARTED
RequestConvertToJsonTest > testClientInfoNode() PASSED
RequestConvertToJsonTest > testRequestDesc() STARTED
RequestConvertToJsonTest > testRequestDesc() PASSED
RequestConvertToJsonTest > testRequestHeaderNode() STARTED
RequestConvertToJsonTest > testRequestHeaderNode() PASSED
MetricsTest > testUpdateJMXFilter() STARTED
MetricsTest > testUpdateJMXFilter() PASSED
MetricsTest > testGeneralBrokerTopicMetricsAreGreedilyRegistered() STARTED
MetricsTest > testGeneralBrokerTopicMetricsAreGreedilyRegistered() PASSED
MetricsTest > testLinuxIoMetrics() STARTED
MetricsTest > testLinuxIoMetrics() PASSED
MetricsTest > testMetricsReporterAfterDeletingTopic() STARTED
MetricsTest > testMetricsReporterAfterDeletingTopic() PASSED
MetricsTest > testSessionExpireListenerMetrics() STARTED
MetricsTest > testSessionExpireListenerMetrics() PASSED
MetricsTest > testBrokerTopicMetricsUnregisteredAfterDeletingTopic() STARTED
MetricsTest > testBrokerTopicMetricsUnregisteredAfterDeletingTopic() PASSED
MetricsTest > testYammerMetricsCountMetric() STARTED
MetricsTest > testYammerMetricsCountMetric() PASSED
MetricsTest > testClusterIdMetric() STARTED
MetricsTest > testClusterIdMetric() PASSED
MetricsTest > testControllerMetrics() STARTED
MetricsTest > testControllerMetrics() PASSED
MetricsTest > testWindowsStyleTagNames() STARTED
MetricsTest > testWindowsStyleTagNames() PASSED
MetricsTest > testBrokerStateMetric() STARTED
MetricsTest > testBrokerStateMetric() PASSED
MetricsTest > testBrokerTopicMetricsBytesInOut() STARTED
MetricsTest > testBrokerTopicMetricsBytesInOut() PASSED
MetricsTest > testJMXFilter() STARTED
MetricsTest > testJMXFilter() PASSED
ControllerContextTest > testPartitionFullReplicaAssignmentReturnsEmptyAssignmentIfTopicOrPartitionDoesNotExist() STARTED
ControllerContextTest > testPartitionFullReplicaAssignmentReturnsEmptyAssignmentIfTopicOrPartitionDoesNotExist() PASSED
ControllerContextTest > testPartitionReplicaAssignmentForTopicReturnsEmptyMapIfTopicDoesNotExist() STARTED
ControllerContextTest > testPartitionReplicaAssignmentForTopicReturnsEmptyMapIfTopicDoesNotExist() PASSED
ControllerContextTest > testPreferredReplicaImbalanceMetric() STARTED
ControllerContextTest > testPreferredReplicaImbalanceMetric() PASSED
ControllerContextTest > testPartitionReplicaAssignmentForTopicReturnsExpectedReplicaAssignments() STARTED
ControllerContextTest > testPartitionReplicaAssignmentForTopicReturnsExpectedReplicaAssignments() PASSED
ControllerContextTest > testReassignTo() STARTED
ControllerContextTest > testReassignTo() PASSED
ControllerContextTest > testPartitionReplicaAssignment() STARTED
ControllerContextTest > testPartitionReplicaAssignment() PASSED
ControllerContextTest > testUpdatePartitionFullReplicaAssignmentUpdatesReplicaAssignment() STARTED
ControllerContextTest > testUpdatePartitionFullReplicaAssignmentUpdatesReplicaAssignment() PASSED
ControllerContextTest > testReassignToIdempotence() STARTED
ControllerContextTest > testReassignToIdempotence() PASSED
ControllerContextTest > testPartitionReplicaAssignmentReturnsEmptySeqIfTopicOrPartitionDoesNotExist() STARTED
ControllerContextTest > testPartitionReplicaAssignmentReturnsEmptySeqIfTopicOrPartitionDoesNotExist() PASSED
3437 tests completed, 1 failed, 7 skipped
> Task :core:test FAILED
FAILURE: Build completed with 3 failures.
1: Task failed with an exception.
-----------
* What went wrong:
Execution failed for task ':connect:mirror:test'.
> There were failing tests. See the report at: file://<https://ci-builds.apache.org/job/Kafka/job/kafka-trunk-jdk11/ws/connect/mirror/build/reports/tests/test/index.html>
* Try:
Run with --stacktrace option to get the stack trace. Run with --info or --debug option to get more log output. Run with --scan to get full insights.
==============================================================================
2: Task failed with an exception.
-----------
* What went wrong:
Execution failed for task ':streams:test'.
> There were failing tests. See the report at: file://<https://ci-builds.apache.org/job/Kafka/job/kafka-trunk-jdk11/ws/streams/build/reports/tests/test/index.html>
* Try:
Run with --stacktrace option to get the stack trace. Run with --info or --debug option to get more log output. Run with --scan to get full insights.
==============================================================================
3: Task failed with an exception.
-----------
* What went wrong:
Execution failed for task ':core:test'.
> There were failing tests. See the report at: file://<https://ci-builds.apache.org/job/Kafka/job/kafka-trunk-jdk11/ws/core/build/reports/tests/test/index.html>
* Try:
Run with --stacktrace option to get the stack trace. Run with --info or --debug option to get more log output. Run with --scan to get full insights.
==============================================================================
* Get more help at https://help.gradle.org
Deprecated Gradle features were used in this build, making it incompatible with Gradle 7.0.
Use '--warning-mode all' to show the individual deprecation warnings.
See https://docs.gradle.org/6.8.3/userguide/command_line_interface.html#sec:command_line_warnings
BUILD FAILED in 2h 10m 39s
257 actionable tasks: 220 executed, 37 up-to-date
Build step 'Execute shell' marked build as failure
Recording test results
[Checks API] No suitable checks publisher found.
Not sending mail to unregistered user github@hugo-hirsch.de
Build failed in Jenkins: Kafka » kafka-trunk-jdk11 #671
Posted by Apache Jenkins Server <je...@builds.apache.org>.
See <https://ci-builds.apache.org/job/Kafka/job/kafka-trunk-jdk11/671/display/redirect?page=changes>
Changes:
[github] KAFKA-12294; forward auto topic request within envelope on behalf of clients (#10142)
------------------------------------------
[...truncated 3.70 MB...]
KafkaZkClientTest > testSetTopicPartitionStatesRaw() PASSED
KafkaZkClientTest > testAclManagementMethods() STARTED
KafkaZkClientTest > testAclManagementMethods() PASSED
KafkaZkClientTest > testPreferredReplicaElectionMethods() STARTED
KafkaZkClientTest > testPreferredReplicaElectionMethods() PASSED
KafkaZkClientTest > testPropagateLogDir() STARTED
KafkaZkClientTest > testPropagateLogDir() PASSED
KafkaZkClientTest > testGetDataAndStat() STARTED
KafkaZkClientTest > testGetDataAndStat() PASSED
KafkaZkClientTest > testReassignPartitionsInProgress() STARTED
KafkaZkClientTest > testReassignPartitionsInProgress() PASSED
KafkaZkClientTest > testCreateTopLevelPaths() STARTED
KafkaZkClientTest > testCreateTopLevelPaths() PASSED
KafkaZkClientTest > testGetAllTopicsInClusterDoesNotTriggerWatch() STARTED
KafkaZkClientTest > testGetAllTopicsInClusterDoesNotTriggerWatch() PASSED
KafkaZkClientTest > testIsrChangeNotificationGetters() STARTED
KafkaZkClientTest > testIsrChangeNotificationGetters() PASSED
KafkaZkClientTest > testLogDirEventNotificationsDeletion() STARTED
KafkaZkClientTest > testLogDirEventNotificationsDeletion() PASSED
KafkaZkClientTest > testGetLogConfigs() STARTED
KafkaZkClientTest > testGetLogConfigs() PASSED
KafkaZkClientTest > testBrokerSequenceIdMethods() STARTED
KafkaZkClientTest > testBrokerSequenceIdMethods() PASSED
KafkaZkClientTest > testAclMethods() STARTED
KafkaZkClientTest > testAclMethods() PASSED
KafkaZkClientTest > testCreateSequentialPersistentPath() STARTED
KafkaZkClientTest > testCreateSequentialPersistentPath() PASSED
KafkaZkClientTest > testConditionalUpdatePath() STARTED
KafkaZkClientTest > testConditionalUpdatePath() PASSED
KafkaZkClientTest > testGetAllTopicsInClusterTriggersWatch() STARTED
KafkaZkClientTest > testGetAllTopicsInClusterTriggersWatch() PASSED
KafkaZkClientTest > testDeleteTopicZNode() STARTED
KafkaZkClientTest > testDeleteTopicZNode() PASSED
KafkaZkClientTest > testDeletePath() STARTED
KafkaZkClientTest > testDeletePath() PASSED
KafkaZkClientTest > testGetBrokerMethods() STARTED
KafkaZkClientTest > testGetBrokerMethods() PASSED
KafkaZkClientTest > testCreateTokenChangeNotification() STARTED
KafkaZkClientTest > testCreateTokenChangeNotification() PASSED
KafkaZkClientTest > testGetTopicsAndPartitions() STARTED
KafkaZkClientTest > testGetTopicsAndPartitions() PASSED
KafkaZkClientTest > testRegisterBrokerInfo() STARTED
KafkaZkClientTest > testRegisterBrokerInfo() PASSED
KafkaZkClientTest > testRetryRegisterBrokerInfo() STARTED
KafkaZkClientTest > testRetryRegisterBrokerInfo() PASSED
KafkaZkClientTest > testConsumerOffsetPath() STARTED
KafkaZkClientTest > testConsumerOffsetPath() PASSED
KafkaZkClientTest > testDeleteRecursiveWithControllerEpochVersionCheck() STARTED
KafkaZkClientTest > testDeleteRecursiveWithControllerEpochVersionCheck() PASSED
KafkaZkClientTest > testTopicAssignments() STARTED
KafkaZkClientTest > testTopicAssignments() PASSED
KafkaZkClientTest > testControllerManagementMethods() STARTED
KafkaZkClientTest > testControllerManagementMethods() PASSED
KafkaZkClientTest > testTopicAssignmentMethods() STARTED
KafkaZkClientTest > testTopicAssignmentMethods() PASSED
KafkaZkClientTest > testConnectionViaNettyClient() STARTED
KafkaZkClientTest > testConnectionViaNettyClient() PASSED
KafkaZkClientTest > testPropagateIsrChanges() STARTED
KafkaZkClientTest > testPropagateIsrChanges() PASSED
KafkaZkClientTest > testControllerEpochMethods() STARTED
KafkaZkClientTest > testControllerEpochMethods() PASSED
KafkaZkClientTest > testDeleteRecursive() STARTED
KafkaZkClientTest > testDeleteRecursive() PASSED
KafkaZkClientTest > testGetTopicPartitionStates() STARTED
KafkaZkClientTest > testGetTopicPartitionStates() PASSED
KafkaZkClientTest > testCreateConfigChangeNotification() STARTED
KafkaZkClientTest > testCreateConfigChangeNotification() PASSED
KafkaZkClientTest > testDelegationTokenMethods() STARTED
KafkaZkClientTest > testDelegationTokenMethods() PASSED
LiteralAclStoreTest > shouldHaveCorrectPaths() STARTED
LiteralAclStoreTest > shouldHaveCorrectPaths() PASSED
LiteralAclStoreTest > shouldRoundTripChangeNode() STARTED
LiteralAclStoreTest > shouldRoundTripChangeNode() PASSED
LiteralAclStoreTest > shouldThrowFromEncodeOnNoneLiteral() STARTED
LiteralAclStoreTest > shouldThrowFromEncodeOnNoneLiteral() PASSED
LiteralAclStoreTest > shouldWriteChangesToTheWritePath() STARTED
LiteralAclStoreTest > shouldWriteChangesToTheWritePath() PASSED
LiteralAclStoreTest > shouldHaveCorrectPatternType() STARTED
LiteralAclStoreTest > shouldHaveCorrectPatternType() PASSED
LiteralAclStoreTest > shouldDecodeResourceUsingTwoPartLogic() STARTED
LiteralAclStoreTest > shouldDecodeResourceUsingTwoPartLogic() PASSED
ReassignPartitionsZNodeTest > testDecodeInvalidJson() STARTED
ReassignPartitionsZNodeTest > testDecodeInvalidJson() PASSED
ReassignPartitionsZNodeTest > testEncode() STARTED
ReassignPartitionsZNodeTest > testEncode() PASSED
ReassignPartitionsZNodeTest > testDecodeValidJson() STARTED
ReassignPartitionsZNodeTest > testDecodeValidJson() PASSED
ControllerContextTest > testPartitionFullReplicaAssignmentReturnsEmptyAssignmentIfTopicOrPartitionDoesNotExist() STARTED
ControllerContextTest > testPartitionFullReplicaAssignmentReturnsEmptyAssignmentIfTopicOrPartitionDoesNotExist() PASSED
ControllerContextTest > testPartitionReplicaAssignmentForTopicReturnsEmptyMapIfTopicDoesNotExist() STARTED
ControllerContextTest > testPartitionReplicaAssignmentForTopicReturnsEmptyMapIfTopicDoesNotExist() PASSED
ControllerContextTest > testPreferredReplicaImbalanceMetric() STARTED
ControllerContextTest > testPreferredReplicaImbalanceMetric() PASSED
ControllerContextTest > testPartitionReplicaAssignmentForTopicReturnsExpectedReplicaAssignments() STARTED
ControllerContextTest > testPartitionReplicaAssignmentForTopicReturnsExpectedReplicaAssignments() PASSED
ControllerContextTest > testReassignTo() STARTED
ControllerContextTest > testReassignTo() PASSED
ControllerContextTest > testPartitionReplicaAssignment() STARTED
ControllerContextTest > testPartitionReplicaAssignment() PASSED
ControllerContextTest > testUpdatePartitionFullReplicaAssignmentUpdatesReplicaAssignment() STARTED
ControllerContextTest > testUpdatePartitionFullReplicaAssignmentUpdatesReplicaAssignment() PASSED
ControllerContextTest > testReassignToIdempotence() STARTED
ControllerContextTest > testReassignToIdempotence() PASSED
ControllerContextTest > testPartitionReplicaAssignmentReturnsEmptySeqIfTopicOrPartitionDoesNotExist() STARTED
ControllerContextTest > testPartitionReplicaAssignmentReturnsEmptySeqIfTopicOrPartitionDoesNotExist() PASSED
3437 tests completed, 1 failed, 7 skipped
> Task :core:test FAILED
FAILURE: Build completed with 2 failures.
1: Task failed with an exception.
-----------
* What went wrong:
Execution failed for task ':connect:mirror:test'.
> There were failing tests. See the report at: file://<https://ci-builds.apache.org/job/Kafka/job/kafka-trunk-jdk11/ws/connect/mirror/build/reports/tests/test/index.html>
* Try:
Run with --stacktrace option to get the stack trace. Run with --info or --debug option to get more log output. Run with --scan to get full insights.
==============================================================================
2: Task failed with an exception.
-----------
* What went wrong:
Execution failed for task ':core:test'.
> There were failing tests. See the report at: file://<https://ci-builds.apache.org/job/Kafka/job/kafka-trunk-jdk11/ws/core/build/reports/tests/test/index.html>
* Try:
Run with --stacktrace option to get the stack trace. Run with --info or --debug option to get more log output. Run with --scan to get full insights.
==============================================================================
* Get more help at https://help.gradle.org
Deprecated Gradle features were used in this build, making it incompatible with Gradle 7.0.
Use '--warning-mode all' to show the individual deprecation warnings.
See https://docs.gradle.org/6.8.3/userguide/command_line_interface.html#sec:command_line_warnings
BUILD FAILED in 1h 34m 26s
257 actionable tasks: 220 executed, 37 up-to-date
Build step 'Execute shell' marked build as failure
Recording test results
[Checks API] No suitable checks publisher found.
Not sending mail to unregistered user github@hugo-hirsch.de
Build failed in Jenkins: Kafka » kafka-trunk-jdk11 #670
Posted by Apache Jenkins Server <je...@builds.apache.org>.
See <https://ci-builds.apache.org/job/Kafka/job/kafka-trunk-jdk11/670/display/redirect?page=changes>
Changes:
[github] KAFKA-12548; Propagate record error messages to application (#10445)
------------------------------------------
[...truncated 7.37 MB...]
BrokerEndPointTest > testFromJsonV5() PASSED
PartitionLockTest > testNoLockContentionWithoutIsrUpdate() STARTED
PartitionLockTest > testNoLockContentionWithoutIsrUpdate() PASSED
PartitionLockTest > testAppendReplicaFetchWithUpdateIsr() STARTED
PartitionLockTest > testAppendReplicaFetchWithUpdateIsr() PASSED
PartitionLockTest > testAppendReplicaFetchWithSchedulerCheckForShrinkIsr() STARTED
PartitionLockTest > testAppendReplicaFetchWithSchedulerCheckForShrinkIsr() PASSED
PartitionLockTest > testGetReplicaWithUpdateAssignmentAndIsr() STARTED
PartitionLockTest > testGetReplicaWithUpdateAssignmentAndIsr() PASSED
JsonValueTest > testJsonObjectIterator() STARTED
JsonValueTest > testJsonObjectIterator() PASSED
JsonValueTest > testDecodeLong() STARTED
JsonValueTest > testDecodeLong() PASSED
JsonValueTest > testAsJsonObject() STARTED
JsonValueTest > testAsJsonObject() PASSED
JsonValueTest > testDecodeDouble() STARTED
JsonValueTest > testDecodeDouble() PASSED
JsonValueTest > testDecodeOption() STARTED
JsonValueTest > testDecodeOption() PASSED
JsonValueTest > testDecodeString() STARTED
JsonValueTest > testDecodeString() PASSED
JsonValueTest > testJsonValueToString() STARTED
JsonValueTest > testJsonValueToString() PASSED
JsonValueTest > testAsJsonObjectOption() STARTED
JsonValueTest > testAsJsonObjectOption() PASSED
JsonValueTest > testAsJsonArrayOption() STARTED
JsonValueTest > testAsJsonArrayOption() PASSED
JsonValueTest > testAsJsonArray() STARTED
JsonValueTest > testAsJsonArray() PASSED
JsonValueTest > testJsonValueHashCode() STARTED
JsonValueTest > testJsonValueHashCode() PASSED
JsonValueTest > testDecodeInt() STARTED
JsonValueTest > testDecodeInt() PASSED
JsonValueTest > testDecodeMap() STARTED
JsonValueTest > testDecodeMap() PASSED
JsonValueTest > testDecodeSeq() STARTED
JsonValueTest > testDecodeSeq() PASSED
JsonValueTest > testJsonObjectGet() STARTED
JsonValueTest > testJsonObjectGet() PASSED
JsonValueTest > testJsonValueEquals() STARTED
JsonValueTest > testJsonValueEquals() PASSED
JsonValueTest > testJsonArrayIterator() STARTED
JsonValueTest > testJsonArrayIterator() PASSED
JsonValueTest > testJsonObjectApply() STARTED
JsonValueTest > testJsonObjectApply() PASSED
JsonValueTest > testDecodeBoolean() STARTED
JsonValueTest > testDecodeBoolean() PASSED
PasswordEncoderTest > testEncoderConfigChange() STARTED
PasswordEncoderTest > testEncoderConfigChange() PASSED
PasswordEncoderTest > testEncodeDecodeAlgorithms() STARTED
PasswordEncoderTest > testEncodeDecodeAlgorithms() PASSED
PasswordEncoderTest > testEncodeDecode() STARTED
PasswordEncoderTest > testEncodeDecode() PASSED
ThrottlerTest > testThrottleDesiredRate() STARTED
ThrottlerTest > testThrottleDesiredRate() PASSED
LoggingTest > testLoggerLevelIsResolved() STARTED
LoggingTest > testLoggerLevelIsResolved() PASSED
LoggingTest > testLog4jControllerIsRegistered() STARTED
LoggingTest > testLog4jControllerIsRegistered() PASSED
LoggingTest > testTypeOfGetLoggers() STARTED
LoggingTest > testTypeOfGetLoggers() PASSED
LoggingTest > testLogName() STARTED
LoggingTest > testLogName() PASSED
LoggingTest > testLogNameOverride() STARTED
LoggingTest > testLogNameOverride() PASSED
TimerTest > testAlreadyExpiredTask() STARTED
TimerTest > testAlreadyExpiredTask() PASSED
TimerTest > testTaskExpiration() STARTED
TimerTest > testTaskExpiration() PASSED
ReplicationUtilsTest > testUpdateLeaderAndIsr() STARTED
ReplicationUtilsTest > testUpdateLeaderAndIsr() PASSED
TopicFilterTest > testIncludeLists() STARTED
TopicFilterTest > testIncludeLists() PASSED
RaftManagerTest > testShutdownIoThread() STARTED
RaftManagerTest > testShutdownIoThread() PASSED
RaftManagerTest > testUncaughtExceptionInIoThread() STARTED
RaftManagerTest > testUncaughtExceptionInIoThread() PASSED
RequestChannelTest > testNonAlterRequestsNotTransformed() STARTED
RequestChannelTest > testNonAlterRequestsNotTransformed() PASSED
RequestChannelTest > testAlterRequests() STARTED
RequestChannelTest > testAlterRequests() PASSED
RequestChannelTest > testJsonRequests() STARTED
RequestChannelTest > testJsonRequests() PASSED
RequestChannelTest > testIncrementalAlterRequests() STARTED
RequestChannelTest > testIncrementalAlterRequests() PASSED
ControllerContextTest > testPartitionFullReplicaAssignmentReturnsEmptyAssignmentIfTopicOrPartitionDoesNotExist() STARTED
ControllerContextTest > testPartitionFullReplicaAssignmentReturnsEmptyAssignmentIfTopicOrPartitionDoesNotExist() PASSED
ControllerContextTest > testPartitionReplicaAssignmentForTopicReturnsEmptyMapIfTopicDoesNotExist() STARTED
ControllerContextTest > testPartitionReplicaAssignmentForTopicReturnsEmptyMapIfTopicDoesNotExist() PASSED
ControllerContextTest > testPreferredReplicaImbalanceMetric() STARTED
ControllerContextTest > testPreferredReplicaImbalanceMetric() PASSED
ControllerContextTest > testPartitionReplicaAssignmentForTopicReturnsExpectedReplicaAssignments() STARTED
ControllerContextTest > testPartitionReplicaAssignmentForTopicReturnsExpectedReplicaAssignments() PASSED
ControllerContextTest > testReassignTo() STARTED
ControllerContextTest > testReassignTo() PASSED
ControllerContextTest > testPartitionReplicaAssignment() STARTED
ControllerContextTest > testPartitionReplicaAssignment() PASSED
ControllerContextTest > testUpdatePartitionFullReplicaAssignmentUpdatesReplicaAssignment() STARTED
ControllerContextTest > testUpdatePartitionFullReplicaAssignmentUpdatesReplicaAssignment() PASSED
ControllerContextTest > testReassignToIdempotence() STARTED
ControllerContextTest > testReassignToIdempotence() PASSED
ControllerContextTest > testPartitionReplicaAssignmentReturnsEmptySeqIfTopicOrPartitionDoesNotExist() STARTED
ControllerContextTest > testPartitionReplicaAssignmentReturnsEmptySeqIfTopicOrPartitionDoesNotExist() PASSED
TransactionsWithMaxInFlightOneTest > testTransactionalProducerSingleBrokerMaxInFlightOne() STARTED
TransactionsWithMaxInFlightOneTest > testTransactionalProducerSingleBrokerMaxInFlightOne() PASSED
3434 tests completed, 1 failed, 7 skipped
> Task :core:test FAILED
FAILURE: Build completed with 2 failures.
1: Task failed with an exception.
-----------
* What went wrong:
Execution failed for task ':connect:mirror:test'.
> There were failing tests. See the report at: file://<https://ci-builds.apache.org/job/Kafka/job/kafka-trunk-jdk11/ws/connect/mirror/build/reports/tests/test/index.html>
* Try:
Run with --stacktrace option to get the stack trace. Run with --info or --debug option to get more log output. Run with --scan to get full insights.
==============================================================================
2: Task failed with an exception.
-----------
* What went wrong:
Execution failed for task ':core:test'.
> There were failing tests. See the report at: file://<https://ci-builds.apache.org/job/Kafka/job/kafka-trunk-jdk11/ws/core/build/reports/tests/test/index.html>
* Try:
Run with --stacktrace option to get the stack trace. Run with --info or --debug option to get more log output. Run with --scan to get full insights.
==============================================================================
* Get more help at https://help.gradle.org
Deprecated Gradle features were used in this build, making it incompatible with Gradle 7.0.
Use '--warning-mode all' to show the individual deprecation warnings.
See https://docs.gradle.org/6.8.3/userguide/command_line_interface.html#sec:command_line_warnings
BUILD FAILED in 1h 42m 13s
257 actionable tasks: 250 executed, 7 up-to-date
Build step 'Execute shell' marked build as failure
Recording test results
[Checks API] No suitable checks publisher found.
Not sending mail to unregistered user github@hugo-hirsch.de
Build failed in Jenkins: Kafka » kafka-trunk-jdk11 #669
Posted by Apache Jenkins Server <je...@builds.apache.org>.
See <https://ci-builds.apache.org/job/Kafka/job/kafka-trunk-jdk11/669/display/redirect?page=changes>
Changes:
[github] KAFKA-12614: Use Jenkinsfile for trunk and release branch builds (#10473)
[github] KAFKA-12539; Refactor KafkaRaftCllient handleVoteRequest to reduce cyclomatic complexity (#10393)
------------------------------------------
[...truncated 3.73 MB...]
KafkaZkClientTest > testPropagateLogDir() STARTED
KafkaZkClientTest > testPropagateLogDir() PASSED
KafkaZkClientTest > testGetDataAndStat() STARTED
KafkaZkClientTest > testGetDataAndStat() PASSED
KafkaZkClientTest > testReassignPartitionsInProgress() STARTED
KafkaZkClientTest > testReassignPartitionsInProgress() PASSED
KafkaZkClientTest > testCreateTopLevelPaths() STARTED
KafkaZkClientTest > testCreateTopLevelPaths() PASSED
KafkaZkClientTest > testGetAllTopicsInClusterDoesNotTriggerWatch() STARTED
KafkaZkClientTest > testGetAllTopicsInClusterDoesNotTriggerWatch() PASSED
KafkaZkClientTest > testIsrChangeNotificationGetters() STARTED
KafkaZkClientTest > testIsrChangeNotificationGetters() PASSED
KafkaZkClientTest > testLogDirEventNotificationsDeletion() STARTED
KafkaZkClientTest > testLogDirEventNotificationsDeletion() PASSED
KafkaZkClientTest > testGetLogConfigs() STARTED
KafkaZkClientTest > testGetLogConfigs() PASSED
KafkaZkClientTest > testBrokerSequenceIdMethods() STARTED
KafkaZkClientTest > testBrokerSequenceIdMethods() PASSED
KafkaZkClientTest > testAclMethods() STARTED
KafkaZkClientTest > testAclMethods() PASSED
KafkaZkClientTest > testCreateSequentialPersistentPath() STARTED
KafkaZkClientTest > testCreateSequentialPersistentPath() PASSED
KafkaZkClientTest > testConditionalUpdatePath() STARTED
KafkaZkClientTest > testConditionalUpdatePath() PASSED
KafkaZkClientTest > testGetAllTopicsInClusterTriggersWatch() STARTED
KafkaZkClientTest > testGetAllTopicsInClusterTriggersWatch() PASSED
KafkaZkClientTest > testDeleteTopicZNode() STARTED
KafkaZkClientTest > testDeleteTopicZNode() PASSED
KafkaZkClientTest > testDeletePath() STARTED
KafkaZkClientTest > testDeletePath() PASSED
KafkaZkClientTest > testGetBrokerMethods() STARTED
KafkaZkClientTest > testGetBrokerMethods() PASSED
KafkaZkClientTest > testCreateTokenChangeNotification() STARTED
KafkaZkClientTest > testCreateTokenChangeNotification() PASSED
KafkaZkClientTest > testGetTopicsAndPartitions() STARTED
KafkaZkClientTest > testGetTopicsAndPartitions() PASSED
KafkaZkClientTest > testRegisterBrokerInfo() STARTED
KafkaZkClientTest > testRegisterBrokerInfo() PASSED
KafkaZkClientTest > testRetryRegisterBrokerInfo() STARTED
KafkaZkClientTest > testRetryRegisterBrokerInfo() PASSED
KafkaZkClientTest > testConsumerOffsetPath() STARTED
KafkaZkClientTest > testConsumerOffsetPath() PASSED
KafkaZkClientTest > testDeleteRecursiveWithControllerEpochVersionCheck() STARTED
KafkaZkClientTest > testDeleteRecursiveWithControllerEpochVersionCheck() PASSED
KafkaZkClientTest > testTopicAssignments() STARTED
KafkaZkClientTest > testTopicAssignments() PASSED
KafkaZkClientTest > testControllerManagementMethods() STARTED
KafkaZkClientTest > testControllerManagementMethods() PASSED
KafkaZkClientTest > testTopicAssignmentMethods() STARTED
KafkaZkClientTest > testTopicAssignmentMethods() PASSED
KafkaZkClientTest > testConnectionViaNettyClient() STARTED
KafkaZkClientTest > testConnectionViaNettyClient() PASSED
KafkaZkClientTest > testPropagateIsrChanges() STARTED
KafkaZkClientTest > testPropagateIsrChanges() PASSED
KafkaZkClientTest > testControllerEpochMethods() STARTED
KafkaZkClientTest > testControllerEpochMethods() PASSED
KafkaZkClientTest > testDeleteRecursive() STARTED
KafkaZkClientTest > testDeleteRecursive() PASSED
KafkaZkClientTest > testGetTopicPartitionStates() STARTED
KafkaZkClientTest > testGetTopicPartitionStates() PASSED
KafkaZkClientTest > testCreateConfigChangeNotification() STARTED
KafkaZkClientTest > testCreateConfigChangeNotification() PASSED
KafkaZkClientTest > testDelegationTokenMethods() STARTED
KafkaZkClientTest > testDelegationTokenMethods() PASSED
LiteralAclStoreTest > shouldHaveCorrectPaths() STARTED
LiteralAclStoreTest > shouldHaveCorrectPaths() PASSED
LiteralAclStoreTest > shouldRoundTripChangeNode() STARTED
LiteralAclStoreTest > shouldRoundTripChangeNode() PASSED
LiteralAclStoreTest > shouldThrowFromEncodeOnNoneLiteral() STARTED
LiteralAclStoreTest > shouldThrowFromEncodeOnNoneLiteral() PASSED
LiteralAclStoreTest > shouldWriteChangesToTheWritePath() STARTED
LiteralAclStoreTest > shouldWriteChangesToTheWritePath() PASSED
LiteralAclStoreTest > shouldHaveCorrectPatternType() STARTED
LiteralAclStoreTest > shouldHaveCorrectPatternType() PASSED
LiteralAclStoreTest > shouldDecodeResourceUsingTwoPartLogic() STARTED
LiteralAclStoreTest > shouldDecodeResourceUsingTwoPartLogic() PASSED
ReassignPartitionsZNodeTest > testDecodeInvalidJson() STARTED
ReassignPartitionsZNodeTest > testDecodeInvalidJson() PASSED
ReassignPartitionsZNodeTest > testEncode() STARTED
ReassignPartitionsZNodeTest > testEncode() PASSED
ReassignPartitionsZNodeTest > testDecodeValidJson() STARTED
ReassignPartitionsZNodeTest > testDecodeValidJson() PASSED
ControllerContextTest > testPartitionFullReplicaAssignmentReturnsEmptyAssignmentIfTopicOrPartitionDoesNotExist() STARTED
ControllerContextTest > testPartitionFullReplicaAssignmentReturnsEmptyAssignmentIfTopicOrPartitionDoesNotExist() PASSED
ControllerContextTest > testPartitionReplicaAssignmentForTopicReturnsEmptyMapIfTopicDoesNotExist() STARTED
ControllerContextTest > testPartitionReplicaAssignmentForTopicReturnsEmptyMapIfTopicDoesNotExist() PASSED
ControllerContextTest > testPreferredReplicaImbalanceMetric() STARTED
ControllerContextTest > testPreferredReplicaImbalanceMetric() PASSED
ControllerContextTest > testPartitionReplicaAssignmentForTopicReturnsExpectedReplicaAssignments() STARTED
ControllerContextTest > testPartitionReplicaAssignmentForTopicReturnsExpectedReplicaAssignments() PASSED
ControllerContextTest > testReassignTo() STARTED
ControllerContextTest > testReassignTo() PASSED
ControllerContextTest > testPartitionReplicaAssignment() STARTED
ControllerContextTest > testPartitionReplicaAssignment() PASSED
ControllerContextTest > testUpdatePartitionFullReplicaAssignmentUpdatesReplicaAssignment() STARTED
ControllerContextTest > testUpdatePartitionFullReplicaAssignmentUpdatesReplicaAssignment() PASSED
ControllerContextTest > testReassignToIdempotence() STARTED
ControllerContextTest > testReassignToIdempotence() PASSED
ControllerContextTest > testPartitionReplicaAssignmentReturnsEmptySeqIfTopicOrPartitionDoesNotExist() STARTED
ControllerContextTest > testPartitionReplicaAssignmentReturnsEmptySeqIfTopicOrPartitionDoesNotExist() PASSED
3434 tests completed, 1 failed, 7 skipped
> Task :core:test FAILED
FAILURE: Build completed with 3 failures.
1: Task failed with an exception.
-----------
* What went wrong:
Execution failed for task ':connect:mirror:test'.
> There were failing tests. See the report at: file://<https://ci-builds.apache.org/job/Kafka/job/kafka-trunk-jdk11/ws/connect/mirror/build/reports/tests/test/index.html>
* Try:
Run with --stacktrace option to get the stack trace. Run with --info or --debug option to get more log output. Run with --scan to get full insights.
==============================================================================
2: Task failed with an exception.
-----------
* What went wrong:
Execution failed for task ':connect:runtime:test'.
> There were failing tests. See the report at: file://<https://ci-builds.apache.org/job/Kafka/job/kafka-trunk-jdk11/ws/connect/runtime/build/reports/tests/test/index.html>
* Try:
Run with --stacktrace option to get the stack trace. Run with --info or --debug option to get more log output. Run with --scan to get full insights.
==============================================================================
3: Task failed with an exception.
-----------
* What went wrong:
Execution failed for task ':core:test'.
> There were failing tests. See the report at: file://<https://ci-builds.apache.org/job/Kafka/job/kafka-trunk-jdk11/ws/core/build/reports/tests/test/index.html>
* Try:
Run with --stacktrace option to get the stack trace. Run with --info or --debug option to get more log output. Run with --scan to get full insights.
==============================================================================
* Get more help at https://help.gradle.org
Deprecated Gradle features were used in this build, making it incompatible with Gradle 7.0.
Use '--warning-mode all' to show the individual deprecation warnings.
See https://docs.gradle.org/6.8.3/userguide/command_line_interface.html#sec:command_line_warnings
BUILD FAILED in 1h 46m 55s
257 actionable tasks: 220 executed, 37 up-to-date
Build step 'Execute shell' marked build as failure
Recording test results
[Checks API] No suitable checks publisher found.
Not sending mail to unregistered user github@hugo-hirsch.de
Build failed in Jenkins: Kafka » kafka-trunk-jdk11 #668
Posted by Apache Jenkins Server <je...@builds.apache.org>.
See <https://ci-builds.apache.org/job/Kafka/job/kafka-trunk-jdk11/668/display/redirect?page=changes>
Changes:
[github] KAFKA-12615: Fix `Selector.clear()` javadoc typo (#10477)
------------------------------------------
[...truncated 3.71 MB...]
KafkaZkClientTest > testUpdateBrokerInfo() STARTED
KafkaZkClientTest > testUpdateBrokerInfo() PASSED
KafkaZkClientTest > testCreateRecursive() STARTED
KafkaZkClientTest > testCreateRecursive() PASSED
KafkaZkClientTest > testGetConsumerOffsetNoData() STARTED
KafkaZkClientTest > testGetConsumerOffsetNoData() PASSED
KafkaZkClientTest > testDeleteTopicPathMethods() STARTED
KafkaZkClientTest > testDeleteTopicPathMethods() PASSED
KafkaZkClientTest > testSetTopicPartitionStatesRaw() STARTED
KafkaZkClientTest > testSetTopicPartitionStatesRaw() PASSED
KafkaZkClientTest > testAclManagementMethods() STARTED
KafkaZkClientTest > testAclManagementMethods() PASSED
KafkaZkClientTest > testPreferredReplicaElectionMethods() STARTED
KafkaZkClientTest > testPreferredReplicaElectionMethods() PASSED
KafkaZkClientTest > testPropagateLogDir() STARTED
KafkaZkClientTest > testPropagateLogDir() PASSED
KafkaZkClientTest > testGetDataAndStat() STARTED
KafkaZkClientTest > testGetDataAndStat() PASSED
KafkaZkClientTest > testReassignPartitionsInProgress() STARTED
KafkaZkClientTest > testReassignPartitionsInProgress() PASSED
KafkaZkClientTest > testCreateTopLevelPaths() STARTED
KafkaZkClientTest > testCreateTopLevelPaths() PASSED
KafkaZkClientTest > testGetAllTopicsInClusterDoesNotTriggerWatch() STARTED
KafkaZkClientTest > testGetAllTopicsInClusterDoesNotTriggerWatch() PASSED
KafkaZkClientTest > testIsrChangeNotificationGetters() STARTED
KafkaZkClientTest > testIsrChangeNotificationGetters() PASSED
KafkaZkClientTest > testLogDirEventNotificationsDeletion() STARTED
KafkaZkClientTest > testLogDirEventNotificationsDeletion() PASSED
KafkaZkClientTest > testGetLogConfigs() STARTED
KafkaZkClientTest > testGetLogConfigs() PASSED
KafkaZkClientTest > testBrokerSequenceIdMethods() STARTED
KafkaZkClientTest > testBrokerSequenceIdMethods() PASSED
KafkaZkClientTest > testAclMethods() STARTED
KafkaZkClientTest > testAclMethods() PASSED
KafkaZkClientTest > testCreateSequentialPersistentPath() STARTED
KafkaZkClientTest > testCreateSequentialPersistentPath() PASSED
KafkaZkClientTest > testConditionalUpdatePath() STARTED
KafkaZkClientTest > testConditionalUpdatePath() PASSED
KafkaZkClientTest > testGetAllTopicsInClusterTriggersWatch() STARTED
KafkaZkClientTest > testGetAllTopicsInClusterTriggersWatch() PASSED
KafkaZkClientTest > testDeleteTopicZNode() STARTED
KafkaZkClientTest > testDeleteTopicZNode() PASSED
KafkaZkClientTest > testDeletePath() STARTED
KafkaZkClientTest > testDeletePath() PASSED
KafkaZkClientTest > testGetBrokerMethods() STARTED
KafkaZkClientTest > testGetBrokerMethods() PASSED
KafkaZkClientTest > testCreateTokenChangeNotification() STARTED
KafkaZkClientTest > testCreateTokenChangeNotification() PASSED
KafkaZkClientTest > testGetTopicsAndPartitions() STARTED
KafkaZkClientTest > testGetTopicsAndPartitions() PASSED
KafkaZkClientTest > testRegisterBrokerInfo() STARTED
KafkaZkClientTest > testRegisterBrokerInfo() PASSED
KafkaZkClientTest > testRetryRegisterBrokerInfo() STARTED
KafkaZkClientTest > testRetryRegisterBrokerInfo() PASSED
KafkaZkClientTest > testConsumerOffsetPath() STARTED
KafkaZkClientTest > testConsumerOffsetPath() PASSED
KafkaZkClientTest > testDeleteRecursiveWithControllerEpochVersionCheck() STARTED
KafkaZkClientTest > testDeleteRecursiveWithControllerEpochVersionCheck() PASSED
KafkaZkClientTest > testTopicAssignments() STARTED
KafkaZkClientTest > testTopicAssignments() PASSED
KafkaZkClientTest > testControllerManagementMethods() STARTED
KafkaZkClientTest > testControllerManagementMethods() PASSED
KafkaZkClientTest > testTopicAssignmentMethods() STARTED
KafkaZkClientTest > testTopicAssignmentMethods() PASSED
KafkaZkClientTest > testConnectionViaNettyClient() STARTED
KafkaZkClientTest > testConnectionViaNettyClient() PASSED
KafkaZkClientTest > testPropagateIsrChanges() STARTED
KafkaZkClientTest > testPropagateIsrChanges() PASSED
KafkaZkClientTest > testControllerEpochMethods() STARTED
KafkaZkClientTest > testControllerEpochMethods() PASSED
KafkaZkClientTest > testDeleteRecursive() STARTED
KafkaZkClientTest > testDeleteRecursive() PASSED
KafkaZkClientTest > testGetTopicPartitionStates() STARTED
KafkaZkClientTest > testGetTopicPartitionStates() PASSED
KafkaZkClientTest > testCreateConfigChangeNotification() STARTED
KafkaZkClientTest > testCreateConfigChangeNotification() PASSED
KafkaZkClientTest > testDelegationTokenMethods() STARTED
KafkaZkClientTest > testDelegationTokenMethods() PASSED
LiteralAclStoreTest > shouldHaveCorrectPaths() STARTED
LiteralAclStoreTest > shouldHaveCorrectPaths() PASSED
LiteralAclStoreTest > shouldRoundTripChangeNode() STARTED
LiteralAclStoreTest > shouldRoundTripChangeNode() PASSED
LiteralAclStoreTest > shouldThrowFromEncodeOnNoneLiteral() STARTED
LiteralAclStoreTest > shouldThrowFromEncodeOnNoneLiteral() PASSED
LiteralAclStoreTest > shouldWriteChangesToTheWritePath() STARTED
LiteralAclStoreTest > shouldWriteChangesToTheWritePath() PASSED
LiteralAclStoreTest > shouldHaveCorrectPatternType() STARTED
LiteralAclStoreTest > shouldHaveCorrectPatternType() PASSED
LiteralAclStoreTest > shouldDecodeResourceUsingTwoPartLogic() STARTED
LiteralAclStoreTest > shouldDecodeResourceUsingTwoPartLogic() PASSED
ReassignPartitionsZNodeTest > testDecodeInvalidJson() STARTED
ReassignPartitionsZNodeTest > testDecodeInvalidJson() PASSED
ReassignPartitionsZNodeTest > testEncode() STARTED
ReassignPartitionsZNodeTest > testEncode() PASSED
ReassignPartitionsZNodeTest > testDecodeValidJson() STARTED
ReassignPartitionsZNodeTest > testDecodeValidJson() PASSED
ControllerContextTest > testPartitionFullReplicaAssignmentReturnsEmptyAssignmentIfTopicOrPartitionDoesNotExist() STARTED
ControllerContextTest > testPartitionFullReplicaAssignmentReturnsEmptyAssignmentIfTopicOrPartitionDoesNotExist() PASSED
ControllerContextTest > testPartitionReplicaAssignmentForTopicReturnsEmptyMapIfTopicDoesNotExist() STARTED
ControllerContextTest > testPartitionReplicaAssignmentForTopicReturnsEmptyMapIfTopicDoesNotExist() PASSED
ControllerContextTest > testPreferredReplicaImbalanceMetric() STARTED
ControllerContextTest > testPreferredReplicaImbalanceMetric() PASSED
ControllerContextTest > testPartitionReplicaAssignmentForTopicReturnsExpectedReplicaAssignments() STARTED
ControllerContextTest > testPartitionReplicaAssignmentForTopicReturnsExpectedReplicaAssignments() PASSED
ControllerContextTest > testReassignTo() STARTED
ControllerContextTest > testReassignTo() PASSED
ControllerContextTest > testPartitionReplicaAssignment() STARTED
ControllerContextTest > testPartitionReplicaAssignment() PASSED
ControllerContextTest > testUpdatePartitionFullReplicaAssignmentUpdatesReplicaAssignment() STARTED
ControllerContextTest > testUpdatePartitionFullReplicaAssignmentUpdatesReplicaAssignment() PASSED
ControllerContextTest > testReassignToIdempotence() STARTED
ControllerContextTest > testReassignToIdempotence() PASSED
ControllerContextTest > testPartitionReplicaAssignmentReturnsEmptySeqIfTopicOrPartitionDoesNotExist() STARTED
ControllerContextTest > testPartitionReplicaAssignmentReturnsEmptySeqIfTopicOrPartitionDoesNotExist() PASSED
FAILURE: Build failed with an exception.
* What went wrong:
Execution failed for task ':connect:mirror:test'.
> There were failing tests. See the report at: file://<https://ci-builds.apache.org/job/Kafka/job/kafka-trunk-jdk11/ws/connect/mirror/build/reports/tests/test/index.html>
* Try:
Run with --stacktrace option to get the stack trace. Run with --info or --debug option to get more log output. Run with --scan to get full insights.
* Get more help at https://help.gradle.org
Deprecated Gradle features were used in this build, making it incompatible with Gradle 7.0.
Use '--warning-mode all' to show the individual deprecation warnings.
See https://docs.gradle.org/6.8.3/userguide/command_line_interface.html#sec:command_line_warnings
BUILD FAILED in 1h 41m 41s
257 actionable tasks: 220 executed, 37 up-to-date
Build step 'Execute shell' marked build as failure
Recording test results
[Checks API] No suitable checks publisher found.
Not sending mail to unregistered user github@hugo-hirsch.de
Build failed in Jenkins: Kafka » kafka-trunk-jdk11 #667
Posted by Apache Jenkins Server <je...@builds.apache.org>.
See <https://ci-builds.apache.org/job/Kafka/job/kafka-trunk-jdk11/667/display/redirect?page=changes>
Changes:
[github] KAFKA-12590: Remove deprecated kafka.security.auth.Authorizer, SimpleAclAuthorizer and related classes in 3.0 (#10450)
------------------------------------------
[...truncated 3.71 MB...]
KafkaZkClientTest > testSetTopicPartitionStatesRaw() PASSED
KafkaZkClientTest > testAclManagementMethods() STARTED
KafkaZkClientTest > testAclManagementMethods() PASSED
KafkaZkClientTest > testPreferredReplicaElectionMethods() STARTED
KafkaZkClientTest > testPreferredReplicaElectionMethods() PASSED
KafkaZkClientTest > testPropagateLogDir() STARTED
KafkaZkClientTest > testPropagateLogDir() PASSED
KafkaZkClientTest > testGetDataAndStat() STARTED
KafkaZkClientTest > testGetDataAndStat() PASSED
KafkaZkClientTest > testReassignPartitionsInProgress() STARTED
KafkaZkClientTest > testReassignPartitionsInProgress() PASSED
KafkaZkClientTest > testCreateTopLevelPaths() STARTED
KafkaZkClientTest > testCreateTopLevelPaths() PASSED
KafkaZkClientTest > testGetAllTopicsInClusterDoesNotTriggerWatch() STARTED
KafkaZkClientTest > testGetAllTopicsInClusterDoesNotTriggerWatch() PASSED
KafkaZkClientTest > testIsrChangeNotificationGetters() STARTED
KafkaZkClientTest > testIsrChangeNotificationGetters() PASSED
KafkaZkClientTest > testLogDirEventNotificationsDeletion() STARTED
KafkaZkClientTest > testLogDirEventNotificationsDeletion() PASSED
KafkaZkClientTest > testGetLogConfigs() STARTED
KafkaZkClientTest > testGetLogConfigs() PASSED
KafkaZkClientTest > testBrokerSequenceIdMethods() STARTED
KafkaZkClientTest > testBrokerSequenceIdMethods() PASSED
KafkaZkClientTest > testAclMethods() STARTED
KafkaZkClientTest > testAclMethods() PASSED
KafkaZkClientTest > testCreateSequentialPersistentPath() STARTED
KafkaZkClientTest > testCreateSequentialPersistentPath() PASSED
KafkaZkClientTest > testConditionalUpdatePath() STARTED
KafkaZkClientTest > testConditionalUpdatePath() PASSED
KafkaZkClientTest > testGetAllTopicsInClusterTriggersWatch() STARTED
KafkaZkClientTest > testGetAllTopicsInClusterTriggersWatch() PASSED
KafkaZkClientTest > testDeleteTopicZNode() STARTED
KafkaZkClientTest > testDeleteTopicZNode() PASSED
KafkaZkClientTest > testDeletePath() STARTED
KafkaZkClientTest > testDeletePath() PASSED
KafkaZkClientTest > testGetBrokerMethods() STARTED
KafkaZkClientTest > testGetBrokerMethods() PASSED
KafkaZkClientTest > testCreateTokenChangeNotification() STARTED
KafkaZkClientTest > testCreateTokenChangeNotification() PASSED
KafkaZkClientTest > testGetTopicsAndPartitions() STARTED
KafkaZkClientTest > testGetTopicsAndPartitions() PASSED
KafkaZkClientTest > testRegisterBrokerInfo() STARTED
KafkaZkClientTest > testRegisterBrokerInfo() PASSED
KafkaZkClientTest > testRetryRegisterBrokerInfo() STARTED
KafkaZkClientTest > testRetryRegisterBrokerInfo() PASSED
KafkaZkClientTest > testConsumerOffsetPath() STARTED
KafkaZkClientTest > testConsumerOffsetPath() PASSED
KafkaZkClientTest > testDeleteRecursiveWithControllerEpochVersionCheck() STARTED
KafkaZkClientTest > testDeleteRecursiveWithControllerEpochVersionCheck() PASSED
KafkaZkClientTest > testTopicAssignments() STARTED
KafkaZkClientTest > testTopicAssignments() PASSED
KafkaZkClientTest > testControllerManagementMethods() STARTED
KafkaZkClientTest > testControllerManagementMethods() PASSED
KafkaZkClientTest > testTopicAssignmentMethods() STARTED
KafkaZkClientTest > testTopicAssignmentMethods() PASSED
KafkaZkClientTest > testConnectionViaNettyClient() STARTED
KafkaZkClientTest > testConnectionViaNettyClient() PASSED
KafkaZkClientTest > testPropagateIsrChanges() STARTED
KafkaZkClientTest > testPropagateIsrChanges() PASSED
KafkaZkClientTest > testControllerEpochMethods() STARTED
KafkaZkClientTest > testControllerEpochMethods() PASSED
KafkaZkClientTest > testDeleteRecursive() STARTED
KafkaZkClientTest > testDeleteRecursive() PASSED
KafkaZkClientTest > testGetTopicPartitionStates() STARTED
KafkaZkClientTest > testGetTopicPartitionStates() PASSED
KafkaZkClientTest > testCreateConfigChangeNotification() STARTED
KafkaZkClientTest > testCreateConfigChangeNotification() PASSED
KafkaZkClientTest > testDelegationTokenMethods() STARTED
KafkaZkClientTest > testDelegationTokenMethods() PASSED
LiteralAclStoreTest > shouldHaveCorrectPaths() STARTED
LiteralAclStoreTest > shouldHaveCorrectPaths() PASSED
LiteralAclStoreTest > shouldRoundTripChangeNode() STARTED
LiteralAclStoreTest > shouldRoundTripChangeNode() PASSED
LiteralAclStoreTest > shouldThrowFromEncodeOnNoneLiteral() STARTED
LiteralAclStoreTest > shouldThrowFromEncodeOnNoneLiteral() PASSED
LiteralAclStoreTest > shouldWriteChangesToTheWritePath() STARTED
LiteralAclStoreTest > shouldWriteChangesToTheWritePath() PASSED
LiteralAclStoreTest > shouldHaveCorrectPatternType() STARTED
LiteralAclStoreTest > shouldHaveCorrectPatternType() PASSED
LiteralAclStoreTest > shouldDecodeResourceUsingTwoPartLogic() STARTED
LiteralAclStoreTest > shouldDecodeResourceUsingTwoPartLogic() PASSED
ReassignPartitionsZNodeTest > testDecodeInvalidJson() STARTED
ReassignPartitionsZNodeTest > testDecodeInvalidJson() PASSED
ReassignPartitionsZNodeTest > testEncode() STARTED
ReassignPartitionsZNodeTest > testEncode() PASSED
ReassignPartitionsZNodeTest > testDecodeValidJson() STARTED
ReassignPartitionsZNodeTest > testDecodeValidJson() PASSED
ControllerContextTest > testPartitionFullReplicaAssignmentReturnsEmptyAssignmentIfTopicOrPartitionDoesNotExist() STARTED
ControllerContextTest > testPartitionFullReplicaAssignmentReturnsEmptyAssignmentIfTopicOrPartitionDoesNotExist() PASSED
ControllerContextTest > testPartitionReplicaAssignmentForTopicReturnsEmptyMapIfTopicDoesNotExist() STARTED
ControllerContextTest > testPartitionReplicaAssignmentForTopicReturnsEmptyMapIfTopicDoesNotExist() PASSED
ControllerContextTest > testPreferredReplicaImbalanceMetric() STARTED
ControllerContextTest > testPreferredReplicaImbalanceMetric() PASSED
ControllerContextTest > testPartitionReplicaAssignmentForTopicReturnsExpectedReplicaAssignments() STARTED
ControllerContextTest > testPartitionReplicaAssignmentForTopicReturnsExpectedReplicaAssignments() PASSED
ControllerContextTest > testReassignTo() STARTED
ControllerContextTest > testReassignTo() PASSED
ControllerContextTest > testPartitionReplicaAssignment() STARTED
ControllerContextTest > testPartitionReplicaAssignment() PASSED
ControllerContextTest > testUpdatePartitionFullReplicaAssignmentUpdatesReplicaAssignment() STARTED
ControllerContextTest > testUpdatePartitionFullReplicaAssignmentUpdatesReplicaAssignment() PASSED
ControllerContextTest > testReassignToIdempotence() STARTED
ControllerContextTest > testReassignToIdempotence() PASSED
ControllerContextTest > testPartitionReplicaAssignmentReturnsEmptySeqIfTopicOrPartitionDoesNotExist() STARTED
ControllerContextTest > testPartitionReplicaAssignmentReturnsEmptySeqIfTopicOrPartitionDoesNotExist() PASSED
3434 tests completed, 1 failed, 7 skipped
> Task :core:test FAILED
FAILURE: Build completed with 2 failures.
1: Task failed with an exception.
-----------
* What went wrong:
Execution failed for task ':connect:mirror:test'.
> There were failing tests. See the report at: file://<https://ci-builds.apache.org/job/Kafka/job/kafka-trunk-jdk11/ws/connect/mirror/build/reports/tests/test/index.html>
* Try:
Run with --stacktrace option to get the stack trace. Run with --info or --debug option to get more log output. Run with --scan to get full insights.
==============================================================================
2: Task failed with an exception.
-----------
* What went wrong:
Execution failed for task ':core:test'.
> There were failing tests. See the report at: file://<https://ci-builds.apache.org/job/Kafka/job/kafka-trunk-jdk11/ws/core/build/reports/tests/test/index.html>
* Try:
Run with --stacktrace option to get the stack trace. Run with --info or --debug option to get more log output. Run with --scan to get full insights.
==============================================================================
* Get more help at https://help.gradle.org
Deprecated Gradle features were used in this build, making it incompatible with Gradle 7.0.
Use '--warning-mode all' to show the individual deprecation warnings.
See https://docs.gradle.org/6.8.3/userguide/command_line_interface.html#sec:command_line_warnings
BUILD FAILED in 1h 39m 3s
257 actionable tasks: 220 executed, 37 up-to-date
Build step 'Execute shell' marked build as failure
Recording test results
[Checks API] No suitable checks publisher found.
Not sending mail to unregistered user github@hugo-hirsch.de
Build failed in Jenkins: Kafka » kafka-trunk-jdk11 #666
Posted by Apache Jenkins Server <je...@builds.apache.org>.
See <https://ci-builds.apache.org/job/Kafka/job/kafka-trunk-jdk11/666/display/redirect?page=changes>
Changes:
[github] KAFKA-3968: fsync the parent directory of a segment file when the file is created (#10405)
------------------------------------------
[...truncated 3.72 MB...]
KafkaZkClientTest > testDeleteTopicPathMethods() PASSED
KafkaZkClientTest > testSetTopicPartitionStatesRaw() STARTED
KafkaZkClientTest > testSetTopicPartitionStatesRaw() PASSED
KafkaZkClientTest > testAclManagementMethods() STARTED
KafkaZkClientTest > testAclManagementMethods() PASSED
KafkaZkClientTest > testPreferredReplicaElectionMethods() STARTED
KafkaZkClientTest > testPreferredReplicaElectionMethods() PASSED
KafkaZkClientTest > testPropagateLogDir() STARTED
KafkaZkClientTest > testPropagateLogDir() PASSED
KafkaZkClientTest > testGetDataAndStat() STARTED
KafkaZkClientTest > testGetDataAndStat() PASSED
KafkaZkClientTest > testReassignPartitionsInProgress() STARTED
KafkaZkClientTest > testReassignPartitionsInProgress() PASSED
KafkaZkClientTest > testCreateTopLevelPaths() STARTED
KafkaZkClientTest > testCreateTopLevelPaths() PASSED
KafkaZkClientTest > testGetAllTopicsInClusterDoesNotTriggerWatch() STARTED
KafkaZkClientTest > testGetAllTopicsInClusterDoesNotTriggerWatch() PASSED
KafkaZkClientTest > testIsrChangeNotificationGetters() STARTED
KafkaZkClientTest > testIsrChangeNotificationGetters() PASSED
KafkaZkClientTest > testLogDirEventNotificationsDeletion() STARTED
KafkaZkClientTest > testLogDirEventNotificationsDeletion() PASSED
KafkaZkClientTest > testGetLogConfigs() STARTED
KafkaZkClientTest > testGetLogConfigs() PASSED
KafkaZkClientTest > testBrokerSequenceIdMethods() STARTED
KafkaZkClientTest > testBrokerSequenceIdMethods() PASSED
KafkaZkClientTest > testAclMethods() STARTED
KafkaZkClientTest > testAclMethods() PASSED
KafkaZkClientTest > testCreateSequentialPersistentPath() STARTED
KafkaZkClientTest > testCreateSequentialPersistentPath() PASSED
KafkaZkClientTest > testConditionalUpdatePath() STARTED
KafkaZkClientTest > testConditionalUpdatePath() PASSED
KafkaZkClientTest > testGetAllTopicsInClusterTriggersWatch() STARTED
KafkaZkClientTest > testGetAllTopicsInClusterTriggersWatch() PASSED
KafkaZkClientTest > testDeleteTopicZNode() STARTED
KafkaZkClientTest > testDeleteTopicZNode() PASSED
KafkaZkClientTest > testDeletePath() STARTED
KafkaZkClientTest > testDeletePath() PASSED
KafkaZkClientTest > testGetBrokerMethods() STARTED
KafkaZkClientTest > testGetBrokerMethods() PASSED
KafkaZkClientTest > testCreateTokenChangeNotification() STARTED
KafkaZkClientTest > testCreateTokenChangeNotification() PASSED
KafkaZkClientTest > testGetTopicsAndPartitions() STARTED
KafkaZkClientTest > testGetTopicsAndPartitions() PASSED
KafkaZkClientTest > testRegisterBrokerInfo() STARTED
KafkaZkClientTest > testRegisterBrokerInfo() PASSED
KafkaZkClientTest > testRetryRegisterBrokerInfo() STARTED
KafkaZkClientTest > testRetryRegisterBrokerInfo() PASSED
KafkaZkClientTest > testConsumerOffsetPath() STARTED
KafkaZkClientTest > testConsumerOffsetPath() PASSED
KafkaZkClientTest > testDeleteRecursiveWithControllerEpochVersionCheck() STARTED
KafkaZkClientTest > testDeleteRecursiveWithControllerEpochVersionCheck() PASSED
KafkaZkClientTest > testTopicAssignments() STARTED
KafkaZkClientTest > testTopicAssignments() PASSED
KafkaZkClientTest > testControllerManagementMethods() STARTED
KafkaZkClientTest > testControllerManagementMethods() PASSED
KafkaZkClientTest > testTopicAssignmentMethods() STARTED
KafkaZkClientTest > testTopicAssignmentMethods() PASSED
KafkaZkClientTest > testConnectionViaNettyClient() STARTED
KafkaZkClientTest > testConnectionViaNettyClient() PASSED
KafkaZkClientTest > testPropagateIsrChanges() STARTED
KafkaZkClientTest > testPropagateIsrChanges() PASSED
KafkaZkClientTest > testControllerEpochMethods() STARTED
KafkaZkClientTest > testControllerEpochMethods() PASSED
KafkaZkClientTest > testDeleteRecursive() STARTED
KafkaZkClientTest > testDeleteRecursive() PASSED
KafkaZkClientTest > testGetTopicPartitionStates() STARTED
KafkaZkClientTest > testGetTopicPartitionStates() PASSED
KafkaZkClientTest > testCreateConfigChangeNotification() STARTED
KafkaZkClientTest > testCreateConfigChangeNotification() PASSED
KafkaZkClientTest > testDelegationTokenMethods() STARTED
KafkaZkClientTest > testDelegationTokenMethods() PASSED
LiteralAclStoreTest > shouldHaveCorrectPaths() STARTED
LiteralAclStoreTest > shouldHaveCorrectPaths() PASSED
LiteralAclStoreTest > shouldRoundTripChangeNode() STARTED
LiteralAclStoreTest > shouldRoundTripChangeNode() PASSED
LiteralAclStoreTest > shouldThrowFromEncodeOnNoneLiteral() STARTED
LiteralAclStoreTest > shouldThrowFromEncodeOnNoneLiteral() PASSED
LiteralAclStoreTest > shouldWriteChangesToTheWritePath() STARTED
LiteralAclStoreTest > shouldWriteChangesToTheWritePath() PASSED
LiteralAclStoreTest > shouldHaveCorrectPatternType() STARTED
LiteralAclStoreTest > shouldHaveCorrectPatternType() PASSED
LiteralAclStoreTest > shouldDecodeResourceUsingTwoPartLogic() STARTED
LiteralAclStoreTest > shouldDecodeResourceUsingTwoPartLogic() PASSED
ReassignPartitionsZNodeTest > testDecodeInvalidJson() STARTED
ReassignPartitionsZNodeTest > testDecodeInvalidJson() PASSED
ReassignPartitionsZNodeTest > testEncode() STARTED
ReassignPartitionsZNodeTest > testEncode() PASSED
ReassignPartitionsZNodeTest > testDecodeValidJson() STARTED
ReassignPartitionsZNodeTest > testDecodeValidJson() PASSED
ControllerContextTest > testPartitionFullReplicaAssignmentReturnsEmptyAssignmentIfTopicOrPartitionDoesNotExist() STARTED
ControllerContextTest > testPartitionFullReplicaAssignmentReturnsEmptyAssignmentIfTopicOrPartitionDoesNotExist() PASSED
ControllerContextTest > testPartitionReplicaAssignmentForTopicReturnsEmptyMapIfTopicDoesNotExist() STARTED
ControllerContextTest > testPartitionReplicaAssignmentForTopicReturnsEmptyMapIfTopicDoesNotExist() PASSED
ControllerContextTest > testPreferredReplicaImbalanceMetric() STARTED
ControllerContextTest > testPreferredReplicaImbalanceMetric() PASSED
ControllerContextTest > testPartitionReplicaAssignmentForTopicReturnsExpectedReplicaAssignments() STARTED
ControllerContextTest > testPartitionReplicaAssignmentForTopicReturnsExpectedReplicaAssignments() PASSED
ControllerContextTest > testReassignTo() STARTED
ControllerContextTest > testReassignTo() PASSED
ControllerContextTest > testPartitionReplicaAssignment() STARTED
ControllerContextTest > testPartitionReplicaAssignment() PASSED
ControllerContextTest > testUpdatePartitionFullReplicaAssignmentUpdatesReplicaAssignment() STARTED
ControllerContextTest > testUpdatePartitionFullReplicaAssignmentUpdatesReplicaAssignment() PASSED
ControllerContextTest > testReassignToIdempotence() STARTED
ControllerContextTest > testReassignToIdempotence() PASSED
ControllerContextTest > testPartitionReplicaAssignmentReturnsEmptySeqIfTopicOrPartitionDoesNotExist() STARTED
ControllerContextTest > testPartitionReplicaAssignmentReturnsEmptySeqIfTopicOrPartitionDoesNotExist() PASSED
FAILURE: Build completed with 2 failures.
1: Task failed with an exception.
-----------
* What went wrong:
Execution failed for task ':connect:mirror:test'.
> There were failing tests. See the report at: file://<https://ci-builds.apache.org/job/Kafka/job/kafka-trunk-jdk11/ws/connect/mirror/build/reports/tests/test/index.html>
* Try:
Run with --stacktrace option to get the stack trace. Run with --info or --debug option to get more log output. Run with --scan to get full insights.
==============================================================================
2: Task failed with an exception.
-----------
* What went wrong:
Execution failed for task ':streams:test'.
> There were failing tests. See the report at: file://<https://ci-builds.apache.org/job/Kafka/job/kafka-trunk-jdk11/ws/streams/build/reports/tests/test/index.html>
* Try:
Run with --stacktrace option to get the stack trace. Run with --info or --debug option to get more log output. Run with --scan to get full insights.
==============================================================================
* Get more help at https://help.gradle.org
Deprecated Gradle features were used in this build, making it incompatible with Gradle 7.0.
Use '--warning-mode all' to show the individual deprecation warnings.
See https://docs.gradle.org/6.8.3/userguide/command_line_interface.html#sec:command_line_warnings
BUILD FAILED in 1h 47m 36s
257 actionable tasks: 220 executed, 37 up-to-date
Build step 'Execute shell' marked build as failure
Recording test results
[Checks API] No suitable checks publisher found.
Not sending mail to unregistered user github@hugo-hirsch.de