You are viewing a plain text version of this content. The canonical link for it is here.
Posted to dev@mahout.apache.org by Apache Jenkins Server <je...@builds.apache.org> on 2014/03/11 20:44:36 UTC
Build failed in Jenkins: Mahout-Quality #2513
See <https://builds.apache.org/job/Mahout-Quality/2513/>
------------------------------------------
[...truncated 1122 lines...]
A examples/src/main/java/org/apache/mahout/clustering
A examples/src/main/java/org/apache/mahout/clustering/streaming
A examples/src/main/java/org/apache/mahout/clustering/streaming/tools
A examples/src/main/java/org/apache/mahout/clustering/streaming/tools/ResplitSequenceFiles.java
A examples/src/main/java/org/apache/mahout/clustering/streaming/tools/IOUtils.java
A examples/src/main/java/org/apache/mahout/clustering/streaming/tools/ClusterQualitySummarizer.java
A examples/src/main/java/org/apache/mahout/clustering/syntheticcontrol
A examples/src/main/java/org/apache/mahout/clustering/syntheticcontrol/fuzzykmeans
A examples/src/main/java/org/apache/mahout/clustering/syntheticcontrol/fuzzykmeans/Job.java
A examples/src/main/java/org/apache/mahout/clustering/syntheticcontrol/canopy
A examples/src/main/java/org/apache/mahout/clustering/syntheticcontrol/canopy/Job.java
A examples/src/main/java/org/apache/mahout/clustering/syntheticcontrol/kmeans
A examples/src/main/java/org/apache/mahout/clustering/syntheticcontrol/kmeans/Job.java
A examples/src/main/java/org/apache/mahout/clustering/display
A examples/src/main/java/org/apache/mahout/clustering/display/DisplayCanopy.java
A examples/src/main/java/org/apache/mahout/clustering/display/DisplaySpectralKMeans.java
A examples/src/main/java/org/apache/mahout/clustering/display/DisplayKMeans.java
A examples/src/main/java/org/apache/mahout/clustering/display/DisplayClustering.java
A examples/src/main/java/org/apache/mahout/clustering/display/ClustersFilter.java
A examples/src/main/java/org/apache/mahout/clustering/display/README.txt
A examples/src/main/java/org/apache/mahout/clustering/display/DisplayFuzzyKMeans.java
A examples/src/main/java/org/apache/mahout/fpm
A examples/src/main/java/org/apache/mahout/fpm/pfpgrowth
A examples/src/main/java/org/apache/mahout/fpm/pfpgrowth/dataset
A examples/src/main/java/org/apache/mahout/fpm/pfpgrowth/dataset/KeyBasedStringTupleCombiner.java
A examples/src/main/java/org/apache/mahout/fpm/pfpgrowth/dataset/KeyBasedStringTupleGrouper.java
A examples/src/main/java/org/apache/mahout/fpm/pfpgrowth/dataset/KeyBasedStringTupleMapper.java
A examples/src/main/java/org/apache/mahout/fpm/pfpgrowth/dataset/KeyBasedStringTupleReducer.java
A examples/src/main/java/org/apache/mahout/fpm/pfpgrowth/DeliciousTagsExample.java
A examples/src/main/java/org/apache/mahout/classifier
A examples/src/main/java/org/apache/mahout/classifier/email
A examples/src/main/java/org/apache/mahout/classifier/email/PrepEmailVectorsDriver.java
A examples/src/main/java/org/apache/mahout/classifier/email/PrepEmailMapper.java
A examples/src/main/java/org/apache/mahout/classifier/email/PrepEmailReducer.java
A examples/src/main/java/org/apache/mahout/classifier/sequencelearning
A examples/src/main/java/org/apache/mahout/classifier/sequencelearning/hmm
A examples/src/main/java/org/apache/mahout/classifier/sequencelearning/hmm/PosTagger.java
A examples/src/main/java/org/apache/mahout/classifier/NewsgroupHelper.java
A examples/src/main/java/org/apache/mahout/classifier/df
A examples/src/main/java/org/apache/mahout/classifier/df/mapreduce
A examples/src/main/java/org/apache/mahout/classifier/df/mapreduce/BuildForest.java
A examples/src/main/java/org/apache/mahout/classifier/df/mapreduce/TestForest.java
A examples/src/main/java/org/apache/mahout/classifier/df/BreimanExample.java
A examples/src/main/java/org/apache/mahout/classifier/sgd
A examples/src/main/java/org/apache/mahout/classifier/sgd/SGDInfo.java
A examples/src/main/java/org/apache/mahout/classifier/sgd/TrainAdaptiveLogistic.java
A examples/src/main/java/org/apache/mahout/classifier/sgd/TrainNewsGroups.java
A examples/src/main/java/org/apache/mahout/classifier/sgd/TrainLogistic.java
A examples/src/main/java/org/apache/mahout/classifier/sgd/TestNewsGroups.java
A examples/src/main/java/org/apache/mahout/classifier/sgd/SGDHelper.java
A examples/src/main/java/org/apache/mahout/classifier/sgd/TrainASFEmail.java
A examples/src/main/java/org/apache/mahout/classifier/sgd/AdaptiveLogisticModelParameters.java
A examples/src/main/java/org/apache/mahout/classifier/sgd/RunAdaptiveLogistic.java
A examples/src/main/java/org/apache/mahout/classifier/sgd/TestASFEmail.java
A examples/src/main/java/org/apache/mahout/classifier/sgd/LogisticModelParameters.java
A examples/src/main/java/org/apache/mahout/classifier/sgd/RunLogistic.java
A examples/src/main/java/org/apache/mahout/classifier/sgd/SimpleCsvExamples.java
A examples/src/main/java/org/apache/mahout/classifier/sgd/PrintResourceOrFile.java
A examples/src/main/java/org/apache/mahout/classifier/sgd/ValidateAdaptiveLogistic.java
A examples/bin
AU examples/bin/create-rf-data.sh
A examples/bin/factorize-movielens-1M.sh
A examples/bin/README.txt
AU examples/bin/cluster-reuters.sh
AU examples/bin/classify-20newsgroups.sh
AU examples/bin/run-rf.sh
AU examples/bin/cluster-syntheticcontrol.sh
A examples/bin/lda.algorithm
A examples/bin/factorize-netflix.sh
A examples/pom.xml
AU examples/build.xml
A distribution
ERROR: Failed to check out http://svn.apache.org/repos/asf/mahout/trunk
org.tmatesoft.svn.core.SVNException: svn: E175002: REPORT /repos/asf/!svn/vcc/default failed
at org.tmatesoft.svn.core.internal.io.dav.http.HTTPConnection.request(HTTPConnection.java:388)
at org.tmatesoft.svn.core.internal.io.dav.http.HTTPConnection.request(HTTPConnection.java:373)
at org.tmatesoft.svn.core.internal.io.dav.http.HTTPConnection.request(HTTPConnection.java:361)
at org.tmatesoft.svn.core.internal.io.dav.DAVConnection.performHttpRequest(DAVConnection.java:707)
at org.tmatesoft.svn.core.internal.io.dav.DAVConnection.doReport(DAVConnection.java:334)
at org.tmatesoft.svn.core.internal.io.dav.DAVRepository.runReport(DAVRepository.java:1291)
at org.tmatesoft.svn.core.internal.io.dav.DAVRepository.update(DAVRepository.java:839)
at org.tmatesoft.svn.core.internal.wc16.SVNUpdateClient16.update(SVNUpdateClient16.java:507)
at org.tmatesoft.svn.core.internal.wc16.SVNUpdateClient16.doCheckout(SVNUpdateClient16.java:915)
at org.tmatesoft.svn.core.internal.wc2.old.SvnOldCheckout.run(SvnOldCheckout.java:19)
at org.tmatesoft.svn.core.internal.wc2.old.SvnOldCheckout.run(SvnOldCheckout.java:8)
at org.tmatesoft.svn.core.internal.wc2.SvnOperationRunner.run(SvnOperationRunner.java:20)
at org.tmatesoft.svn.core.wc2.SvnOperationFactory.run(SvnOperationFactory.java:1238)
at org.tmatesoft.svn.core.wc2.SvnOperation.run(SvnOperation.java:294)
at org.tmatesoft.svn.core.wc.SVNUpdateClient.doCheckout(SVNUpdateClient.java:777)
at hudson.scm.subversion.CheckoutUpdater$1.perform(CheckoutUpdater.java:99)
at hudson.scm.subversion.WorkspaceUpdater$UpdateTask.delegateTo(WorkspaceUpdater.java:161)
at hudson.scm.SubversionSCM$CheckOutTask.perform(SubversionSCM.java:908)
at hudson.scm.SubversionSCM$CheckOutTask.invoke(SubversionSCM.java:889)
at hudson.scm.SubversionSCM$CheckOutTask.invoke(SubversionSCM.java:872)
at hudson.FilePath$FileCallableWrapper.call(FilePath.java:2461)
at hudson.remoting.UserRequest.perform(UserRequest.java:118)
at hudson.remoting.UserRequest.perform(UserRequest.java:48)
at hudson.remoting.Request$2.run(Request.java:328)
at hudson.remoting.InterceptingExecutorService$1.call(InterceptingExecutorService.java:72)
at java.util.concurrent.FutureTask.run(FutureTask.java:262)
at java.util.concurrent.ThreadPoolExecutor.runWorker(ThreadPoolExecutor.java:1145)
at java.util.concurrent.ThreadPoolExecutor$Worker.run(ThreadPoolExecutor.java:615)
at java.lang.Thread.run(Thread.java:744)
Caused by: svn: E175002: REPORT /repos/asf/!svn/vcc/default failed
at org.tmatesoft.svn.core.SVNErrorMessage.create(SVNErrorMessage.java:208)
at org.tmatesoft.svn.core.SVNErrorMessage.create(SVNErrorMessage.java:154)
at org.tmatesoft.svn.core.SVNErrorMessage.create(SVNErrorMessage.java:97)
... 29 more
Caused by: org.tmatesoft.svn.core.SVNException: svn: E204899: REPORT request failed on '/repos/asf/!svn/vcc/default'
svn: E204899: Cannot create new file '/home/hudson/jenkins-slave/workspace/Mahout-Quality/trunk/distribution/src/.svn/lock': No such file or directory
at org.tmatesoft.svn.core.internal.wc.SVNErrorManager.error(SVNErrorManager.java:64)
at org.tmatesoft.svn.core.internal.wc.SVNErrorManager.error(SVNErrorManager.java:51)
at org.tmatesoft.svn.core.internal.io.dav.http.HTTPConnection._request(HTTPConnection.java:771)
at org.tmatesoft.svn.core.internal.io.dav.http.HTTPConnection.request(HTTPConnection.java:382)
... 28 more
Caused by: svn: E204899: REPORT request failed on '/repos/asf/!svn/vcc/default'
at org.tmatesoft.svn.core.SVNErrorMessage.create(SVNErrorMessage.java:208)
at org.tmatesoft.svn.core.SVNErrorMessage.create(SVNErrorMessage.java:154)
at org.tmatesoft.svn.core.SVNErrorMessage.create(SVNErrorMessage.java:97)
at org.tmatesoft.svn.core.SVNErrorMessage.wrap(SVNErrorMessage.java:407)
... 30 more
Caused by: svn: E204899: Cannot create new file '/home/hudson/jenkins-slave/workspace/Mahout-Quality/trunk/distribution/src/.svn/lock': No such file or directory
at org.tmatesoft.svn.core.SVNErrorMessage.create(SVNErrorMessage.java:208)
at org.tmatesoft.svn.core.SVNErrorMessage.create(SVNErrorMessage.java:189)
at org.tmatesoft.svn.core.SVNErrorMessage.create(SVNErrorMessage.java:141)
at org.tmatesoft.svn.core.internal.wc.SVNFileUtil.createEmptyFile(SVNFileUtil.java:342)
at org.tmatesoft.svn.core.internal.wc.admin.SVNAdminArea14.createVersionedDirectory(SVNAdminArea14.java:1553)
at org.tmatesoft.svn.core.internal.wc.admin.SVNAdminArea16Factory.doCreateVersionedDirectory(SVNAdminArea16Factory.java:30)
at org.tmatesoft.svn.core.internal.wc.admin.SVNAdminAreaFactory.createVersionedDirectory(SVNAdminAreaFactory.java:241)
at org.tmatesoft.svn.core.internal.wc.SVNWCManager.ensureAdminAreaExists(SVNWCManager.java:407)
at org.tmatesoft.svn.core.internal.wc.SVNUpdateEditor.addDir(SVNUpdateEditor.java:762)
at org.tmatesoft.svn.core.internal.wc.SVNCancellableEditor.addDir(SVNCancellableEditor.java:84)
at org.tmatesoft.svn.core.internal.io.dav.handlers.DAVEditorHandler.startElement(DAVEditorHandler.java:326)
at org.tmatesoft.svn.core.internal.io.dav.handlers.BasicDAVHandler.startElement(BasicDAVHandler.java:89)
at com.sun.org.apache.xerces.internal.parsers.AbstractSAXParser.startElement(AbstractSAXParser.java:509)
at com.sun.org.apache.xerces.internal.impl.XMLNSDocumentScannerImpl.scanStartElement(XMLNSDocumentScannerImpl.java:378)
at com.sun.org.apache.xerces.internal.impl.XMLDocumentFragmentScannerImpl$FragmentContentDriver.next(XMLDocumentFragmentScannerImpl.java:2778)
at com.sun.org.apache.xerces.internal.impl.XMLDocumentScannerImpl.next(XMLDocumentScannerImpl.java:606)
at com.sun.org.apache.xerces.internal.impl.XMLNSDocumentScannerImpl.next(XMLNSDocumentScannerImpl.java:117)
at com.sun.org.apache.xerces.internal.impl.XMLDocumentFragmentScannerImpl.scanDocument(XMLDocumentFragmentScannerImpl.java:510)
at com.sun.org.apache.xerces.internal.parsers.XML11Configuration.parse(XML11Configuration.java:848)
at com.sun.org.apache.xerces.internal.parsers.XML11Configuration.parse(XML11Configuration.java:777)
at com.sun.org.apache.xerces.internal.parsers.XMLParser.parse(XMLParser.java:141)
at com.sun.org.apache.xerces.internal.parsers.AbstractSAXParser.parse(AbstractSAXParser.java:1213)
at com.sun.org.apache.xerces.internal.jaxp.SAXParserImpl$JAXPSAXParser.parse(SAXParserImpl.java:649)
at org.tmatesoft.svn.core.internal.io.dav.http.HTTPConnection.readData(HTTPConnection.java:911)
at org.tmatesoft.svn.core.internal.io.dav.http.HTTPConnection.readData(HTTPConnection.java:876)
at org.tmatesoft.svn.core.internal.io.dav.http.HTTPRequest.dispatch(HTTPRequest.java:220)
at org.tmatesoft.svn.core.internal.io.dav.http.HTTPConnection._request(HTTPConnection.java:480)
... 29 more
java.io.IOException: remote file operation failed: <https://builds.apache.org/job/Mahout-Quality/ws/> at hudson.remoting.Channel@1211434:ubuntu2
at hudson.FilePath.act(FilePath.java:910)
at hudson.FilePath.act(FilePath.java:887)
at hudson.scm.SubversionSCM.checkout(SubversionSCM.java:848)
at hudson.scm.SubversionSCM.checkout(SubversionSCM.java:786)
at hudson.model.AbstractProject.checkout(AbstractProject.java:1411)
at hudson.model.AbstractBuild$AbstractBuildExecution.defaultCheckout(AbstractBuild.java:651)
at jenkins.scm.SCMCheckoutStrategy.checkout(SCMCheckoutStrategy.java:88)
at hudson.model.AbstractBuild$AbstractBuildExecution.run(AbstractBuild.java:560)
at hudson.model.Run.execute(Run.java:1670)
at hudson.model.FreeStyleBuild.run(FreeStyleBuild.java:46)
at hudson.model.ResourceController.execute(ResourceController.java:88)
at hudson.model.Executor.run(Executor.java:231)
Caused by: java.io.IOException: Failed to check out http://svn.apache.org/repos/asf/mahout/trunk
at hudson.scm.subversion.CheckoutUpdater$1.perform(CheckoutUpdater.java:110)
at hudson.scm.subversion.WorkspaceUpdater$UpdateTask.delegateTo(WorkspaceUpdater.java:161)
at hudson.scm.SubversionSCM$CheckOutTask.perform(SubversionSCM.java:908)
at hudson.scm.SubversionSCM$CheckOutTask.invoke(SubversionSCM.java:889)
at hudson.scm.SubversionSCM$CheckOutTask.invoke(SubversionSCM.java:872)
at hudson.FilePath$FileCallableWrapper.call(FilePath.java:2461)
at hudson.remoting.UserRequest.perform(UserRequest.java:118)
at hudson.remoting.UserRequest.perform(UserRequest.java:48)
at hudson.remoting.Request$2.run(Request.java:328)
at hudson.remoting.InterceptingExecutorService$1.call(InterceptingExecutorService.java:72)
at java.util.concurrent.FutureTask.run(FutureTask.java:262)
at java.util.concurrent.ThreadPoolExecutor.runWorker(ThreadPoolExecutor.java:1145)
at java.util.concurrent.ThreadPoolExecutor$Worker.run(ThreadPoolExecutor.java:615)
at java.lang.Thread.run(Thread.java:744)
Caused by: org.tmatesoft.svn.core.SVNException: svn: E175002: REPORT /repos/asf/!svn/vcc/default failed
at org.tmatesoft.svn.core.internal.io.dav.http.HTTPConnection.request(HTTPConnection.java:388)
at org.tmatesoft.svn.core.internal.io.dav.http.HTTPConnection.request(HTTPConnection.java:373)
at org.tmatesoft.svn.core.internal.io.dav.http.HTTPConnection.request(HTTPConnection.java:361)
at org.tmatesoft.svn.core.internal.io.dav.DAVConnection.performHttpRequest(DAVConnection.java:707)
at org.tmatesoft.svn.core.internal.io.dav.DAVConnection.doReport(DAVConnection.java:334)
at org.tmatesoft.svn.core.internal.io.dav.DAVRepository.runReport(DAVRepository.java:1291)
at org.tmatesoft.svn.core.internal.io.dav.DAVRepository.update(DAVRepository.java:839)
at org.tmatesoft.svn.core.internal.wc16.SVNUpdateClient16.update(SVNUpdateClient16.java:507)
at org.tmatesoft.svn.core.internal.wc16.SVNUpdateClient16.doCheckout(SVNUpdateClient16.java:915)
at org.tmatesoft.svn.core.internal.wc2.old.SvnOldCheckout.run(SvnOldCheckout.java:19)
at org.tmatesoft.svn.core.internal.wc2.old.SvnOldCheckout.run(SvnOldCheckout.java:8)
at org.tmatesoft.svn.core.internal.wc2.SvnOperationRunner.run(SvnOperationRunner.java:20)
at org.tmatesoft.svn.core.wc2.SvnOperationFactory.run(SvnOperationFactory.java:1238)
at org.tmatesoft.svn.core.wc2.SvnOperation.run(SvnOperation.java:294)
at org.tmatesoft.svn.core.wc.SVNUpdateClient.doCheckout(SVNUpdateClient.java:777)
at hudson.scm.subversion.CheckoutUpdater$1.perform(CheckoutUpdater.java:99)
... 13 more
Caused by: svn: E175002: REPORT /repos/asf/!svn/vcc/default failed
at org.tmatesoft.svn.core.SVNErrorMessage.create(SVNErrorMessage.java:208)
at org.tmatesoft.svn.core.SVNErrorMessage.create(SVNErrorMessage.java:154)
at org.tmatesoft.svn.core.SVNErrorMessage.create(SVNErrorMessage.java:97)
... 29 more
Caused by: org.tmatesoft.svn.core.SVNException: svn: E204899: REPORT request failed on '/repos/asf/!svn/vcc/default'
svn: E204899: Cannot create new file '/home/hudson/jenkins-slave/workspace/Mahout-Quality/trunk/distribution/src/.svn/lock': No such file or directory
at org.tmatesoft.svn.core.internal.wc.SVNErrorManager.error(SVNErrorManager.java:64)
at org.tmatesoft.svn.core.internal.wc.SVNErrorManager.error(SVNErrorManager.java:51)
at org.tmatesoft.svn.core.internal.io.dav.http.HTTPConnection._request(HTTPConnection.java:771)
at org.tmatesoft.svn.core.internal.io.dav.http.HTTPConnection.request(HTTPConnection.java:382)
... 28 more
Caused by: svn: E204899: REPORT request failed on '/repos/asf/!svn/vcc/default'
at org.tmatesoft.svn.core.SVNErrorMessage.create(SVNErrorMessage.java:208)
at org.tmatesoft.svn.core.SVNErrorMessage.create(SVNErrorMessage.java:154)
at org.tmatesoft.svn.core.SVNErrorMessage.create(SVNErrorMessage.java:97)
at org.tmatesoft.svn.core.SVNErrorMessage.wrap(SVNErrorMessage.java:407)
... 30 more
Caused by: svn: E204899: Cannot create new file '/home/hudson/jenkins-slave/workspace/Mahout-Quality/trunk/distribution/src/.svn/lock': No such file or directory
at org.tmatesoft.svn.core.SVNErrorMessage.create(SVNErrorMessage.java:208)
at org.tmatesoft.svn.core.SVNErrorMessage.create(SVNErrorMessage.java:189)
at org.tmatesoft.svn.core.SVNErrorMessage.create(SVNErrorMessage.java:141)
at org.tmatesoft.svn.core.internal.wc.SVNFileUtil.createEmptyFile(SVNFileUtil.java:342)
at org.tmatesoft.svn.core.internal.wc.admin.SVNAdminArea14.createVersionedDirectory(SVNAdminArea14.java:1553)
at org.tmatesoft.svn.core.internal.wc.admin.SVNAdminArea16Factory.doCreateVersionedDirectory(SVNAdminArea16Factory.java:30)
at org.tmatesoft.svn.core.internal.wc.admin.SVNAdminAreaFactory.createVersionedDirectory(SVNAdminAreaFactory.java:241)
at org.tmatesoft.svn.core.internal.wc.SVNWCManager.ensureAdminAreaExists(SVNWCManager.java:407)
at org.tmatesoft.svn.core.internal.wc.SVNUpdateEditor.addDir(SVNUpdateEditor.java:762)
at org.tmatesoft.svn.core.internal.wc.SVNCancellableEditor.addDir(SVNCancellableEditor.java:84)
at org.tmatesoft.svn.core.internal.io.dav.handlers.DAVEditorHandler.startElement(DAVEditorHandler.java:326)
at org.tmatesoft.svn.core.internal.io.dav.handlers.BasicDAVHandler.startElement(BasicDAVHandler.java:89)
at com.sun.org.apache.xerces.internal.parsers.AbstractSAXParser.startElement(AbstractSAXParser.java:509)
at com.sun.org.apache.xerces.internal.impl.XMLNSDocumentScannerImpl.scanStartElement(XMLNSDocumentScannerImpl.java:378)
at com.sun.org.apache.xerces.internal.impl.XMLDocumentFragmentScannerImpl$FragmentContentDriver.next(XMLDocumentFragmentScannerImpl.java:2778)
at com.sun.org.apache.xerces.internal.impl.XMLDocumentScannerImpl.next(XMLDocumentScannerImpl.java:606)
at com.sun.org.apache.xerces.internal.impl.XMLNSDocumentScannerImpl.next(XMLNSDocumentScannerImpl.java:117)
at com.sun.org.apache.xerces.internal.impl.XMLDocumentFragmentScannerImpl.scanDocument(XMLDocumentFragmentScannerImpl.java:510)
at com.sun.org.apache.xerces.internal.parsers.XML11Configuration.parse(XML11Configuration.java:848)
at com.sun.org.apache.xerces.internal.parsers.XML11Configuration.parse(XML11Configuration.java:777)
at com.sun.org.apache.xerces.internal.parsers.XMLParser.parse(XMLParser.java:141)
at com.sun.org.apache.xerces.internal.parsers.AbstractSAXParser.parse(AbstractSAXParser.java:1213)
at com.sun.org.apache.xerces.internal.jaxp.SAXParserImpl$JAXPSAXParser.parse(SAXParserImpl.java:649)
at org.tmatesoft.svn.core.internal.io.dav.http.HTTPConnection.readData(HTTPConnection.java:911)
at org.tmatesoft.svn.core.internal.io.dav.http.HTTPConnection.readData(HTTPConnection.java:876)
at org.tmatesoft.svn.core.internal.io.dav.http.HTTPRequest.dispatch(HTTPRequest.java:220)
at org.tmatesoft.svn.core.internal.io.dav.http.HTTPConnection._request(HTTPConnection.java:480)
... 29 more
[FINDBUGS] Skipping publisher since build result is FAILURE
[PMD] Skipping publisher since build result is FAILURE
[TASKS] Skipping publisher since build result is FAILURE
Archiving artifacts
Recording test results
Publishing Javadoc
Jenkins build is back to normal : Mahout-Quality #2516
Posted by Apache Jenkins Server <je...@builds.apache.org>.
See <https://builds.apache.org/job/Mahout-Quality/2516/changes>
Build failed in Jenkins: Mahout-Quality #2515
Posted by Apache Jenkins Server <je...@builds.apache.org>.
See <https://builds.apache.org/job/Mahout-Quality/2515/>
------------------------------------------
[...truncated 3066 lines...]
A core/src/test/java/org/apache/mahout/classifier/naivebayes/training
A core/src/test/java/org/apache/mahout/classifier/naivebayes/training/WeightsMapperTest.java
A core/src/test/java/org/apache/mahout/classifier/naivebayes/training/IndexInstancesMapperTest.java
A core/src/test/java/org/apache/mahout/classifier/naivebayes/training/ThetaMapperTest.java
A core/src/test/java/org/apache/mahout/classifier/naivebayes/StandardNaiveBayesClassifierTest.java
A core/src/test/java/org/apache/mahout/classifier/naivebayes/NaiveBayesTestBase.java
A core/src/test/java/org/apache/mahout/classifier/naivebayes/NaiveBayesTest.java
A core/src/test/java/org/apache/mahout/classifier/naivebayes/NaiveBayesModelTest.java
A core/src/test/java/org/apache/mahout/classifier/evaluation
A core/src/test/java/org/apache/mahout/classifier/evaluation/AucTest.java
A core/src/test/java/org/apache/mahout/classifier/ConfusionMatrixTest.java
A core/src/test/java/org/apache/mahout/classifier/mlp
A core/src/test/java/org/apache/mahout/classifier/mlp/TestMultilayerPerceptron.java
A core/src/test/java/org/apache/mahout/classifier/mlp/TestNeuralNetwork.java
A core/src/test/java/org/apache/mahout/classifier/sequencelearning
A core/src/test/java/org/apache/mahout/classifier/sequencelearning/hmm
A core/src/test/java/org/apache/mahout/classifier/sequencelearning/hmm/HMMAlgorithmsTest.java
A core/src/test/java/org/apache/mahout/classifier/sequencelearning/hmm/HMMTestBase.java
A core/src/test/java/org/apache/mahout/classifier/sequencelearning/hmm/HMMModelTest.java
A core/src/test/java/org/apache/mahout/classifier/sequencelearning/hmm/HMMUtilsTest.java
A core/src/test/java/org/apache/mahout/classifier/sequencelearning/hmm/HMMEvaluatorTest.java
A core/src/test/java/org/apache/mahout/classifier/sequencelearning/hmm/HMMTrainerTest.java
A core/src/test/java/org/apache/mahout/classifier/df
A core/src/test/java/org/apache/mahout/classifier/df/data
A core/src/test/java/org/apache/mahout/classifier/df/data/DatasetTest.java
A core/src/test/java/org/apache/mahout/classifier/df/data/DataTest.java
A core/src/test/java/org/apache/mahout/classifier/df/data/DescriptorUtilsTest.java
A core/src/test/java/org/apache/mahout/classifier/df/data/DataLoaderTest.java
A core/src/test/java/org/apache/mahout/classifier/df/data/Utils.java
A core/src/test/java/org/apache/mahout/classifier/df/data/DataConverterTest.java
A core/src/test/java/org/apache/mahout/classifier/df/split
A core/src/test/java/org/apache/mahout/classifier/df/split/RegressionSplitTest.java
A core/src/test/java/org/apache/mahout/classifier/df/split/DefaultIgSplitTest.java
A core/src/test/java/org/apache/mahout/classifier/df/DecisionForestTest.java
A core/src/test/java/org/apache/mahout/classifier/df/tools
A core/src/test/java/org/apache/mahout/classifier/df/tools/VisualizerTest.java
A core/src/test/java/org/apache/mahout/classifier/df/mapreduce
A core/src/test/java/org/apache/mahout/classifier/df/mapreduce/inmem
A core/src/test/java/org/apache/mahout/classifier/df/mapreduce/inmem/InMemInputFormatTest.java
A core/src/test/java/org/apache/mahout/classifier/df/mapreduce/inmem/InMemInputSplitTest.java
A core/src/test/java/org/apache/mahout/classifier/df/mapreduce/partial
A core/src/test/java/org/apache/mahout/classifier/df/mapreduce/partial/Step1MapperTest.java
A core/src/test/java/org/apache/mahout/classifier/df/mapreduce/partial/PartialBuilderTest.java
A core/src/test/java/org/apache/mahout/classifier/df/mapreduce/partial/TreeIDTest.java
A core/src/test/java/org/apache/mahout/classifier/df/node
A core/src/test/java/org/apache/mahout/classifier/df/node/NodeTest.java
A core/src/test/java/org/apache/mahout/classifier/df/builder
A core/src/test/java/org/apache/mahout/classifier/df/builder/DecisionTreeBuilderTest.java
A core/src/test/java/org/apache/mahout/classifier/df/builder/DefaultTreeBuilderTest.java
A core/src/test/java/org/apache/mahout/classifier/df/builder/InfiniteRecursionTest.java
A core/src/test/java/org/apache/mahout/classifier/sgd
A core/src/test/java/org/apache/mahout/classifier/sgd/ModelSerializerTest.java
A core/src/test/java/org/apache/mahout/classifier/sgd/PassiveAggressiveTest.java
A core/src/test/java/org/apache/mahout/classifier/sgd/AdaptiveLogisticRegressionTest.java
A core/src/test/java/org/apache/mahout/classifier/sgd/OnlineBaseTest.java
A core/src/test/java/org/apache/mahout/classifier/sgd/CsvRecordFactoryTest.java
A core/src/test/java/org/apache/mahout/classifier/sgd/GradientMachineTest.java
A core/src/test/java/org/apache/mahout/classifier/sgd/OnlineLogisticRegressionTest.java
A core/src/test/java/org/apache/mahout/classifier/ClassifierData.java
A core/src/test/java/org/apache/mahout/ep
A core/src/test/java/org/apache/mahout/ep/EvolutionaryProcessTest.java
A core/src/test/java/org/apache/mahout/cf
A core/src/test/java/org/apache/mahout/cf/taste
A core/src/test/java/org/apache/mahout/cf/taste/common
A core/src/test/java/org/apache/mahout/cf/taste/common/CommonTest.java
A core/src/test/java/org/apache/mahout/cf/taste/hadoop
A core/src/test/java/org/apache/mahout/cf/taste/hadoop/item
A core/src/test/java/org/apache/mahout/cf/taste/hadoop/item/ToUserVectorsReducerTest.java
A core/src/test/java/org/apache/mahout/cf/taste/hadoop/item/RecommenderJobTest.java
A core/src/test/java/org/apache/mahout/cf/taste/hadoop/als
A core/src/test/java/org/apache/mahout/cf/taste/hadoop/als/ParallelALSFactorizationJobTest.java
A core/src/test/java/org/apache/mahout/cf/taste/hadoop/similarity
ERROR: Failed to check out http://svn.apache.org/repos/asf/mahout/trunk
org.tmatesoft.svn.core.SVNException: svn: E175002: REPORT /repos/asf/!svn/vcc/default failed
at org.tmatesoft.svn.core.internal.io.dav.http.HTTPConnection.request(HTTPConnection.java:388)
at org.tmatesoft.svn.core.internal.io.dav.http.HTTPConnection.request(HTTPConnection.java:373)
at org.tmatesoft.svn.core.internal.io.dav.http.HTTPConnection.request(HTTPConnection.java:361)
at org.tmatesoft.svn.core.internal.io.dav.DAVConnection.performHttpRequest(DAVConnection.java:707)
at org.tmatesoft.svn.core.internal.io.dav.DAVConnection.doReport(DAVConnection.java:334)
at org.tmatesoft.svn.core.internal.io.dav.DAVRepository.runReport(DAVRepository.java:1291)
at org.tmatesoft.svn.core.internal.io.dav.DAVRepository.update(DAVRepository.java:839)
at org.tmatesoft.svn.core.internal.wc16.SVNUpdateClient16.update(SVNUpdateClient16.java:507)
at org.tmatesoft.svn.core.internal.wc16.SVNUpdateClient16.doCheckout(SVNUpdateClient16.java:915)
at org.tmatesoft.svn.core.internal.wc2.old.SvnOldCheckout.run(SvnOldCheckout.java:19)
at org.tmatesoft.svn.core.internal.wc2.old.SvnOldCheckout.run(SvnOldCheckout.java:8)
at org.tmatesoft.svn.core.internal.wc2.SvnOperationRunner.run(SvnOperationRunner.java:20)
at org.tmatesoft.svn.core.wc2.SvnOperationFactory.run(SvnOperationFactory.java:1238)
at org.tmatesoft.svn.core.wc2.SvnOperation.run(SvnOperation.java:294)
at org.tmatesoft.svn.core.wc.SVNUpdateClient.doCheckout(SVNUpdateClient.java:777)
at hudson.scm.subversion.CheckoutUpdater$1.perform(CheckoutUpdater.java:99)
at hudson.scm.subversion.WorkspaceUpdater$UpdateTask.delegateTo(WorkspaceUpdater.java:161)
at hudson.scm.SubversionSCM$CheckOutTask.perform(SubversionSCM.java:908)
at hudson.scm.SubversionSCM$CheckOutTask.invoke(SubversionSCM.java:889)
at hudson.scm.SubversionSCM$CheckOutTask.invoke(SubversionSCM.java:872)
at hudson.FilePath$FileCallableWrapper.call(FilePath.java:2461)
at hudson.remoting.UserRequest.perform(UserRequest.java:118)
at hudson.remoting.UserRequest.perform(UserRequest.java:48)
at hudson.remoting.Request$2.run(Request.java:328)
at hudson.remoting.InterceptingExecutorService$1.call(InterceptingExecutorService.java:72)
at java.util.concurrent.FutureTask.run(FutureTask.java:262)
at java.util.concurrent.ThreadPoolExecutor.runWorker(ThreadPoolExecutor.java:1145)
at java.util.concurrent.ThreadPoolExecutor$Worker.run(ThreadPoolExecutor.java:615)
at java.lang.Thread.run(Thread.java:744)
Caused by: svn: E175002: REPORT /repos/asf/!svn/vcc/default failed
at org.tmatesoft.svn.core.SVNErrorMessage.create(SVNErrorMessage.java:208)
at org.tmatesoft.svn.core.SVNErrorMessage.create(SVNErrorMessage.java:154)
at org.tmatesoft.svn.core.SVNErrorMessage.create(SVNErrorMessage.java:97)
... 29 more
Caused by: org.tmatesoft.svn.core.SVNException: svn: E204899: REPORT request failed on '/repos/asf/!svn/vcc/default'
svn: E204899: Cannot create new file '/home/hudson/jenkins-slave/workspace/Mahout-Quality/trunk/core/src/test/java/org/apache/mahout/cf/taste/hadoop/similarity/item/.svn/lock': No such file or directory
at org.tmatesoft.svn.core.internal.wc.SVNErrorManager.error(SVNErrorManager.java:64)
at org.tmatesoft.svn.core.internal.wc.SVNErrorManager.error(SVNErrorManager.java:51)
at org.tmatesoft.svn.core.internal.io.dav.http.HTTPConnection._request(HTTPConnection.java:771)
at org.tmatesoft.svn.core.internal.io.dav.http.HTTPConnection.request(HTTPConnection.java:382)
... 28 more
Caused by: svn: E204899: REPORT request failed on '/repos/asf/!svn/vcc/default'
at org.tmatesoft.svn.core.SVNErrorMessage.create(SVNErrorMessage.java:208)
at org.tmatesoft.svn.core.SVNErrorMessage.create(SVNErrorMessage.java:154)
at org.tmatesoft.svn.core.SVNErrorMessage.create(SVNErrorMessage.java:97)
at org.tmatesoft.svn.core.SVNErrorMessage.wrap(SVNErrorMessage.java:407)
... 30 more
Caused by: svn: E204899: Cannot create new file '/home/hudson/jenkins-slave/workspace/Mahout-Quality/trunk/core/src/test/java/org/apache/mahout/cf/taste/hadoop/similarity/item/.svn/lock': No such file or directory
at org.tmatesoft.svn.core.SVNErrorMessage.create(SVNErrorMessage.java:208)
at org.tmatesoft.svn.core.SVNErrorMessage.create(SVNErrorMessage.java:189)
at org.tmatesoft.svn.core.SVNErrorMessage.create(SVNErrorMessage.java:141)
at org.tmatesoft.svn.core.internal.wc.SVNFileUtil.createEmptyFile(SVNFileUtil.java:342)
at org.tmatesoft.svn.core.internal.wc.admin.SVNAdminArea14.createVersionedDirectory(SVNAdminArea14.java:1553)
at org.tmatesoft.svn.core.internal.wc.admin.SVNAdminArea16Factory.doCreateVersionedDirectory(SVNAdminArea16Factory.java:30)
at org.tmatesoft.svn.core.internal.wc.admin.SVNAdminAreaFactory.createVersionedDirectory(SVNAdminAreaFactory.java:241)
at org.tmatesoft.svn.core.internal.wc.SVNWCManager.ensureAdminAreaExists(SVNWCManager.java:407)
at org.tmatesoft.svn.core.internal.wc.SVNUpdateEditor.addDir(SVNUpdateEditor.java:762)
at org.tmatesoft.svn.core.internal.wc.SVNCancellableEditor.addDir(SVNCancellableEditor.java:84)
at org.tmatesoft.svn.core.internal.io.dav.handlers.DAVEditorHandler.startElement(DAVEditorHandler.java:326)
at org.tmatesoft.svn.core.internal.io.dav.handlers.BasicDAVHandler.startElement(BasicDAVHandler.java:89)
at com.sun.org.apache.xerces.internal.parsers.AbstractSAXParser.startElement(AbstractSAXParser.java:509)
at com.sun.org.apache.xerces.internal.impl.XMLNSDocumentScannerImpl.scanStartElement(XMLNSDocumentScannerImpl.java:378)
at com.sun.org.apache.xerces.internal.impl.XMLDocumentFragmentScannerImpl$FragmentContentDriver.next(XMLDocumentFragmentScannerImpl.java:2778)
at com.sun.org.apache.xerces.internal.impl.XMLDocumentScannerImpl.next(XMLDocumentScannerImpl.java:606)
at com.sun.org.apache.xerces.internal.impl.XMLNSDocumentScannerImpl.next(XMLNSDocumentScannerImpl.java:117)
at com.sun.org.apache.xerces.internal.impl.XMLDocumentFragmentScannerImpl.scanDocument(XMLDocumentFragmentScannerImpl.java:510)
at com.sun.org.apache.xerces.internal.parsers.XML11Configuration.parse(XML11Configuration.java:848)
at com.sun.org.apache.xerces.internal.parsers.XML11Configuration.parse(XML11Configuration.java:777)
at com.sun.org.apache.xerces.internal.parsers.XMLParser.parse(XMLParser.java:141)
at com.sun.org.apache.xerces.internal.parsers.AbstractSAXParser.parse(AbstractSAXParser.java:1213)
at com.sun.org.apache.xerces.internal.jaxp.SAXParserImpl$JAXPSAXParser.parse(SAXParserImpl.java:649)
at org.tmatesoft.svn.core.internal.io.dav.http.HTTPConnection.readData(HTTPConnection.java:911)
at org.tmatesoft.svn.core.internal.io.dav.http.HTTPConnection.readData(HTTPConnection.java:876)
at org.tmatesoft.svn.core.internal.io.dav.http.HTTPRequest.dispatch(HTTPRequest.java:220)
at org.tmatesoft.svn.core.internal.io.dav.http.HTTPConnection._request(HTTPConnection.java:480)
... 29 more
java.io.IOException: remote file operation failed: <https://builds.apache.org/job/Mahout-Quality/ws/> at hudson.remoting.Channel@1211434:ubuntu2
at hudson.FilePath.act(FilePath.java:910)
at hudson.FilePath.act(FilePath.java:887)
at hudson.scm.SubversionSCM.checkout(SubversionSCM.java:848)
at hudson.scm.SubversionSCM.checkout(SubversionSCM.java:786)
at hudson.model.AbstractProject.checkout(AbstractProject.java:1411)
at hudson.model.AbstractBuild$AbstractBuildExecution.defaultCheckout(AbstractBuild.java:651)
at jenkins.scm.SCMCheckoutStrategy.checkout(SCMCheckoutStrategy.java:88)
at hudson.model.AbstractBuild$AbstractBuildExecution.run(AbstractBuild.java:560)
at hudson.model.Run.execute(Run.java:1670)
at hudson.model.FreeStyleBuild.run(FreeStyleBuild.java:46)
at hudson.model.ResourceController.execute(ResourceController.java:88)
at hudson.model.Executor.run(Executor.java:231)
Caused by: java.io.IOException: Failed to check out http://svn.apache.org/repos/asf/mahout/trunk
at hudson.scm.subversion.CheckoutUpdater$1.perform(CheckoutUpdater.java:110)
at hudson.scm.subversion.WorkspaceUpdater$UpdateTask.delegateTo(WorkspaceUpdater.java:161)
at hudson.scm.SubversionSCM$CheckOutTask.perform(SubversionSCM.java:908)
at hudson.scm.SubversionSCM$CheckOutTask.invoke(SubversionSCM.java:889)
at hudson.scm.SubversionSCM$CheckOutTask.invoke(SubversionSCM.java:872)
at hudson.FilePath$FileCallableWrapper.call(FilePath.java:2461)
at hudson.remoting.UserRequest.perform(UserRequest.java:118)
at hudson.remoting.UserRequest.perform(UserRequest.java:48)
at hudson.remoting.Request$2.run(Request.java:328)
at hudson.remoting.InterceptingExecutorService$1.call(InterceptingExecutorService.java:72)
at java.util.concurrent.FutureTask.run(FutureTask.java:262)
at java.util.concurrent.ThreadPoolExecutor.runWorker(ThreadPoolExecutor.java:1145)
at java.util.concurrent.ThreadPoolExecutor$Worker.run(ThreadPoolExecutor.java:615)
at java.lang.Thread.run(Thread.java:744)
Caused by: org.tmatesoft.svn.core.SVNException: svn: E175002: REPORT /repos/asf/!svn/vcc/default failed
at org.tmatesoft.svn.core.internal.io.dav.http.HTTPConnection.request(HTTPConnection.java:388)
at org.tmatesoft.svn.core.internal.io.dav.http.HTTPConnection.request(HTTPConnection.java:373)
at org.tmatesoft.svn.core.internal.io.dav.http.HTTPConnection.request(HTTPConnection.java:361)
at org.tmatesoft.svn.core.internal.io.dav.DAVConnection.performHttpRequest(DAVConnection.java:707)
at org.tmatesoft.svn.core.internal.io.dav.DAVConnection.doReport(DAVConnection.java:334)
at org.tmatesoft.svn.core.internal.io.dav.DAVRepository.runReport(DAVRepository.java:1291)
at org.tmatesoft.svn.core.internal.io.dav.DAVRepository.update(DAVRepository.java:839)
at org.tmatesoft.svn.core.internal.wc16.SVNUpdateClient16.update(SVNUpdateClient16.java:507)
at org.tmatesoft.svn.core.internal.wc16.SVNUpdateClient16.doCheckout(SVNUpdateClient16.java:915)
at org.tmatesoft.svn.core.internal.wc2.old.SvnOldCheckout.run(SvnOldCheckout.java:19)
at org.tmatesoft.svn.core.internal.wc2.old.SvnOldCheckout.run(SvnOldCheckout.java:8)
at org.tmatesoft.svn.core.internal.wc2.SvnOperationRunner.run(SvnOperationRunner.java:20)
at org.tmatesoft.svn.core.wc2.SvnOperationFactory.run(SvnOperationFactory.java:1238)
at org.tmatesoft.svn.core.wc2.SvnOperation.run(SvnOperation.java:294)
at org.tmatesoft.svn.core.wc.SVNUpdateClient.doCheckout(SVNUpdateClient.java:777)
at hudson.scm.subversion.CheckoutUpdater$1.perform(CheckoutUpdater.java:99)
... 13 more
Caused by: svn: E175002: REPORT /repos/asf/!svn/vcc/default failed
at org.tmatesoft.svn.core.SVNErrorMessage.create(SVNErrorMessage.java:208)
at org.tmatesoft.svn.core.SVNErrorMessage.create(SVNErrorMessage.java:154)
at org.tmatesoft.svn.core.SVNErrorMessage.create(SVNErrorMessage.java:97)
... 29 more
Caused by: org.tmatesoft.svn.core.SVNException: svn: E204899: REPORT request failed on '/repos/asf/!svn/vcc/default'
svn: E204899: Cannot create new file '/home/hudson/jenkins-slave/workspace/Mahout-Quality/trunk/core/src/test/java/org/apache/mahout/cf/taste/hadoop/similarity/item/.svn/lock': No such file or directory
at org.tmatesoft.svn.core.internal.wc.SVNErrorManager.error(SVNErrorManager.java:64)
at org.tmatesoft.svn.core.internal.wc.SVNErrorManager.error(SVNErrorManager.java:51)
at org.tmatesoft.svn.core.internal.io.dav.http.HTTPConnection._request(HTTPConnection.java:771)
at org.tmatesoft.svn.core.internal.io.dav.http.HTTPConnection.request(HTTPConnection.java:382)
... 28 more
Caused by: svn: E204899: REPORT request failed on '/repos/asf/!svn/vcc/default'
at org.tmatesoft.svn.core.SVNErrorMessage.create(SVNErrorMessage.java:208)
at org.tmatesoft.svn.core.SVNErrorMessage.create(SVNErrorMessage.java:154)
at org.tmatesoft.svn.core.SVNErrorMessage.create(SVNErrorMessage.java:97)
at org.tmatesoft.svn.core.SVNErrorMessage.wrap(SVNErrorMessage.java:407)
... 30 more
Caused by: svn: E204899: Cannot create new file '/home/hudson/jenkins-slave/workspace/Mahout-Quality/trunk/core/src/test/java/org/apache/mahout/cf/taste/hadoop/similarity/item/.svn/lock': No such file or directory
at org.tmatesoft.svn.core.SVNErrorMessage.create(SVNErrorMessage.java:208)
at org.tmatesoft.svn.core.SVNErrorMessage.create(SVNErrorMessage.java:189)
at org.tmatesoft.svn.core.SVNErrorMessage.create(SVNErrorMessage.java:141)
at org.tmatesoft.svn.core.internal.wc.SVNFileUtil.createEmptyFile(SVNFileUtil.java:342)
at org.tmatesoft.svn.core.internal.wc.admin.SVNAdminArea14.createVersionedDirectory(SVNAdminArea14.java:1553)
at org.tmatesoft.svn.core.internal.wc.admin.SVNAdminArea16Factory.doCreateVersionedDirectory(SVNAdminArea16Factory.java:30)
at org.tmatesoft.svn.core.internal.wc.admin.SVNAdminAreaFactory.createVersionedDirectory(SVNAdminAreaFactory.java:241)
at org.tmatesoft.svn.core.internal.wc.SVNWCManager.ensureAdminAreaExists(SVNWCManager.java:407)
at org.tmatesoft.svn.core.internal.wc.SVNUpdateEditor.addDir(SVNUpdateEditor.java:762)
at org.tmatesoft.svn.core.internal.wc.SVNCancellableEditor.addDir(SVNCancellableEditor.java:84)
at org.tmatesoft.svn.core.internal.io.dav.handlers.DAVEditorHandler.startElement(DAVEditorHandler.java:326)
at org.tmatesoft.svn.core.internal.io.dav.handlers.BasicDAVHandler.startElement(BasicDAVHandler.java:89)
at com.sun.org.apache.xerces.internal.parsers.AbstractSAXParser.startElement(AbstractSAXParser.java:509)
at com.sun.org.apache.xerces.internal.impl.XMLNSDocumentScannerImpl.scanStartElement(XMLNSDocumentScannerImpl.java:378)
at com.sun.org.apache.xerces.internal.impl.XMLDocumentFragmentScannerImpl$FragmentContentDriver.next(XMLDocumentFragmentScannerImpl.java:2778)
at com.sun.org.apache.xerces.internal.impl.XMLDocumentScannerImpl.next(XMLDocumentScannerImpl.java:606)
at com.sun.org.apache.xerces.internal.impl.XMLNSDocumentScannerImpl.next(XMLNSDocumentScannerImpl.java:117)
at com.sun.org.apache.xerces.internal.impl.XMLDocumentFragmentScannerImpl.scanDocument(XMLDocumentFragmentScannerImpl.java:510)
at com.sun.org.apache.xerces.internal.parsers.XML11Configuration.parse(XML11Configuration.java:848)
at com.sun.org.apache.xerces.internal.parsers.XML11Configuration.parse(XML11Configuration.java:777)
at com.sun.org.apache.xerces.internal.parsers.XMLParser.parse(XMLParser.java:141)
at com.sun.org.apache.xerces.internal.parsers.AbstractSAXParser.parse(AbstractSAXParser.java:1213)
at com.sun.org.apache.xerces.internal.jaxp.SAXParserImpl$JAXPSAXParser.parse(SAXParserImpl.java:649)
at org.tmatesoft.svn.core.internal.io.dav.http.HTTPConnection.readData(HTTPConnection.java:911)
at org.tmatesoft.svn.core.internal.io.dav.http.HTTPConnection.readData(HTTPConnection.java:876)
at org.tmatesoft.svn.core.internal.io.dav.http.HTTPRequest.dispatch(HTTPRequest.java:220)
at org.tmatesoft.svn.core.internal.io.dav.http.HTTPConnection._request(HTTPConnection.java:480)
... 29 more
[FINDBUGS] Skipping publisher since build result is FAILURE
[PMD] Skipping publisher since build result is FAILURE
[TASKS] Skipping publisher since build result is FAILURE
Archiving artifacts
Recording test results
Publishing Javadoc
Build failed in Jenkins: Mahout-Quality #2514
Posted by Apache Jenkins Server <je...@builds.apache.org>.
See <https://builds.apache.org/job/Mahout-Quality/2514/>
------------------------------------------
[...truncated 2186 lines...]
A spark/src/main/scala/org/apache/mahout/sparkbindings/drm/plan/OpABt.scala
A spark/src/main/scala/org/apache/mahout/sparkbindings/drm/plan/OpAtB.scala
A spark/src/main/scala/org/apache/mahout/sparkbindings/drm/plan/AbstractBinaryOp.scala
A spark/src/main/scala/org/apache/mahout/sparkbindings/drm/plan/OpAewB.scala
A spark/src/main/scala/org/apache/mahout/sparkbindings/drm/plan/OpTimesLeftMatrix.scala
A spark/src/main/scala/org/apache/mahout/sparkbindings/drm/plan/AbstractUnaryOp.scala
A spark/src/main/scala/org/apache/mahout/sparkbindings/drm/plan/OpAB.scala
A spark/src/main/scala/org/apache/mahout/sparkbindings/drm/plan/OpRowRange.scala
A spark/src/main/scala/org/apache/mahout/sparkbindings/drm/plan/OpAtAnyKey.scala
A spark/src/main/scala/org/apache/mahout/sparkbindings/drm/plan/CheckpointAction.scala
A spark/src/main/scala/org/apache/mahout/sparkbindings/drm/plan/OpMapBlock.scala
A spark/src/main/scala/org/apache/mahout/sparkbindings/drm/plan/package.scala
A spark/src/main/scala/org/apache/mahout/sparkbindings/drm/plan/OpAewScalar.scala
A spark/src/main/scala/org/apache/mahout/sparkbindings/drm/plan/OpABAnyKey.scala
A spark/src/main/scala/org/apache/mahout/sparkbindings/drm/plan/OpAt.scala
A spark/src/main/scala/org/apache/mahout/sparkbindings/drm/plan/OpTimesRightMatrix.scala
A spark/src/main/scala/org/apache/mahout/sparkbindings/drm/DrmLikeOps.scala
A spark/src/main/scala/org/apache/mahout/sparkbindings/drm/RLikeDrmOps.scala
A spark/src/main/scala/org/apache/mahout/sparkbindings/drm/package.scala
A spark/src/main/scala/org/apache/mahout/sparkbindings/drm/DrmRddInput.scala
A spark/src/main/scala/org/apache/mahout/sparkbindings/drm/decompositions
A spark/src/main/scala/org/apache/mahout/sparkbindings/drm/decompositions/DQR.scala
A spark/src/main/scala/org/apache/mahout/sparkbindings/drm/decompositions/DSSVD.scala
A spark/src/main/scala/org/apache/mahout/sparkbindings/drm/CheckpointedDrmBase.scala
A spark/src/main/scala/org/apache/mahout/sparkbindings/drm/CheckpointedOps.scala
A spark/src/main/scala/org/apache/mahout/sparkbindings/drm/CheckpointedDrm.scala
A spark/pom.xml
A integration
A integration/lib
A integration/src
A integration/src/main
A integration/src/main/resources
A integration/src/main/resources/org
A integration/src/main/resources/org/apache
A integration/src/main/resources/org/apache/mahout
A integration/src/main/resources/org/apache/mahout/cf
A integration/src/main/resources/org/apache/mahout/cf/taste
A integration/src/main/resources/org/apache/mahout/cf/taste/example
A integration/src/main/resources/org/apache/mahout/cf/taste/example/grouplens
A integration/src/main/java
A integration/src/main/java/org
A integration/src/main/java/org/apache
A integration/src/main/java/org/apache/mahout
A integration/src/main/java/org/apache/mahout/benchmark
A integration/src/main/java/org/apache/mahout/benchmark/PlusBenchmark.java
A integration/src/main/java/org/apache/mahout/benchmark/ClosestCentroidBenchmark.java
A integration/src/main/java/org/apache/mahout/benchmark/VectorBenchmarks.java
A integration/src/main/java/org/apache/mahout/benchmark/DotBenchmark.java
A integration/src/main/java/org/apache/mahout/benchmark/BenchmarkRunner.java
A integration/src/main/java/org/apache/mahout/benchmark/DistanceBenchmark.java
A integration/src/main/java/org/apache/mahout/benchmark/MinusBenchmark.java
A integration/src/main/java/org/apache/mahout/benchmark/SerializationBenchmark.java
A integration/src/main/java/org/apache/mahout/benchmark/CloneBenchmark.java
A integration/src/main/java/org/apache/mahout/benchmark/TimesBenchmark.java
A integration/src/main/java/org/apache/mahout/clustering
A integration/src/main/java/org/apache/mahout/clustering/conversion
A integration/src/main/java/org/apache/mahout/clustering/conversion/InputMapper.java
A integration/src/main/java/org/apache/mahout/clustering/conversion/InputDriver.java
A integration/src/main/java/org/apache/mahout/clustering/evaluation
A integration/src/main/java/org/apache/mahout/clustering/evaluation/RepresentativePointsMapper.java
A integration/src/main/java/org/apache/mahout/clustering/evaluation/ClusterEvaluator.java
A integration/src/main/java/org/apache/mahout/clustering/evaluation/RepresentativePointsReducer.java
A integration/src/main/java/org/apache/mahout/clustering/evaluation/RepresentativePointsDriver.java
A integration/src/main/java/org/apache/mahout/clustering/cdbw
A integration/src/main/java/org/apache/mahout/clustering/cdbw/CDbwEvaluator.java
A integration/src/main/java/org/apache/mahout/clustering/lda
AU integration/src/main/java/org/apache/mahout/clustering/lda/LDAPrintTopics.java
A integration/src/main/java/org/apache/mahout/utils
A integration/src/main/java/org/apache/mahout/utils/ConcatenateVectorsReducer.java
A integration/src/main/java/org/apache/mahout/utils/ConcatenateVectorsJob.java
A integration/src/main/java/org/apache/mahout/utils/SequenceFileDumper.java
A integration/src/main/java/org/apache/mahout/utils/vectors
ERROR: Failed to check out http://svn.apache.org/repos/asf/mahout/trunk
org.tmatesoft.svn.core.SVNException: svn: E175002: REPORT /repos/asf/!svn/vcc/default failed
at org.tmatesoft.svn.core.internal.io.dav.http.HTTPConnection.request(HTTPConnection.java:388)
at org.tmatesoft.svn.core.internal.io.dav.http.HTTPConnection.request(HTTPConnection.java:373)
at org.tmatesoft.svn.core.internal.io.dav.http.HTTPConnection.request(HTTPConnection.java:361)
at org.tmatesoft.svn.core.internal.io.dav.DAVConnection.performHttpRequest(DAVConnection.java:707)
at org.tmatesoft.svn.core.internal.io.dav.DAVConnection.doReport(DAVConnection.java:334)
at org.tmatesoft.svn.core.internal.io.dav.DAVRepository.runReport(DAVRepository.java:1291)
at org.tmatesoft.svn.core.internal.io.dav.DAVRepository.update(DAVRepository.java:839)
at org.tmatesoft.svn.core.internal.wc16.SVNUpdateClient16.update(SVNUpdateClient16.java:507)
at org.tmatesoft.svn.core.internal.wc16.SVNUpdateClient16.doCheckout(SVNUpdateClient16.java:915)
at org.tmatesoft.svn.core.internal.wc2.old.SvnOldCheckout.run(SvnOldCheckout.java:19)
at org.tmatesoft.svn.core.internal.wc2.old.SvnOldCheckout.run(SvnOldCheckout.java:8)
at org.tmatesoft.svn.core.internal.wc2.SvnOperationRunner.run(SvnOperationRunner.java:20)
at org.tmatesoft.svn.core.wc2.SvnOperationFactory.run(SvnOperationFactory.java:1238)
at org.tmatesoft.svn.core.wc2.SvnOperation.run(SvnOperation.java:294)
at org.tmatesoft.svn.core.wc.SVNUpdateClient.doCheckout(SVNUpdateClient.java:777)
at hudson.scm.subversion.CheckoutUpdater$1.perform(CheckoutUpdater.java:99)
at hudson.scm.subversion.WorkspaceUpdater$UpdateTask.delegateTo(WorkspaceUpdater.java:161)
at hudson.scm.SubversionSCM$CheckOutTask.perform(SubversionSCM.java:908)
at hudson.scm.SubversionSCM$CheckOutTask.invoke(SubversionSCM.java:889)
at hudson.scm.SubversionSCM$CheckOutTask.invoke(SubversionSCM.java:872)
at hudson.FilePath$FileCallableWrapper.call(FilePath.java:2461)
at hudson.remoting.UserRequest.perform(UserRequest.java:118)
at hudson.remoting.UserRequest.perform(UserRequest.java:48)
at hudson.remoting.Request$2.run(Request.java:328)
at hudson.remoting.InterceptingExecutorService$1.call(InterceptingExecutorService.java:72)
at java.util.concurrent.FutureTask.run(FutureTask.java:262)
at java.util.concurrent.ThreadPoolExecutor.runWorker(ThreadPoolExecutor.java:1145)
at java.util.concurrent.ThreadPoolExecutor$Worker.run(ThreadPoolExecutor.java:615)
at java.lang.Thread.run(Thread.java:744)
Caused by: svn: E175002: REPORT /repos/asf/!svn/vcc/default failed
at org.tmatesoft.svn.core.SVNErrorMessage.create(SVNErrorMessage.java:208)
at org.tmatesoft.svn.core.SVNErrorMessage.create(SVNErrorMessage.java:154)
at org.tmatesoft.svn.core.SVNErrorMessage.create(SVNErrorMessage.java:97)
... 29 more
Caused by: org.tmatesoft.svn.core.SVNException: svn: E204899: REPORT request failed on '/repos/asf/!svn/vcc/default'
svn: E204899: Cannot create new file '/home/hudson/jenkins-slave/workspace/Mahout-Quality/trunk/integration/src/main/java/org/apache/mahout/utils/vectors/io/.svn/lock': No such file or directory
at org.tmatesoft.svn.core.internal.wc.SVNErrorManager.error(SVNErrorManager.java:64)
at org.tmatesoft.svn.core.internal.wc.SVNErrorManager.error(SVNErrorManager.java:51)
at org.tmatesoft.svn.core.internal.io.dav.http.HTTPConnection._request(HTTPConnection.java:771)
at org.tmatesoft.svn.core.internal.io.dav.http.HTTPConnection.request(HTTPConnection.java:382)
... 28 more
Caused by: svn: E204899: REPORT request failed on '/repos/asf/!svn/vcc/default'
at org.tmatesoft.svn.core.SVNErrorMessage.create(SVNErrorMessage.java:208)
at org.tmatesoft.svn.core.SVNErrorMessage.create(SVNErrorMessage.java:154)
at org.tmatesoft.svn.core.SVNErrorMessage.create(SVNErrorMessage.java:97)
at org.tmatesoft.svn.core.SVNErrorMessage.wrap(SVNErrorMessage.java:407)
... 30 more
Caused by: svn: E204899: Cannot create new file '/home/hudson/jenkins-slave/workspace/Mahout-Quality/trunk/integration/src/main/java/org/apache/mahout/utils/vectors/io/.svn/lock': No such file or directory
at org.tmatesoft.svn.core.SVNErrorMessage.create(SVNErrorMessage.java:208)
at org.tmatesoft.svn.core.SVNErrorMessage.create(SVNErrorMessage.java:189)
at org.tmatesoft.svn.core.SVNErrorMessage.create(SVNErrorMessage.java:141)
at org.tmatesoft.svn.core.internal.wc.SVNFileUtil.createEmptyFile(SVNFileUtil.java:342)
at org.tmatesoft.svn.core.internal.wc.admin.SVNAdminArea14.createVersionedDirectory(SVNAdminArea14.java:1553)
at org.tmatesoft.svn.core.internal.wc.admin.SVNAdminArea16Factory.doCreateVersionedDirectory(SVNAdminArea16Factory.java:30)
at org.tmatesoft.svn.core.internal.wc.admin.SVNAdminAreaFactory.createVersionedDirectory(SVNAdminAreaFactory.java:241)
at org.tmatesoft.svn.core.internal.wc.SVNWCManager.ensureAdminAreaExists(SVNWCManager.java:407)
at org.tmatesoft.svn.core.internal.wc.SVNUpdateEditor.addDir(SVNUpdateEditor.java:762)
at org.tmatesoft.svn.core.internal.wc.SVNCancellableEditor.addDir(SVNCancellableEditor.java:84)
at org.tmatesoft.svn.core.internal.io.dav.handlers.DAVEditorHandler.startElement(DAVEditorHandler.java:326)
at org.tmatesoft.svn.core.internal.io.dav.handlers.BasicDAVHandler.startElement(BasicDAVHandler.java:89)
at com.sun.org.apache.xerces.internal.parsers.AbstractSAXParser.startElement(AbstractSAXParser.java:509)
at com.sun.org.apache.xerces.internal.impl.XMLNSDocumentScannerImpl.scanStartElement(XMLNSDocumentScannerImpl.java:378)
at com.sun.org.apache.xerces.internal.impl.XMLDocumentFragmentScannerImpl$FragmentContentDriver.next(XMLDocumentFragmentScannerImpl.java:2778)
at com.sun.org.apache.xerces.internal.impl.XMLDocumentScannerImpl.next(XMLDocumentScannerImpl.java:606)
at com.sun.org.apache.xerces.internal.impl.XMLNSDocumentScannerImpl.next(XMLNSDocumentScannerImpl.java:117)
at com.sun.org.apache.xerces.internal.impl.XMLDocumentFragmentScannerImpl.scanDocument(XMLDocumentFragmentScannerImpl.java:510)
at com.sun.org.apache.xerces.internal.parsers.XML11Configuration.parse(XML11Configuration.java:848)
at com.sun.org.apache.xerces.internal.parsers.XML11Configuration.parse(XML11Configuration.java:777)
at com.sun.org.apache.xerces.internal.parsers.XMLParser.parse(XMLParser.java:141)
at com.sun.org.apache.xerces.internal.parsers.AbstractSAXParser.parse(AbstractSAXParser.java:1213)
at com.sun.org.apache.xerces.internal.jaxp.SAXParserImpl$JAXPSAXParser.parse(SAXParserImpl.java:649)
at org.tmatesoft.svn.core.internal.io.dav.http.HTTPConnection.readData(HTTPConnection.java:911)
at org.tmatesoft.svn.core.internal.io.dav.http.HTTPConnection.readData(HTTPConnection.java:876)
at org.tmatesoft.svn.core.internal.io.dav.http.HTTPRequest.dispatch(HTTPRequest.java:220)
at org.tmatesoft.svn.core.internal.io.dav.http.HTTPConnection._request(HTTPConnection.java:480)
... 29 more
java.io.IOException: remote file operation failed: <https://builds.apache.org/job/Mahout-Quality/ws/> at hudson.remoting.Channel@1211434:ubuntu2
at hudson.FilePath.act(FilePath.java:910)
at hudson.FilePath.act(FilePath.java:887)
at hudson.scm.SubversionSCM.checkout(SubversionSCM.java:848)
at hudson.scm.SubversionSCM.checkout(SubversionSCM.java:786)
at hudson.model.AbstractProject.checkout(AbstractProject.java:1411)
at hudson.model.AbstractBuild$AbstractBuildExecution.defaultCheckout(AbstractBuild.java:651)
at jenkins.scm.SCMCheckoutStrategy.checkout(SCMCheckoutStrategy.java:88)
at hudson.model.AbstractBuild$AbstractBuildExecution.run(AbstractBuild.java:560)
at hudson.model.Run.execute(Run.java:1670)
at hudson.model.FreeStyleBuild.run(FreeStyleBuild.java:46)
at hudson.model.ResourceController.execute(ResourceController.java:88)
at hudson.model.Executor.run(Executor.java:231)
Caused by: java.io.IOException: Failed to check out http://svn.apache.org/repos/asf/mahout/trunk
at hudson.scm.subversion.CheckoutUpdater$1.perform(CheckoutUpdater.java:110)
at hudson.scm.subversion.WorkspaceUpdater$UpdateTask.delegateTo(WorkspaceUpdater.java:161)
at hudson.scm.SubversionSCM$CheckOutTask.perform(SubversionSCM.java:908)
at hudson.scm.SubversionSCM$CheckOutTask.invoke(SubversionSCM.java:889)
at hudson.scm.SubversionSCM$CheckOutTask.invoke(SubversionSCM.java:872)
at hudson.FilePath$FileCallableWrapper.call(FilePath.java:2461)
at hudson.remoting.UserRequest.perform(UserRequest.java:118)
at hudson.remoting.UserRequest.perform(UserRequest.java:48)
at hudson.remoting.Request$2.run(Request.java:328)
at hudson.remoting.InterceptingExecutorService$1.call(InterceptingExecutorService.java:72)
at java.util.concurrent.FutureTask.run(FutureTask.java:262)
at java.util.concurrent.ThreadPoolExecutor.runWorker(ThreadPoolExecutor.java:1145)
at java.util.concurrent.ThreadPoolExecutor$Worker.run(ThreadPoolExecutor.java:615)
at java.lang.Thread.run(Thread.java:744)
Caused by: org.tmatesoft.svn.core.SVNException: svn: E175002: REPORT /repos/asf/!svn/vcc/default failed
at org.tmatesoft.svn.core.internal.io.dav.http.HTTPConnection.request(HTTPConnection.java:388)
at org.tmatesoft.svn.core.internal.io.dav.http.HTTPConnection.request(HTTPConnection.java:373)
at org.tmatesoft.svn.core.internal.io.dav.http.HTTPConnection.request(HTTPConnection.java:361)
at org.tmatesoft.svn.core.internal.io.dav.DAVConnection.performHttpRequest(DAVConnection.java:707)
at org.tmatesoft.svn.core.internal.io.dav.DAVConnection.doReport(DAVConnection.java:334)
at org.tmatesoft.svn.core.internal.io.dav.DAVRepository.runReport(DAVRepository.java:1291)
at org.tmatesoft.svn.core.internal.io.dav.DAVRepository.update(DAVRepository.java:839)
at org.tmatesoft.svn.core.internal.wc16.SVNUpdateClient16.update(SVNUpdateClient16.java:507)
at org.tmatesoft.svn.core.internal.wc16.SVNUpdateClient16.doCheckout(SVNUpdateClient16.java:915)
at org.tmatesoft.svn.core.internal.wc2.old.SvnOldCheckout.run(SvnOldCheckout.java:19)
at org.tmatesoft.svn.core.internal.wc2.old.SvnOldCheckout.run(SvnOldCheckout.java:8)
at org.tmatesoft.svn.core.internal.wc2.SvnOperationRunner.run(SvnOperationRunner.java:20)
at org.tmatesoft.svn.core.wc2.SvnOperationFactory.run(SvnOperationFactory.java:1238)
at org.tmatesoft.svn.core.wc2.SvnOperation.run(SvnOperation.java:294)
at org.tmatesoft.svn.core.wc.SVNUpdateClient.doCheckout(SVNUpdateClient.java:777)
at hudson.scm.subversion.CheckoutUpdater$1.perform(CheckoutUpdater.java:99)
... 13 more
Caused by: svn: E175002: REPORT /repos/asf/!svn/vcc/default failed
at org.tmatesoft.svn.core.SVNErrorMessage.create(SVNErrorMessage.java:208)
at org.tmatesoft.svn.core.SVNErrorMessage.create(SVNErrorMessage.java:154)
at org.tmatesoft.svn.core.SVNErrorMessage.create(SVNErrorMessage.java:97)
... 29 more
Caused by: org.tmatesoft.svn.core.SVNException: svn: E204899: REPORT request failed on '/repos/asf/!svn/vcc/default'
svn: E204899: Cannot create new file '/home/hudson/jenkins-slave/workspace/Mahout-Quality/trunk/integration/src/main/java/org/apache/mahout/utils/vectors/io/.svn/lock': No such file or directory
at org.tmatesoft.svn.core.internal.wc.SVNErrorManager.error(SVNErrorManager.java:64)
at org.tmatesoft.svn.core.internal.wc.SVNErrorManager.error(SVNErrorManager.java:51)
at org.tmatesoft.svn.core.internal.io.dav.http.HTTPConnection._request(HTTPConnection.java:771)
at org.tmatesoft.svn.core.internal.io.dav.http.HTTPConnection.request(HTTPConnection.java:382)
... 28 more
Caused by: svn: E204899: REPORT request failed on '/repos/asf/!svn/vcc/default'
at org.tmatesoft.svn.core.SVNErrorMessage.create(SVNErrorMessage.java:208)
at org.tmatesoft.svn.core.SVNErrorMessage.create(SVNErrorMessage.java:154)
at org.tmatesoft.svn.core.SVNErrorMessage.create(SVNErrorMessage.java:97)
at org.tmatesoft.svn.core.SVNErrorMessage.wrap(SVNErrorMessage.java:407)
... 30 more
Caused by: svn: E204899: Cannot create new file '/home/hudson/jenkins-slave/workspace/Mahout-Quality/trunk/integration/src/main/java/org/apache/mahout/utils/vectors/io/.svn/lock': No such file or directory
at org.tmatesoft.svn.core.SVNErrorMessage.create(SVNErrorMessage.java:208)
at org.tmatesoft.svn.core.SVNErrorMessage.create(SVNErrorMessage.java:189)
at org.tmatesoft.svn.core.SVNErrorMessage.create(SVNErrorMessage.java:141)
at org.tmatesoft.svn.core.internal.wc.SVNFileUtil.createEmptyFile(SVNFileUtil.java:342)
at org.tmatesoft.svn.core.internal.wc.admin.SVNAdminArea14.createVersionedDirectory(SVNAdminArea14.java:1553)
at org.tmatesoft.svn.core.internal.wc.admin.SVNAdminArea16Factory.doCreateVersionedDirectory(SVNAdminArea16Factory.java:30)
at org.tmatesoft.svn.core.internal.wc.admin.SVNAdminAreaFactory.createVersionedDirectory(SVNAdminAreaFactory.java:241)
at org.tmatesoft.svn.core.internal.wc.SVNWCManager.ensureAdminAreaExists(SVNWCManager.java:407)
at org.tmatesoft.svn.core.internal.wc.SVNUpdateEditor.addDir(SVNUpdateEditor.java:762)
at org.tmatesoft.svn.core.internal.wc.SVNCancellableEditor.addDir(SVNCancellableEditor.java:84)
at org.tmatesoft.svn.core.internal.io.dav.handlers.DAVEditorHandler.startElement(DAVEditorHandler.java:326)
at org.tmatesoft.svn.core.internal.io.dav.handlers.BasicDAVHandler.startElement(BasicDAVHandler.java:89)
at com.sun.org.apache.xerces.internal.parsers.AbstractSAXParser.startElement(AbstractSAXParser.java:509)
at com.sun.org.apache.xerces.internal.impl.XMLNSDocumentScannerImpl.scanStartElement(XMLNSDocumentScannerImpl.java:378)
at com.sun.org.apache.xerces.internal.impl.XMLDocumentFragmentScannerImpl$FragmentContentDriver.next(XMLDocumentFragmentScannerImpl.java:2778)
at com.sun.org.apache.xerces.internal.impl.XMLDocumentScannerImpl.next(XMLDocumentScannerImpl.java:606)
at com.sun.org.apache.xerces.internal.impl.XMLNSDocumentScannerImpl.next(XMLNSDocumentScannerImpl.java:117)
at com.sun.org.apache.xerces.internal.impl.XMLDocumentFragmentScannerImpl.scanDocument(XMLDocumentFragmentScannerImpl.java:510)
at com.sun.org.apache.xerces.internal.parsers.XML11Configuration.parse(XML11Configuration.java:848)
at com.sun.org.apache.xerces.internal.parsers.XML11Configuration.parse(XML11Configuration.java:777)
at com.sun.org.apache.xerces.internal.parsers.XMLParser.parse(XMLParser.java:141)
at com.sun.org.apache.xerces.internal.parsers.AbstractSAXParser.parse(AbstractSAXParser.java:1213)
at com.sun.org.apache.xerces.internal.jaxp.SAXParserImpl$JAXPSAXParser.parse(SAXParserImpl.java:649)
at org.tmatesoft.svn.core.internal.io.dav.http.HTTPConnection.readData(HTTPConnection.java:911)
at org.tmatesoft.svn.core.internal.io.dav.http.HTTPConnection.readData(HTTPConnection.java:876)
at org.tmatesoft.svn.core.internal.io.dav.http.HTTPRequest.dispatch(HTTPRequest.java:220)
at org.tmatesoft.svn.core.internal.io.dav.http.HTTPConnection._request(HTTPConnection.java:480)
... 29 more
[FINDBUGS] Skipping publisher since build result is FAILURE
[PMD] Skipping publisher since build result is FAILURE
[TASKS] Skipping publisher since build result is FAILURE
Archiving artifacts
Recording test results
Publishing Javadoc