You are viewing a plain text version of this content. The canonical link for it is here.
Posted to builds@beam.apache.org by Apache Jenkins Server <je...@builds.apache.org> on 2020/02/28 20:17:52 UTC
Build failed in Jenkins: beam_PostCommit_Python2 #1841
See <https://builds.apache.org/job/beam_PostCommit_Python2/1841/display/redirect?page=changes>
Changes:
[amaliujia] Moving to 2.21.0-SNAPSHOT on master branch.
------------------------------------------
[...truncated 10.42 MB...]
{
"encoding": {
"@type": "kind:windowed_value",
"component_encodings": [
{
"@type": "FastPrimitivesCoder$eNprYEpOLEhMzkiNT0pNzNVLzk9JLSqGUlxuicUlAUWZuZklmWWpxc4gQa5CBs3GQsbaQqZQ/vi0xJycpMTk7Hiw+kJmPEYFZCZn56RCjWABGsFaW8iWVJykBwDlGS3/",
"component_encodings": [
{
"@type": "FastPrimitivesCoder$eNprYEpOLEhMzkiNT0pNzNVLzk9JLSqGUlxuicUlAUWZuZklmWWpxc4gQa5CBs3GQsbaQqZQ/vi0xJycpMTk7Hiw+kJmPEYFZCZn56RCjWABGsFaW8iWVJykBwDlGS3/",
"component_encodings": [],
"pipeline_proto_coder_id": "ref_Coder_FastPrimitivesCoder_5"
},
{
"@type": "FastPrimitivesCoder$eNprYEpOLEhMzkiNT0pNzNVLzk9JLSqGUlxuicUlAUWZuZklmWWpxc4gQa5CBs3GQsbaQqZQ/vi0xJycpMTk7Hiw+kJmPEYFZCZn56RCjWABGsFaW8iWVJykBwDlGS3/",
"component_encodings": [],
"pipeline_proto_coder_id": "ref_Coder_FastPrimitivesCoder_5"
}
],
"is_pair_like": true,
"pipeline_proto_coder_id": "ref_Coder_FastPrimitivesCoder_5"
},
{
"@type": "kind:global_window"
}
],
"is_wrapper": true
},
"output_name": "None",
"user_name": "assert_that/Unkey.out"
}
],
"parallel_input": {
"@type": "OutputReference",
"output_name": "None",
"step_name": "s21"
},
"serialized_fn": "<string of 1056 bytes>",
"user_name": "assert_that/Unkey"
}
},
{
"kind": "ParallelDo",
"name": "s23",
"properties": {
"display_data": [
{
"key": "fn",
"label": "Transform Function",
"namespace": "apache_beam.transforms.core.CallableWrapperDoFn",
"type": "STRING",
"value": "_equal"
},
{
"key": "fn",
"label": "Transform Function",
"namespace": "apache_beam.transforms.core.ParDo",
"shortValue": "CallableWrapperDoFn",
"type": "STRING",
"value": "apache_beam.transforms.core.CallableWrapperDoFn"
}
],
"non_parallel_inputs": {},
"output_info": [
{
"encoding": {
"@type": "kind:windowed_value",
"component_encodings": [
{
"@type": "FastPrimitivesCoder$eNprYEpOLEhMzkiNT0pNzNVLzk9JLSqGUlxuicUlAUWZuZklmWWpxc4gQa5CBs3GQsbaQqZQ/vi0xJycpMTk7Hiw+kJmPEYFZCZn56RCjWABGsFaW8iWVJykBwDlGS3/",
"component_encodings": [
{
"@type": "FastPrimitivesCoder$eNprYEpOLEhMzkiNT0pNzNVLzk9JLSqGUlxuicUlAUWZuZklmWWpxc4gQa5CBs3GQsbaQqZQ/vi0xJycpMTk7Hiw+kJmPEYFZCZn56RCjWABGsFaW8iWVJykBwDlGS3/",
"component_encodings": [],
"pipeline_proto_coder_id": "ref_Coder_FastPrimitivesCoder_5"
},
{
"@type": "FastPrimitivesCoder$eNprYEpOLEhMzkiNT0pNzNVLzk9JLSqGUlxuicUlAUWZuZklmWWpxc4gQa5CBs3GQsbaQqZQ/vi0xJycpMTk7Hiw+kJmPEYFZCZn56RCjWABGsFaW8iWVJykBwDlGS3/",
"component_encodings": [],
"pipeline_proto_coder_id": "ref_Coder_FastPrimitivesCoder_5"
}
],
"is_pair_like": true,
"pipeline_proto_coder_id": "ref_Coder_FastPrimitivesCoder_5"
},
{
"@type": "kind:global_window"
}
],
"is_wrapper": true
},
"output_name": "None",
"user_name": "assert_that/Match.out"
}
],
"parallel_input": {
"@type": "OutputReference",
"output_name": "None",
"step_name": "s22"
},
"serialized_fn": "<string of 1736 bytes>",
"user_name": "assert_that/Match"
}
}
],
"type": "JOB_TYPE_BATCH"
}
INFO:apache_beam.runners.dataflow.internal.apiclient:Create job: <Job
createTime: u'2020-02-28T20:10:58.193479Z'
currentStateTime: u'1970-01-01T00:00:00Z'
id: u'2020-02-28_12_10_56-4280396918208646376'
location: u'us-central1'
name: u'beamapp-jenkins-0228194328-541427'
projectId: u'apache-beam-testing'
stageStates: []
startTime: u'2020-02-28T20:10:58.193479Z'
steps: []
tempFiles: []
type: TypeValueValuesEnum(JOB_TYPE_BATCH, 1)>
INFO:apache_beam.runners.dataflow.internal.apiclient:Created job with id: [2020-02-28_12_10_56-4280396918208646376]
INFO:apache_beam.runners.dataflow.internal.apiclient:To access the Dataflow monitoring console, please navigate to https://console.cloud.google.com/dataflow/jobs/us-central1/2020-02-28_12_10_56-4280396918208646376?project=apache-beam-testing
INFO:apache_beam.runners.dataflow.dataflow_runner:Job 2020-02-28_12_10_56-4280396918208646376 is in state JOB_STATE_RUNNING
INFO:apache_beam.runners.dataflow.dataflow_runner:2020-02-28T20:10:56.644Z: JOB_MESSAGE_DETAILED: Autoscaling is enabled for job 2020-02-28_12_10_56-4280396918208646376. The number of workers will be between 1 and 1000.
INFO:apache_beam.runners.dataflow.dataflow_runner:2020-02-28T20:10:56.644Z: JOB_MESSAGE_DETAILED: Autoscaling was automatically enabled for job 2020-02-28_12_10_56-4280396918208646376.
INFO:apache_beam.runners.dataflow.dataflow_runner:2020-02-28T20:11:00.287Z: JOB_MESSAGE_DETAILED: Checking permissions granted to controller Service Account.
INFO:apache_beam.runners.dataflow.dataflow_runner:2020-02-28T20:11:01.488Z: JOB_MESSAGE_BASIC: Worker configuration: n1-standard-1 in us-central1-c.
INFO:apache_beam.runners.dataflow.dataflow_runner:2020-02-28T20:11:02.101Z: JOB_MESSAGE_DETAILED: Expanding CoGroupByKey operations into optimizable parts.
INFO:apache_beam.runners.dataflow.dataflow_runner:2020-02-28T20:11:02.128Z: JOB_MESSAGE_DEBUG: Combiner lifting skipped for step assert_that/Group/GroupByKey: GroupByKey not followed by a combiner.
INFO:apache_beam.runners.dataflow.dataflow_runner:2020-02-28T20:11:02.208Z: JOB_MESSAGE_DEBUG: Combiner lifting skipped for step read from datastore/GroupByKey: GroupByKey not followed by a combiner.
INFO:apache_beam.runners.dataflow.dataflow_runner:2020-02-28T20:11:02.246Z: JOB_MESSAGE_DETAILED: Expanding GroupByKey operations into optimizable parts.
INFO:apache_beam.runners.dataflow.dataflow_runner:2020-02-28T20:11:02.277Z: JOB_MESSAGE_DETAILED: Lifting ValueCombiningMappingFns into MergeBucketsMappingFns
INFO:apache_beam.runners.dataflow.dataflow_runner:2020-02-28T20:11:02.407Z: JOB_MESSAGE_DEBUG: Annotating graph with Autotuner information.
INFO:apache_beam.runners.dataflow.dataflow_runner:2020-02-28T20:11:02.469Z: JOB_MESSAGE_DETAILED: Fusing adjacent ParDo, Read, Write, and Flatten operations
INFO:apache_beam.runners.dataflow.dataflow_runner:2020-02-28T20:11:02.497Z: JOB_MESSAGE_DETAILED: Fusing consumer read from datastore/SplitQuery into read from datastore/UserQuery/Read
INFO:apache_beam.runners.dataflow.dataflow_runner:2020-02-28T20:11:02.520Z: JOB_MESSAGE_DETAILED: Fusing consumer read from datastore/GroupByKey/Reify into read from datastore/SplitQuery
INFO:apache_beam.runners.dataflow.dataflow_runner:2020-02-28T20:11:02.560Z: JOB_MESSAGE_DETAILED: Fusing consumer read from datastore/GroupByKey/Write into read from datastore/GroupByKey/Reify
INFO:apache_beam.runners.dataflow.dataflow_runner:2020-02-28T20:11:02.598Z: JOB_MESSAGE_DETAILED: Fusing consumer read from datastore/GroupByKey/GroupByWindow into read from datastore/GroupByKey/Read
INFO:apache_beam.runners.dataflow.dataflow_runner:2020-02-28T20:11:02.632Z: JOB_MESSAGE_DETAILED: Fusing consumer read from datastore/Values into read from datastore/GroupByKey/GroupByWindow
INFO:apache_beam.runners.dataflow.dataflow_runner:2020-02-28T20:11:02.668Z: JOB_MESSAGE_DETAILED: Fusing consumer read from datastore/Flatten into read from datastore/Values
INFO:apache_beam.runners.dataflow.dataflow_runner:2020-02-28T20:11:02.702Z: JOB_MESSAGE_DETAILED: Fusing consumer read from datastore/Read into read from datastore/Flatten
INFO:apache_beam.runners.dataflow.dataflow_runner:2020-02-28T20:11:02.741Z: JOB_MESSAGE_DETAILED: Fusing consumer Globally/CombineGlobally(CountCombineFn)/KeyWithVoid into read from datastore/Read
INFO:apache_beam.runners.dataflow.dataflow_runner:2020-02-28T20:11:02.778Z: JOB_MESSAGE_DETAILED: Fusing consumer Globally/CombineGlobally(CountCombineFn)/CombinePerKey/GroupByKey+Globally/CombineGlobally(CountCombineFn)/CombinePerKey/Combine/Partial into Globally/CombineGlobally(CountCombineFn)/KeyWithVoid
INFO:apache_beam.runners.dataflow.dataflow_runner:2020-02-28T20:11:02.805Z: JOB_MESSAGE_DETAILED: Fusing consumer Globally/CombineGlobally(CountCombineFn)/CombinePerKey/GroupByKey/Reify into Globally/CombineGlobally(CountCombineFn)/CombinePerKey/GroupByKey+Globally/CombineGlobally(CountCombineFn)/CombinePerKey/Combine/Partial
INFO:apache_beam.runners.dataflow.dataflow_runner:2020-02-28T20:11:02.841Z: JOB_MESSAGE_DETAILED: Fusing consumer Globally/CombineGlobally(CountCombineFn)/CombinePerKey/GroupByKey/Write into Globally/CombineGlobally(CountCombineFn)/CombinePerKey/GroupByKey/Reify
INFO:apache_beam.runners.dataflow.dataflow_runner:2020-02-28T20:11:02.869Z: JOB_MESSAGE_DETAILED: Fusing consumer Globally/CombineGlobally(CountCombineFn)/CombinePerKey/Combine into Globally/CombineGlobally(CountCombineFn)/CombinePerKey/GroupByKey/Read
INFO:apache_beam.runners.dataflow.dataflow_runner:2020-02-28T20:11:02.910Z: JOB_MESSAGE_DETAILED: Fusing consumer Globally/CombineGlobally(CountCombineFn)/CombinePerKey/Combine/Extract into Globally/CombineGlobally(CountCombineFn)/CombinePerKey/Combine
INFO:apache_beam.runners.dataflow.dataflow_runner:2020-02-28T20:11:02.944Z: JOB_MESSAGE_DETAILED: Fusing consumer Globally/CombineGlobally(CountCombineFn)/UnKey into Globally/CombineGlobally(CountCombineFn)/CombinePerKey/Combine/Extract
INFO:apache_beam.runners.dataflow.dataflow_runner:2020-02-28T20:11:02.979Z: JOB_MESSAGE_DETAILED: Unzipping flatten s19 for input s17.None
INFO:apache_beam.runners.dataflow.dataflow_runner:2020-02-28T20:11:03.019Z: JOB_MESSAGE_DETAILED: Fusing unzipped copy of assert_that/Group/GroupByKey/Reify, through flatten assert_that/Group/Flatten, into producer assert_that/Group/pair_with_0
INFO:apache_beam.runners.dataflow.dataflow_runner:2020-02-28T20:11:03.074Z: JOB_MESSAGE_DETAILED: Fusing consumer assert_that/Group/GroupByKey/GroupByWindow into assert_that/Group/GroupByKey/Read
INFO:apache_beam.runners.dataflow.dataflow_runner:2020-02-28T20:11:03.109Z: JOB_MESSAGE_DETAILED: Fusing consumer assert_that/Group/Map(_merge_tagged_vals_under_key) into assert_that/Group/GroupByKey/GroupByWindow
INFO:apache_beam.runners.dataflow.dataflow_runner:2020-02-28T20:11:03.150Z: JOB_MESSAGE_DETAILED: Fusing consumer assert_that/Unkey into assert_that/Group/Map(_merge_tagged_vals_under_key)
INFO:apache_beam.runners.dataflow.dataflow_runner:2020-02-28T20:11:03.183Z: JOB_MESSAGE_DETAILED: Fusing consumer assert_that/Match into assert_that/Unkey
INFO:apache_beam.runners.dataflow.dataflow_runner:2020-02-28T20:11:03.217Z: JOB_MESSAGE_DETAILED: Unzipping flatten s19-u40 for input s20-reify-value9-c38
INFO:apache_beam.runners.dataflow.dataflow_runner:2020-02-28T20:11:03.250Z: JOB_MESSAGE_DETAILED: Fusing unzipped copy of assert_that/Group/GroupByKey/Write, through flatten assert_that/Group/Flatten/Unzipped-1, into producer assert_that/Group/GroupByKey/Reify
INFO:apache_beam.runners.dataflow.dataflow_runner:2020-02-28T20:11:03.277Z: JOB_MESSAGE_DETAILED: Fusing consumer assert_that/Group/pair_with_0 into assert_that/Create/Read
INFO:apache_beam.runners.dataflow.dataflow_runner:2020-02-28T20:11:03.319Z: JOB_MESSAGE_DETAILED: Fusing consumer assert_that/Group/GroupByKey/Reify into assert_that/Group/pair_with_1
INFO:apache_beam.runners.dataflow.dataflow_runner:2020-02-28T20:11:03.351Z: JOB_MESSAGE_DETAILED: Fusing consumer assert_that/Group/GroupByKey/Write into assert_that/Group/GroupByKey/Reify
INFO:apache_beam.runners.dataflow.dataflow_runner:2020-02-28T20:11:03.379Z: JOB_MESSAGE_DETAILED: Fusing consumer Globally/CombineGlobally(CountCombineFn)/InjectDefault/InjectDefault into Globally/CombineGlobally(CountCombineFn)/DoOnce/Read
INFO:apache_beam.runners.dataflow.dataflow_runner:2020-02-28T20:11:03.415Z: JOB_MESSAGE_DETAILED: Fusing consumer assert_that/WindowInto(WindowIntoFn) into Globally/CombineGlobally(CountCombineFn)/InjectDefault/InjectDefault
INFO:apache_beam.runners.dataflow.dataflow_runner:2020-02-28T20:11:03.453Z: JOB_MESSAGE_DETAILED: Fusing consumer assert_that/ToVoidKey into assert_that/WindowInto(WindowIntoFn)
INFO:apache_beam.runners.dataflow.dataflow_runner:2020-02-28T20:11:03.478Z: JOB_MESSAGE_DETAILED: Fusing consumer assert_that/Group/pair_with_1 into assert_that/ToVoidKey
INFO:apache_beam.runners.dataflow.dataflow_runner:2020-02-28T20:11:03.515Z: JOB_MESSAGE_DEBUG: Workflow config is missing a default resource spec.
INFO:apache_beam.runners.dataflow.dataflow_runner:2020-02-28T20:11:03.545Z: JOB_MESSAGE_DEBUG: Adding StepResource setup and teardown to workflow graph.
INFO:apache_beam.runners.dataflow.dataflow_runner:2020-02-28T20:11:03.580Z: JOB_MESSAGE_DEBUG: Adding workflow start and stop steps.
INFO:apache_beam.runners.dataflow.dataflow_runner:2020-02-28T20:11:03.613Z: JOB_MESSAGE_DEBUG: Assigning stage ids.
INFO:apache_beam.runners.dataflow.dataflow_runner:2020-02-28T20:11:03.807Z: JOB_MESSAGE_DEBUG: Executing wait step start51
INFO:apache_beam.runners.dataflow.dataflow_runner:2020-02-28T20:11:03.892Z: JOB_MESSAGE_BASIC: Executing operation assert_that/Group/GroupByKey/Create
INFO:apache_beam.runners.dataflow.dataflow_runner:2020-02-28T20:11:03.936Z: JOB_MESSAGE_BASIC: Executing operation read from datastore/GroupByKey/Create
INFO:apache_beam.runners.dataflow.dataflow_runner:2020-02-28T20:11:03.948Z: JOB_MESSAGE_DEBUG: Starting worker pool setup.
INFO:apache_beam.runners.dataflow.dataflow_runner:2020-02-28T20:11:03.964Z: JOB_MESSAGE_BASIC: Executing operation Globally/CombineGlobally(CountCombineFn)/CombinePerKey/GroupByKey/Create
INFO:apache_beam.runners.dataflow.dataflow_runner:2020-02-28T20:11:03.986Z: JOB_MESSAGE_BASIC: Starting 1 workers in us-central1-c...
INFO:apache_beam.runners.dataflow.dataflow_runner:2020-02-28T20:11:04.038Z: JOB_MESSAGE_BASIC: Finished operation assert_that/Group/GroupByKey/Create
INFO:apache_beam.runners.dataflow.dataflow_runner:2020-02-28T20:11:04.054Z: JOB_MESSAGE_BASIC: Finished operation read from datastore/GroupByKey/Create
INFO:apache_beam.runners.dataflow.dataflow_runner:2020-02-28T20:11:04.054Z: JOB_MESSAGE_BASIC: Finished operation Globally/CombineGlobally(CountCombineFn)/CombinePerKey/GroupByKey/Create
INFO:apache_beam.runners.dataflow.dataflow_runner:2020-02-28T20:11:04.108Z: JOB_MESSAGE_DEBUG: Value "assert_that/Group/GroupByKey/Session" materialized.
INFO:apache_beam.runners.dataflow.dataflow_runner:2020-02-28T20:11:04.145Z: JOB_MESSAGE_DEBUG: Value "Globally/CombineGlobally(CountCombineFn)/CombinePerKey/GroupByKey/Session" materialized.
INFO:apache_beam.runners.dataflow.dataflow_runner:2020-02-28T20:11:04.183Z: JOB_MESSAGE_DEBUG: Value "read from datastore/GroupByKey/Session" materialized.
INFO:apache_beam.runners.dataflow.dataflow_runner:2020-02-28T20:11:04.211Z: JOB_MESSAGE_BASIC: Executing operation assert_that/Create/Read+assert_that/Group/pair_with_0+assert_that/Group/GroupByKey/Reify+assert_that/Group/GroupByKey/Write
INFO:apache_beam.runners.dataflow.dataflow_runner:2020-02-28T20:11:04.265Z: JOB_MESSAGE_BASIC: Executing operation read from datastore/UserQuery/Read+read from datastore/SplitQuery+read from datastore/GroupByKey/Reify+read from datastore/GroupByKey/Write
INFO:apache_beam.runners.dataflow.dataflow_runner:2020-02-28T20:11:10.864Z: JOB_MESSAGE_WARNING: Your project already contains 100 Dataflow-created metric descriptors and Stackdriver will not create new Dataflow custom metrics for this job. Each unique user-defined metric name (independent of the DoFn in which it is defined) produces a new metric descriptor. To delete old / unused metric descriptors see https://developers.google.com/apis-explorer/#p/monitoring/v3/monitoring.projects.metricDescriptors.list and https://developers.google.com/apis-explorer/#p/monitoring/v3/monitoring.projects.metricDescriptors.delete
INFO:apache_beam.runners.dataflow.dataflow_runner:2020-02-28T20:11:28.243Z: JOB_MESSAGE_DETAILED: Autoscaling: Raised the number of workers to 1 based on the rate of progress in the currently running step(s).
INFO:apache_beam.runners.dataflow.dataflow_runner:2020-02-28T20:12:36.565Z: JOB_MESSAGE_DETAILED: Workers have started successfully.
INFO:apache_beam.runners.dataflow.dataflow_runner:2020-02-28T20:12:36.607Z: JOB_MESSAGE_DETAILED: Workers have started successfully.
INFO:oauth2client.transport:Refreshing due to a 401 (attempt 1/2)
INFO:apache_beam.runners.dataflow.dataflow_runner:2020-02-28T20:15:47.364Z: JOB_MESSAGE_BASIC: Finished operation read from datastore/UserQuery/Read+read from datastore/SplitQuery+read from datastore/GroupByKey/Reify+read from datastore/GroupByKey/Write
INFO:apache_beam.runners.dataflow.dataflow_runner:2020-02-28T20:15:47.437Z: JOB_MESSAGE_BASIC: Executing operation read from datastore/GroupByKey/Close
INFO:apache_beam.runners.dataflow.dataflow_runner:2020-02-28T20:15:47.494Z: JOB_MESSAGE_BASIC: Finished operation read from datastore/GroupByKey/Close
INFO:apache_beam.runners.dataflow.dataflow_runner:2020-02-28T20:15:47.574Z: JOB_MESSAGE_BASIC: Executing operation read from datastore/GroupByKey/Read+read from datastore/GroupByKey/GroupByWindow+read from datastore/Values+read from datastore/Flatten+read from datastore/Read+Globally/CombineGlobally(CountCombineFn)/KeyWithVoid+Globally/CombineGlobally(CountCombineFn)/CombinePerKey/GroupByKey+Globally/CombineGlobally(CountCombineFn)/CombinePerKey/Combine/Partial+Globally/CombineGlobally(CountCombineFn)/CombinePerKey/GroupByKey/Reify+Globally/CombineGlobally(CountCombineFn)/CombinePerKey/GroupByKey/Write
INFO:apache_beam.runners.dataflow.dataflow_runner:2020-02-28T20:15:57.392Z: JOB_MESSAGE_BASIC: Finished operation assert_that/Create/Read+assert_that/Group/pair_with_0+assert_that/Group/GroupByKey/Reify+assert_that/Group/GroupByKey/Write
INFO:apache_beam.runners.dataflow.dataflow_runner:2020-02-28T20:16:00.659Z: JOB_MESSAGE_BASIC: Finished operation read from datastore/GroupByKey/Read+read from datastore/GroupByKey/GroupByWindow+read from datastore/Values+read from datastore/Flatten+read from datastore/Read+Globally/CombineGlobally(CountCombineFn)/KeyWithVoid+Globally/CombineGlobally(CountCombineFn)/CombinePerKey/GroupByKey+Globally/CombineGlobally(CountCombineFn)/CombinePerKey/Combine/Partial+Globally/CombineGlobally(CountCombineFn)/CombinePerKey/GroupByKey/Reify+Globally/CombineGlobally(CountCombineFn)/CombinePerKey/GroupByKey/Write
INFO:apache_beam.runners.dataflow.dataflow_runner:2020-02-28T20:16:00.738Z: JOB_MESSAGE_BASIC: Executing operation Globally/CombineGlobally(CountCombineFn)/CombinePerKey/GroupByKey/Close
INFO:apache_beam.runners.dataflow.dataflow_runner:2020-02-28T20:16:00.794Z: JOB_MESSAGE_BASIC: Finished operation Globally/CombineGlobally(CountCombineFn)/CombinePerKey/GroupByKey/Close
INFO:apache_beam.runners.dataflow.dataflow_runner:2020-02-28T20:16:00.863Z: JOB_MESSAGE_BASIC: Executing operation Globally/CombineGlobally(CountCombineFn)/CombinePerKey/GroupByKey/Read+Globally/CombineGlobally(CountCombineFn)/CombinePerKey/Combine+Globally/CombineGlobally(CountCombineFn)/CombinePerKey/Combine/Extract+Globally/CombineGlobally(CountCombineFn)/UnKey
INFO:apache_beam.runners.dataflow.dataflow_runner:2020-02-28T20:16:06.728Z: JOB_MESSAGE_BASIC: Finished operation Globally/CombineGlobally(CountCombineFn)/CombinePerKey/GroupByKey/Read+Globally/CombineGlobally(CountCombineFn)/CombinePerKey/Combine+Globally/CombineGlobally(CountCombineFn)/CombinePerKey/Combine/Extract+Globally/CombineGlobally(CountCombineFn)/UnKey
INFO:apache_beam.runners.dataflow.dataflow_runner:2020-02-28T20:16:06.785Z: JOB_MESSAGE_DEBUG: Value "Globally/CombineGlobally(CountCombineFn)/UnKey.out" materialized.
INFO:apache_beam.runners.dataflow.dataflow_runner:2020-02-28T20:16:06.853Z: JOB_MESSAGE_BASIC: Executing operation Globally/CombineGlobally(CountCombineFn)/InjectDefault/_UnpickledSideInput(UnKey.out.0)
INFO:apache_beam.runners.dataflow.dataflow_runner:2020-02-28T20:16:06.910Z: JOB_MESSAGE_BASIC: Finished operation Globally/CombineGlobally(CountCombineFn)/InjectDefault/_UnpickledSideInput(UnKey.out.0)
INFO:apache_beam.runners.dataflow.dataflow_runner:2020-02-28T20:16:06.975Z: JOB_MESSAGE_DEBUG: Value "Globally/CombineGlobally(CountCombineFn)/InjectDefault/_UnpickledSideInput(UnKey.out.0).output" materialized.
INFO:apache_beam.runners.dataflow.dataflow_runner:2020-02-28T20:16:07.062Z: JOB_MESSAGE_BASIC: Executing operation Globally/CombineGlobally(CountCombineFn)/DoOnce/Read+Globally/CombineGlobally(CountCombineFn)/InjectDefault/InjectDefault+assert_that/WindowInto(WindowIntoFn)+assert_that/ToVoidKey+assert_that/Group/pair_with_1+assert_that/Group/GroupByKey/Reify+assert_that/Group/GroupByKey/Write
INFO:apache_beam.runners.dataflow.dataflow_runner:2020-02-28T20:16:11.762Z: JOB_MESSAGE_BASIC: Finished operation Globally/CombineGlobally(CountCombineFn)/DoOnce/Read+Globally/CombineGlobally(CountCombineFn)/InjectDefault/InjectDefault+assert_that/WindowInto(WindowIntoFn)+assert_that/ToVoidKey+assert_that/Group/pair_with_1+assert_that/Group/GroupByKey/Reify+assert_that/Group/GroupByKey/Write
INFO:apache_beam.runners.dataflow.dataflow_runner:2020-02-28T20:16:11.844Z: JOB_MESSAGE_BASIC: Executing operation assert_that/Group/GroupByKey/Close
INFO:apache_beam.runners.dataflow.dataflow_runner:2020-02-28T20:16:11.900Z: JOB_MESSAGE_BASIC: Finished operation assert_that/Group/GroupByKey/Close
INFO:apache_beam.runners.dataflow.dataflow_runner:2020-02-28T20:16:11.978Z: JOB_MESSAGE_BASIC: Executing operation assert_that/Group/GroupByKey/Read+assert_that/Group/GroupByKey/GroupByWindow+assert_that/Group/Map(_merge_tagged_vals_under_key)+assert_that/Unkey+assert_that/Match
INFO:apache_beam.runners.dataflow.dataflow_runner:2020-02-28T20:16:18.277Z: JOB_MESSAGE_BASIC: Finished operation assert_that/Group/GroupByKey/Read+assert_that/Group/GroupByKey/GroupByWindow+assert_that/Group/Map(_merge_tagged_vals_under_key)+assert_that/Unkey+assert_that/Match
INFO:apache_beam.runners.dataflow.dataflow_runner:2020-02-28T20:16:18.359Z: JOB_MESSAGE_DEBUG: Executing success step success49
INFO:apache_beam.runners.dataflow.dataflow_runner:2020-02-28T20:16:19.493Z: JOB_MESSAGE_DETAILED: Cleaning up.
INFO:apache_beam.runners.dataflow.dataflow_runner:2020-02-28T20:16:19.562Z: JOB_MESSAGE_DEBUG: Starting worker pool teardown.
INFO:apache_beam.runners.dataflow.dataflow_runner:2020-02-28T20:16:19.599Z: JOB_MESSAGE_BASIC: Stopping worker pool...
INFO:apache_beam.runners.dataflow.dataflow_runner:2020-02-28T20:17:35.550Z: JOB_MESSAGE_DETAILED: Autoscaling: Resized worker pool from 1 to 0.
INFO:apache_beam.runners.dataflow.dataflow_runner:2020-02-28T20:17:35.592Z: JOB_MESSAGE_BASIC: Worker pool stopped.
INFO:apache_beam.runners.dataflow.dataflow_runner:2020-02-28T20:17:35.649Z: JOB_MESSAGE_DEBUG: Tearing down pending resources...
INFO:apache_beam.runners.dataflow.dataflow_runner:Job 2020-02-28_12_10_56-4280396918208646376 is in state JOB_STATE_DONE
test_datastore_write_limit (apache_beam.io.gcp.datastore_write_it_test.DatastoreWriteIT) ... ok
----------------------------------------------------------------------
XML: nosetests-postCommitIT-df.xml
----------------------------------------------------------------------
XML: <https://builds.apache.org/job/beam_PostCommit_Python2/ws/src/sdks/python/nosetests.xml>
----------------------------------------------------------------------
Ran 55 tests in 3610.863s
OK (SKIP=7)
FAILURE: Build failed with an exception.
* Where:
Build file '<https://builds.apache.org/job/beam_PostCommit_Python2/ws/src/sdks/python/test-suites/portable/py2/build.gradle'> line: 143
* What went wrong:
Execution failed for task ':sdks:python:test-suites:portable:py2:crossLanguagePortableWordCount'.
> Process 'command 'sh'' finished with non-zero exit value 1
* Try:
Run with --stacktrace option to get the stack trace. Run with --info or --debug option to get more log output. Run with --scan to get full insights.
* Get more help at https://help.gradle.org
Deprecated Gradle features were used in this build, making it incompatible with Gradle 6.0.
Use '--warning-mode all' to show the individual deprecation warnings.
See https://docs.gradle.org/5.2.1/userguide/command_line_interface.html#sec:command_line_warnings
BUILD FAILED in 1h 1m 23s
124 actionable tasks: 100 executed, 21 from cache, 3 up-to-date
Publishing build scan...
https://gradle.com/s/4waux3umuwdas
Build step 'Invoke Gradle script' changed build result to FAILURE
Build step 'Invoke Gradle script' marked build as failure
---------------------------------------------------------------------
To unsubscribe, e-mail: builds-unsubscribe@beam.apache.org
For additional commands, e-mail: builds-help@beam.apache.org
Jenkins build is back to normal : beam_PostCommit_Python2 #1845
Posted by Apache Jenkins Server <je...@builds.apache.org>.
See <https://builds.apache.org/job/beam_PostCommit_Python2/1845/display/redirect?page=changes>
---------------------------------------------------------------------
To unsubscribe, e-mail: builds-unsubscribe@beam.apache.org
For additional commands, e-mail: builds-help@beam.apache.org
Build failed in Jenkins: beam_PostCommit_Python2 #1844
Posted by Apache Jenkins Server <je...@builds.apache.org>.
See <https://builds.apache.org/job/beam_PostCommit_Python2/1844/display/redirect?page=changes>
Changes:
[chadrik] more typing fixes
[chadrik] Fix typing issue with python 3.5.2
[chadrik] fixes
[chadrik] Address more issues discovered after rebase
[chadrik] Improve the idiom used for conditional imports
[chadrik] Fix more issues
[chadrik] Update to latest mypy version
[github] [BEAM-8487] Handle nested forward references (#10932)
------------------------------------------
[...truncated 10.45 MB...]
"key": "fn",
"label": "Transform Function",
"namespace": "apache_beam.transforms.core.CallableWrapperDoFn",
"type": "STRING",
"value": "_equal"
},
{
"key": "fn",
"label": "Transform Function",
"namespace": "apache_beam.transforms.core.ParDo",
"shortValue": "CallableWrapperDoFn",
"type": "STRING",
"value": "apache_beam.transforms.core.CallableWrapperDoFn"
}
],
"non_parallel_inputs": {},
"output_info": [
{
"encoding": {
"@type": "kind:windowed_value",
"component_encodings": [
{
"@type": "FastPrimitivesCoder$eNprYEpOLEhMzkiNT0pNzNVLzk9JLSqGUlxuicUlAUWZuZklmWWpxc4gQa5CBs3GQsbaQqZQ/vi0xJycpMTk7Hiw+kJmPEYFZCZn56RCjWABGsFaW8iWVJykBwDlGS3/",
"component_encodings": [
{
"@type": "FastPrimitivesCoder$eNprYEpOLEhMzkiNT0pNzNVLzk9JLSqGUlxuicUlAUWZuZklmWWpxc4gQa5CBs3GQsbaQqZQ/vi0xJycpMTk7Hiw+kJmPEYFZCZn56RCjWABGsFaW8iWVJykBwDlGS3/",
"component_encodings": [],
"pipeline_proto_coder_id": "ref_Coder_FastPrimitivesCoder_5"
},
{
"@type": "FastPrimitivesCoder$eNprYEpOLEhMzkiNT0pNzNVLzk9JLSqGUlxuicUlAUWZuZklmWWpxc4gQa5CBs3GQsbaQqZQ/vi0xJycpMTk7Hiw+kJmPEYFZCZn56RCjWABGsFaW8iWVJykBwDlGS3/",
"component_encodings": [],
"pipeline_proto_coder_id": "ref_Coder_FastPrimitivesCoder_5"
}
],
"is_pair_like": true,
"pipeline_proto_coder_id": "ref_Coder_FastPrimitivesCoder_5"
},
{
"@type": "kind:global_window"
}
],
"is_wrapper": true
},
"output_name": "None",
"user_name": "assert_that/Match.out"
}
],
"parallel_input": {
"@type": "OutputReference",
"output_name": "None",
"step_name": "s22"
},
"serialized_fn": "<string of 1740 bytes>",
"user_name": "assert_that/Match"
}
}
],
"type": "JOB_TYPE_BATCH"
}
INFO:apache_beam.runners.dataflow.internal.apiclient:Create job: <Job
createTime: u'2020-02-29T00:00:45.849980Z'
currentStateTime: u'1970-01-01T00:00:00Z'
id: u'2020-02-28_16_00_44-5017014031878956738'
location: u'us-central1'
name: u'beamapp-jenkins-0228233324-150396'
projectId: u'apache-beam-testing'
stageStates: []
startTime: u'2020-02-29T00:00:45.849980Z'
steps: []
tempFiles: []
type: TypeValueValuesEnum(JOB_TYPE_BATCH, 1)>
INFO:apache_beam.runners.dataflow.internal.apiclient:Created job with id: [2020-02-28_16_00_44-5017014031878956738]
INFO:apache_beam.runners.dataflow.internal.apiclient:To access the Dataflow monitoring console, please navigate to https://console.cloud.google.com/dataflow/jobs/us-central1/2020-02-28_16_00_44-5017014031878956738?project=apache-beam-testing
INFO:apache_beam.runners.dataflow.dataflow_runner:Job 2020-02-28_16_00_44-5017014031878956738 is in state JOB_STATE_RUNNING
INFO:apache_beam.runners.dataflow.dataflow_runner:2020-02-29T00:00:44.420Z: JOB_MESSAGE_DETAILED: Autoscaling was automatically enabled for job 2020-02-28_16_00_44-5017014031878956738.
INFO:apache_beam.runners.dataflow.dataflow_runner:2020-02-29T00:00:44.420Z: JOB_MESSAGE_DETAILED: Autoscaling is enabled for job 2020-02-28_16_00_44-5017014031878956738. The number of workers will be between 1 and 1000.
INFO:apache_beam.runners.dataflow.dataflow_runner:2020-02-29T00:00:48.231Z: JOB_MESSAGE_DETAILED: Checking permissions granted to controller Service Account.
INFO:apache_beam.runners.dataflow.dataflow_runner:2020-02-29T00:00:49.823Z: JOB_MESSAGE_BASIC: Worker configuration: n1-standard-1 in us-central1-a.
INFO:apache_beam.runners.dataflow.dataflow_runner:2020-02-29T00:00:50.419Z: JOB_MESSAGE_DETAILED: Expanding CoGroupByKey operations into optimizable parts.
INFO:apache_beam.runners.dataflow.dataflow_runner:2020-02-29T00:00:50.460Z: JOB_MESSAGE_DEBUG: Combiner lifting skipped for step assert_that/Group/GroupByKey: GroupByKey not followed by a combiner.
INFO:apache_beam.runners.dataflow.dataflow_runner:2020-02-29T00:00:50.533Z: JOB_MESSAGE_DEBUG: Combiner lifting skipped for step read from datastore/GroupByKey: GroupByKey not followed by a combiner.
INFO:apache_beam.runners.dataflow.dataflow_runner:2020-02-29T00:00:50.587Z: JOB_MESSAGE_DETAILED: Expanding GroupByKey operations into optimizable parts.
INFO:apache_beam.runners.dataflow.dataflow_runner:2020-02-29T00:00:50.620Z: JOB_MESSAGE_DETAILED: Lifting ValueCombiningMappingFns into MergeBucketsMappingFns
INFO:apache_beam.runners.dataflow.dataflow_runner:2020-02-29T00:00:50.770Z: JOB_MESSAGE_DEBUG: Annotating graph with Autotuner information.
INFO:apache_beam.runners.dataflow.dataflow_runner:2020-02-29T00:00:50.827Z: JOB_MESSAGE_DETAILED: Fusing adjacent ParDo, Read, Write, and Flatten operations
INFO:apache_beam.runners.dataflow.dataflow_runner:2020-02-29T00:00:50.867Z: JOB_MESSAGE_DETAILED: Fusing consumer read from datastore/SplitQuery into read from datastore/UserQuery/Read
INFO:apache_beam.runners.dataflow.dataflow_runner:2020-02-29T00:00:50.912Z: JOB_MESSAGE_DETAILED: Fusing consumer read from datastore/GroupByKey/Reify into read from datastore/SplitQuery
INFO:apache_beam.runners.dataflow.dataflow_runner:2020-02-29T00:00:50.950Z: JOB_MESSAGE_DETAILED: Fusing consumer read from datastore/GroupByKey/Write into read from datastore/GroupByKey/Reify
INFO:apache_beam.runners.dataflow.dataflow_runner:2020-02-29T00:00:50.993Z: JOB_MESSAGE_DETAILED: Fusing consumer read from datastore/GroupByKey/GroupByWindow into read from datastore/GroupByKey/Read
INFO:apache_beam.runners.dataflow.dataflow_runner:2020-02-29T00:00:51.016Z: JOB_MESSAGE_DETAILED: Fusing consumer read from datastore/Values into read from datastore/GroupByKey/GroupByWindow
INFO:apache_beam.runners.dataflow.dataflow_runner:2020-02-29T00:00:51.056Z: JOB_MESSAGE_DETAILED: Fusing consumer read from datastore/Flatten into read from datastore/Values
INFO:apache_beam.runners.dataflow.dataflow_runner:2020-02-29T00:00:51.093Z: JOB_MESSAGE_DETAILED: Fusing consumer read from datastore/Read into read from datastore/Flatten
INFO:apache_beam.runners.dataflow.dataflow_runner:2020-02-29T00:00:51.144Z: JOB_MESSAGE_DETAILED: Fusing consumer Globally/CombineGlobally(CountCombineFn)/KeyWithVoid into read from datastore/Read
INFO:apache_beam.runners.dataflow.dataflow_runner:2020-02-29T00:00:51.179Z: JOB_MESSAGE_DETAILED: Fusing consumer Globally/CombineGlobally(CountCombineFn)/CombinePerKey/GroupByKey+Globally/CombineGlobally(CountCombineFn)/CombinePerKey/Combine/Partial into Globally/CombineGlobally(CountCombineFn)/KeyWithVoid
INFO:apache_beam.runners.dataflow.dataflow_runner:2020-02-29T00:00:51.218Z: JOB_MESSAGE_DETAILED: Fusing consumer Globally/CombineGlobally(CountCombineFn)/CombinePerKey/GroupByKey/Reify into Globally/CombineGlobally(CountCombineFn)/CombinePerKey/GroupByKey+Globally/CombineGlobally(CountCombineFn)/CombinePerKey/Combine/Partial
INFO:apache_beam.runners.dataflow.dataflow_runner:2020-02-29T00:00:51.254Z: JOB_MESSAGE_DETAILED: Fusing consumer Globally/CombineGlobally(CountCombineFn)/CombinePerKey/GroupByKey/Write into Globally/CombineGlobally(CountCombineFn)/CombinePerKey/GroupByKey/Reify
INFO:apache_beam.runners.dataflow.dataflow_runner:2020-02-29T00:00:51.292Z: JOB_MESSAGE_DETAILED: Fusing consumer Globally/CombineGlobally(CountCombineFn)/CombinePerKey/Combine into Globally/CombineGlobally(CountCombineFn)/CombinePerKey/GroupByKey/Read
INFO:apache_beam.runners.dataflow.dataflow_runner:2020-02-29T00:00:51.325Z: JOB_MESSAGE_DETAILED: Fusing consumer Globally/CombineGlobally(CountCombineFn)/CombinePerKey/Combine/Extract into Globally/CombineGlobally(CountCombineFn)/CombinePerKey/Combine
INFO:apache_beam.runners.dataflow.dataflow_runner:2020-02-29T00:00:51.361Z: JOB_MESSAGE_DETAILED: Fusing consumer Globally/CombineGlobally(CountCombineFn)/UnKey into Globally/CombineGlobally(CountCombineFn)/CombinePerKey/Combine/Extract
INFO:apache_beam.runners.dataflow.dataflow_runner:2020-02-29T00:00:51.401Z: JOB_MESSAGE_DETAILED: Unzipping flatten s19 for input s17.None
INFO:apache_beam.runners.dataflow.dataflow_runner:2020-02-29T00:00:51.442Z: JOB_MESSAGE_DETAILED: Fusing unzipped copy of assert_that/Group/GroupByKey/Reify, through flatten assert_that/Group/Flatten, into producer assert_that/Group/pair_with_0
INFO:apache_beam.runners.dataflow.dataflow_runner:2020-02-29T00:00:51.480Z: JOB_MESSAGE_DETAILED: Fusing consumer assert_that/Group/GroupByKey/GroupByWindow into assert_that/Group/GroupByKey/Read
INFO:apache_beam.runners.dataflow.dataflow_runner:2020-02-29T00:00:51.513Z: JOB_MESSAGE_DETAILED: Fusing consumer assert_that/Group/Map(_merge_tagged_vals_under_key) into assert_that/Group/GroupByKey/GroupByWindow
INFO:apache_beam.runners.dataflow.dataflow_runner:2020-02-29T00:00:51.548Z: JOB_MESSAGE_DETAILED: Fusing consumer assert_that/Unkey into assert_that/Group/Map(_merge_tagged_vals_under_key)
INFO:apache_beam.runners.dataflow.dataflow_runner:2020-02-29T00:00:51.584Z: JOB_MESSAGE_DETAILED: Fusing consumer assert_that/Match into assert_that/Unkey
INFO:apache_beam.runners.dataflow.dataflow_runner:2020-02-29T00:00:51.618Z: JOB_MESSAGE_DETAILED: Unzipping flatten s19-u40 for input s20-reify-value9-c38
INFO:apache_beam.runners.dataflow.dataflow_runner:2020-02-29T00:00:51.656Z: JOB_MESSAGE_DETAILED: Fusing unzipped copy of assert_that/Group/GroupByKey/Write, through flatten assert_that/Group/Flatten/Unzipped-1, into producer assert_that/Group/GroupByKey/Reify
INFO:apache_beam.runners.dataflow.dataflow_runner:2020-02-29T00:00:51.693Z: JOB_MESSAGE_DETAILED: Fusing consumer assert_that/Group/pair_with_0 into assert_that/Create/Read
INFO:apache_beam.runners.dataflow.dataflow_runner:2020-02-29T00:00:51.729Z: JOB_MESSAGE_DETAILED: Fusing consumer assert_that/Group/GroupByKey/Reify into assert_that/Group/pair_with_1
INFO:apache_beam.runners.dataflow.dataflow_runner:2020-02-29T00:00:51.766Z: JOB_MESSAGE_DETAILED: Fusing consumer assert_that/Group/GroupByKey/Write into assert_that/Group/GroupByKey/Reify
INFO:apache_beam.runners.dataflow.dataflow_runner:2020-02-29T00:00:51.800Z: JOB_MESSAGE_DETAILED: Fusing consumer Globally/CombineGlobally(CountCombineFn)/InjectDefault/InjectDefault into Globally/CombineGlobally(CountCombineFn)/DoOnce/Read
INFO:apache_beam.runners.dataflow.dataflow_runner:2020-02-29T00:00:51.830Z: JOB_MESSAGE_DETAILED: Fusing consumer assert_that/WindowInto(WindowIntoFn) into Globally/CombineGlobally(CountCombineFn)/InjectDefault/InjectDefault
INFO:apache_beam.runners.dataflow.dataflow_runner:2020-02-29T00:00:51.863Z: JOB_MESSAGE_DETAILED: Fusing consumer assert_that/ToVoidKey into assert_that/WindowInto(WindowIntoFn)
INFO:apache_beam.runners.dataflow.dataflow_runner:2020-02-29T00:00:51.898Z: JOB_MESSAGE_DETAILED: Fusing consumer assert_that/Group/pair_with_1 into assert_that/ToVoidKey
INFO:apache_beam.runners.dataflow.dataflow_runner:2020-02-29T00:00:51.933Z: JOB_MESSAGE_DEBUG: Workflow config is missing a default resource spec.
INFO:apache_beam.runners.dataflow.dataflow_runner:2020-02-29T00:00:51.974Z: JOB_MESSAGE_DEBUG: Adding StepResource setup and teardown to workflow graph.
INFO:apache_beam.runners.dataflow.dataflow_runner:2020-02-29T00:00:52.012Z: JOB_MESSAGE_DEBUG: Adding workflow start and stop steps.
INFO:apache_beam.runners.dataflow.dataflow_runner:2020-02-29T00:00:52.050Z: JOB_MESSAGE_DEBUG: Assigning stage ids.
INFO:apache_beam.runners.dataflow.dataflow_runner:2020-02-29T00:00:52.215Z: JOB_MESSAGE_DEBUG: Executing wait step start51
INFO:apache_beam.runners.dataflow.dataflow_runner:2020-02-29T00:00:52.345Z: JOB_MESSAGE_BASIC: Executing operation assert_that/Group/GroupByKey/Create
INFO:apache_beam.runners.dataflow.dataflow_runner:2020-02-29T00:00:52.379Z: JOB_MESSAGE_BASIC: Executing operation read from datastore/GroupByKey/Create
INFO:apache_beam.runners.dataflow.dataflow_runner:2020-02-29T00:00:52.390Z: JOB_MESSAGE_DEBUG: Starting worker pool setup.
INFO:apache_beam.runners.dataflow.dataflow_runner:2020-02-29T00:00:52.410Z: JOB_MESSAGE_BASIC: Executing operation Globally/CombineGlobally(CountCombineFn)/CombinePerKey/GroupByKey/Create
INFO:apache_beam.runners.dataflow.dataflow_runner:2020-02-29T00:00:52.432Z: JOB_MESSAGE_BASIC: Starting 1 workers in us-central1-a...
INFO:apache_beam.runners.dataflow.dataflow_runner:2020-02-29T00:00:52.481Z: JOB_MESSAGE_BASIC: Finished operation assert_that/Group/GroupByKey/Create
INFO:apache_beam.runners.dataflow.dataflow_runner:2020-02-29T00:00:52.494Z: JOB_MESSAGE_BASIC: Finished operation read from datastore/GroupByKey/Create
INFO:apache_beam.runners.dataflow.dataflow_runner:2020-02-29T00:00:52.494Z: JOB_MESSAGE_BASIC: Finished operation Globally/CombineGlobally(CountCombineFn)/CombinePerKey/GroupByKey/Create
INFO:apache_beam.runners.dataflow.dataflow_runner:2020-02-29T00:00:52.543Z: JOB_MESSAGE_DEBUG: Value "assert_that/Group/GroupByKey/Session" materialized.
INFO:apache_beam.runners.dataflow.dataflow_runner:2020-02-29T00:00:52.578Z: JOB_MESSAGE_DEBUG: Value "Globally/CombineGlobally(CountCombineFn)/CombinePerKey/GroupByKey/Session" materialized.
INFO:apache_beam.runners.dataflow.dataflow_runner:2020-02-29T00:00:52.618Z: JOB_MESSAGE_DEBUG: Value "read from datastore/GroupByKey/Session" materialized.
INFO:apache_beam.runners.dataflow.dataflow_runner:2020-02-29T00:00:52.656Z: JOB_MESSAGE_BASIC: Executing operation assert_that/Create/Read+assert_that/Group/pair_with_0+assert_that/Group/GroupByKey/Reify+assert_that/Group/GroupByKey/Write
INFO:apache_beam.runners.dataflow.dataflow_runner:2020-02-29T00:00:52.694Z: JOB_MESSAGE_BASIC: Executing operation read from datastore/UserQuery/Read+read from datastore/SplitQuery+read from datastore/GroupByKey/Reify+read from datastore/GroupByKey/Write
INFO:apache_beam.runners.dataflow.dataflow_runner:2020-02-29T00:01:16.006Z: JOB_MESSAGE_DETAILED: Autoscaling: Raised the number of workers to 1 based on the rate of progress in the currently running step(s).
INFO:apache_beam.runners.dataflow.dataflow_runner:2020-02-29T00:01:16.962Z: JOB_MESSAGE_WARNING: Your project already contains 100 Dataflow-created metric descriptors and Stackdriver will not create new Dataflow custom metrics for this job. Each unique user-defined metric name (independent of the DoFn in which it is defined) produces a new metric descriptor. To delete old / unused metric descriptors see https://developers.google.com/apis-explorer/#p/monitoring/v3/monitoring.projects.metricDescriptors.list and https://developers.google.com/apis-explorer/#p/monitoring/v3/monitoring.projects.metricDescriptors.delete
INFO:apache_beam.runners.dataflow.dataflow_runner:2020-02-29T00:02:16.478Z: JOB_MESSAGE_DETAILED: Workers have started successfully.
INFO:apache_beam.runners.dataflow.dataflow_runner:2020-02-29T00:02:16.512Z: JOB_MESSAGE_DETAILED: Workers have started successfully.
INFO:apache_beam.runners.dataflow.dataflow_runner:2020-02-29T00:05:10.084Z: JOB_MESSAGE_BASIC: Finished operation read from datastore/UserQuery/Read+read from datastore/SplitQuery+read from datastore/GroupByKey/Reify+read from datastore/GroupByKey/Write
INFO:apache_beam.runners.dataflow.dataflow_runner:2020-02-29T00:05:10.158Z: JOB_MESSAGE_BASIC: Executing operation read from datastore/GroupByKey/Close
INFO:apache_beam.runners.dataflow.dataflow_runner:2020-02-29T00:05:10.223Z: JOB_MESSAGE_BASIC: Finished operation read from datastore/GroupByKey/Close
INFO:apache_beam.runners.dataflow.dataflow_runner:2020-02-29T00:05:10.304Z: JOB_MESSAGE_BASIC: Executing operation read from datastore/GroupByKey/Read+read from datastore/GroupByKey/GroupByWindow+read from datastore/Values+read from datastore/Flatten+read from datastore/Read+Globally/CombineGlobally(CountCombineFn)/KeyWithVoid+Globally/CombineGlobally(CountCombineFn)/CombinePerKey/GroupByKey+Globally/CombineGlobally(CountCombineFn)/CombinePerKey/Combine/Partial+Globally/CombineGlobally(CountCombineFn)/CombinePerKey/GroupByKey/Reify+Globally/CombineGlobally(CountCombineFn)/CombinePerKey/GroupByKey/Write
INFO:apache_beam.runners.dataflow.dataflow_runner:2020-02-29T00:05:16.661Z: JOB_MESSAGE_BASIC: Finished operation assert_that/Create/Read+assert_that/Group/pair_with_0+assert_that/Group/GroupByKey/Reify+assert_that/Group/GroupByKey/Write
INFO:apache_beam.runners.dataflow.dataflow_runner:2020-02-29T00:05:23.102Z: JOB_MESSAGE_BASIC: Finished operation read from datastore/GroupByKey/Read+read from datastore/GroupByKey/GroupByWindow+read from datastore/Values+read from datastore/Flatten+read from datastore/Read+Globally/CombineGlobally(CountCombineFn)/KeyWithVoid+Globally/CombineGlobally(CountCombineFn)/CombinePerKey/GroupByKey+Globally/CombineGlobally(CountCombineFn)/CombinePerKey/Combine/Partial+Globally/CombineGlobally(CountCombineFn)/CombinePerKey/GroupByKey/Reify+Globally/CombineGlobally(CountCombineFn)/CombinePerKey/GroupByKey/Write
INFO:apache_beam.runners.dataflow.dataflow_runner:2020-02-29T00:05:23.172Z: JOB_MESSAGE_BASIC: Executing operation Globally/CombineGlobally(CountCombineFn)/CombinePerKey/GroupByKey/Close
INFO:apache_beam.runners.dataflow.dataflow_runner:2020-02-29T00:05:23.231Z: JOB_MESSAGE_BASIC: Finished operation Globally/CombineGlobally(CountCombineFn)/CombinePerKey/GroupByKey/Close
INFO:apache_beam.runners.dataflow.dataflow_runner:2020-02-29T00:05:23.305Z: JOB_MESSAGE_BASIC: Executing operation Globally/CombineGlobally(CountCombineFn)/CombinePerKey/GroupByKey/Read+Globally/CombineGlobally(CountCombineFn)/CombinePerKey/Combine+Globally/CombineGlobally(CountCombineFn)/CombinePerKey/Combine/Extract+Globally/CombineGlobally(CountCombineFn)/UnKey
INFO:apache_beam.runners.dataflow.dataflow_runner:2020-02-29T00:05:28.697Z: JOB_MESSAGE_BASIC: Finished operation Globally/CombineGlobally(CountCombineFn)/CombinePerKey/GroupByKey/Read+Globally/CombineGlobally(CountCombineFn)/CombinePerKey/Combine+Globally/CombineGlobally(CountCombineFn)/CombinePerKey/Combine/Extract+Globally/CombineGlobally(CountCombineFn)/UnKey
INFO:apache_beam.runners.dataflow.dataflow_runner:2020-02-29T00:05:28.772Z: JOB_MESSAGE_DEBUG: Value "Globally/CombineGlobally(CountCombineFn)/UnKey.out" materialized.
INFO:apache_beam.runners.dataflow.dataflow_runner:2020-02-29T00:05:28.858Z: JOB_MESSAGE_BASIC: Executing operation Globally/CombineGlobally(CountCombineFn)/InjectDefault/_UnpickledSideInput(UnKey.out.0)
INFO:apache_beam.runners.dataflow.dataflow_runner:2020-02-29T00:05:28.908Z: JOB_MESSAGE_BASIC: Finished operation Globally/CombineGlobally(CountCombineFn)/InjectDefault/_UnpickledSideInput(UnKey.out.0)
INFO:apache_beam.runners.dataflow.dataflow_runner:2020-02-29T00:05:28.987Z: JOB_MESSAGE_DEBUG: Value "Globally/CombineGlobally(CountCombineFn)/InjectDefault/_UnpickledSideInput(UnKey.out.0).output" materialized.
INFO:apache_beam.runners.dataflow.dataflow_runner:2020-02-29T00:05:29.065Z: JOB_MESSAGE_BASIC: Executing operation Globally/CombineGlobally(CountCombineFn)/DoOnce/Read+Globally/CombineGlobally(CountCombineFn)/InjectDefault/InjectDefault+assert_that/WindowInto(WindowIntoFn)+assert_that/ToVoidKey+assert_that/Group/pair_with_1+assert_that/Group/GroupByKey/Reify+assert_that/Group/GroupByKey/Write
INFO:apache_beam.runners.dataflow.dataflow_runner:2020-02-29T00:05:33.612Z: JOB_MESSAGE_BASIC: Finished operation Globally/CombineGlobally(CountCombineFn)/DoOnce/Read+Globally/CombineGlobally(CountCombineFn)/InjectDefault/InjectDefault+assert_that/WindowInto(WindowIntoFn)+assert_that/ToVoidKey+assert_that/Group/pair_with_1+assert_that/Group/GroupByKey/Reify+assert_that/Group/GroupByKey/Write
INFO:apache_beam.runners.dataflow.dataflow_runner:2020-02-29T00:05:33.705Z: JOB_MESSAGE_BASIC: Executing operation assert_that/Group/GroupByKey/Close
INFO:apache_beam.runners.dataflow.dataflow_runner:2020-02-29T00:05:33.751Z: JOB_MESSAGE_BASIC: Finished operation assert_that/Group/GroupByKey/Close
INFO:apache_beam.runners.dataflow.dataflow_runner:2020-02-29T00:05:33.830Z: JOB_MESSAGE_BASIC: Executing operation assert_that/Group/GroupByKey/Read+assert_that/Group/GroupByKey/GroupByWindow+assert_that/Group/Map(_merge_tagged_vals_under_key)+assert_that/Unkey+assert_that/Match
INFO:apache_beam.runners.dataflow.dataflow_runner:2020-02-29T00:05:43.296Z: JOB_MESSAGE_BASIC: Finished operation assert_that/Group/GroupByKey/Read+assert_that/Group/GroupByKey/GroupByWindow+assert_that/Group/Map(_merge_tagged_vals_under_key)+assert_that/Unkey+assert_that/Match
INFO:apache_beam.runners.dataflow.dataflow_runner:2020-02-29T00:05:43.370Z: JOB_MESSAGE_DEBUG: Executing success step success49
INFO:apache_beam.runners.dataflow.dataflow_runner:2020-02-29T00:05:43.500Z: JOB_MESSAGE_DETAILED: Cleaning up.
INFO:apache_beam.runners.dataflow.dataflow_runner:2020-02-29T00:05:43.557Z: JOB_MESSAGE_DEBUG: Starting worker pool teardown.
INFO:apache_beam.runners.dataflow.dataflow_runner:2020-02-29T00:05:43.597Z: JOB_MESSAGE_BASIC: Stopping worker pool...
INFO:apache_beam.runners.dataflow.dataflow_runner:2020-02-29T00:06:56.846Z: JOB_MESSAGE_DETAILED: Autoscaling: Resized worker pool from 1 to 0.
INFO:apache_beam.runners.dataflow.dataflow_runner:2020-02-29T00:06:56.895Z: JOB_MESSAGE_BASIC: Worker pool stopped.
INFO:apache_beam.runners.dataflow.dataflow_runner:2020-02-29T00:06:56.933Z: JOB_MESSAGE_DEBUG: Tearing down pending resources...
INFO:apache_beam.runners.dataflow.dataflow_runner:Job 2020-02-28_16_00_44-5017014031878956738 is in state JOB_STATE_DONE
test_datastore_write_limit (apache_beam.io.gcp.datastore_write_it_test.DatastoreWriteIT) ... ok
----------------------------------------------------------------------
XML: nosetests-postCommitIT-df.xml
----------------------------------------------------------------------
XML: <https://builds.apache.org/job/beam_PostCommit_Python2/ws/src/sdks/python/nosetests.xml>
----------------------------------------------------------------------
Ran 55 tests in 3594.219s
OK (SKIP=7)
Worker logs: https://console.cloud.google.com/dataflow/jobs/us-central1/2020-02-28_15_08_04-6556504878278686138?project=apache-beam-testing
Worker logs: https://console.cloud.google.com/dataflow/jobs/us-central1/2020-02-28_15_22_02-107133105070836655?project=apache-beam-testing
Worker logs: https://console.cloud.google.com/dataflow/jobs/us-central1/2020-02-28_15_30_25-10819003037240476537?project=apache-beam-testing
Worker logs: https://console.cloud.google.com/dataflow/jobs/us-central1/2020-02-28_15_37_36-10431751232955180455?project=apache-beam-testing
Worker logs: https://console.cloud.google.com/dataflow/jobs/us-central1/2020-02-28_15_43_49-15164654331805721656?project=apache-beam-testing
Worker logs: https://console.cloud.google.com/dataflow/jobs/us-central1/2020-02-28_15_07_58-11766390015282628172?project=apache-beam-testing
Worker logs: https://console.cloud.google.com/dataflow/jobs/us-central1/2020-02-28_15_25_25-7284077234643286628?project=apache-beam-testing
Worker logs: https://console.cloud.google.com/dataflow/jobs/us-central1/2020-02-28_15_32_20-9646843950059698520?project=apache-beam-testing
Worker logs: https://console.cloud.google.com/dataflow/jobs/us-central1/2020-02-28_15_38_45-13062703620961943962?project=apache-beam-testing
Worker logs: https://console.cloud.google.com/dataflow/jobs/us-central1/2020-02-28_15_45_11-8507277849643354506?project=apache-beam-testing
Worker logs: https://console.cloud.google.com/dataflow/jobs/us-central1/2020-02-28_15_07_58-4405789100854304568?project=apache-beam-testing
Worker logs: https://console.cloud.google.com/dataflow/jobs/us-central1/2020-02-28_15_15_03-3950954900486413666?project=apache-beam-testing
Worker logs: https://console.cloud.google.com/dataflow/jobs/us-central1/2020-02-28_15_23_22-10341560156862372004?project=apache-beam-testing
Worker logs: https://console.cloud.google.com/dataflow/jobs/us-central1/2020-02-28_15_30_24-17895174015713311834?project=apache-beam-testing
Worker logs: https://console.cloud.google.com/dataflow/jobs/us-central1/2020-02-28_15_36_39-7979351056731560219?project=apache-beam-testing
Worker logs: https://console.cloud.google.com/dataflow/jobs/us-central1/2020-02-28_15_43_42-3352930411151005094?project=apache-beam-testing
Worker logs: https://console.cloud.google.com/dataflow/jobs/us-central1/2020-02-28_15_07_58-9258297404725843580?project=apache-beam-testing
Worker logs: https://console.cloud.google.com/dataflow/jobs/us-central1/2020-02-28_15_27_12-7474772618289139722?project=apache-beam-testing
Worker logs: https://console.cloud.google.com/dataflow/jobs/us-central1/2020-02-28_15_43_52-18180270212809224482?project=apache-beam-testing
Worker logs: https://console.cloud.google.com/dataflow/jobs/us-central1/2020-02-28_15_50_20-11471722022758087148?project=apache-beam-testing
Worker logs: https://console.cloud.google.com/dataflow/jobs/us-central1/2020-02-28_15_07_59-10358862321276597474?project=apache-beam-testing
Worker logs: https://console.cloud.google.com/dataflow/jobs/us-central1/2020-02-28_15_15_38-2477118015600480872?project=apache-beam-testing
Worker logs: https://console.cloud.google.com/dataflow/jobs/us-central1/2020-02-28_15_23_16-4646226566899169640?project=apache-beam-testing
Worker logs: https://console.cloud.google.com/dataflow/jobs/us-central1/2020-02-28_15_29_42-15609642253489244650?project=apache-beam-testing
Worker logs: https://console.cloud.google.com/dataflow/jobs/us-central1/2020-02-28_15_36_24-4468751265711982657?project=apache-beam-testing
Worker logs: https://console.cloud.google.com/dataflow/jobs/us-central1/2020-02-28_15_43_04-12424377675143147199?project=apache-beam-testing
Worker logs: https://console.cloud.google.com/dataflow/jobs/us-central1/2020-02-28_15_50_14-1215992427901183117?project=apache-beam-testing
Worker logs: https://console.cloud.google.com/dataflow/jobs/us-central1/2020-02-28_15_08_02-15072757217222651562?project=apache-beam-testing
Worker logs: https://console.cloud.google.com/dataflow/jobs/us-central1/2020-02-28_15_19_48-8287631764429085199?project=apache-beam-testing
Worker logs: https://console.cloud.google.com/dataflow/jobs/us-central1/2020-02-28_15_26_28-12370279356118417905?project=apache-beam-testing
Worker logs: https://console.cloud.google.com/dataflow/jobs/us-central1/2020-02-28_15_32_49-4916145009007259974?project=apache-beam-testing
Worker logs: https://console.cloud.google.com/dataflow/jobs/us-central1/2020-02-28_15_39_03-1813120263006039651?project=apache-beam-testing
Worker logs: https://console.cloud.google.com/dataflow/jobs/us-central1/2020-02-28_15_45_47-9815704937507429174?project=apache-beam-testing
Worker logs: https://console.cloud.google.com/dataflow/jobs/us-central1/2020-02-28_15_07_59-9291942905827970969?project=apache-beam-testing
Worker logs: https://console.cloud.google.com/dataflow/jobs/us-central1/2020-02-28_15_16_45-10803328069137649937?project=apache-beam-testing
Worker logs: https://console.cloud.google.com/dataflow/jobs/us-central1/2020-02-28_15_26_28-3342105842660732140?project=apache-beam-testing
Worker logs: https://console.cloud.google.com/dataflow/jobs/us-central1/2020-02-28_15_33_38-6094245896686760209?project=apache-beam-testing
Worker logs: https://console.cloud.google.com/dataflow/jobs/us-central1/2020-02-28_15_40_05-2254152336908763141?project=apache-beam-testing
Worker logs: https://console.cloud.google.com/dataflow/jobs/us-central1/2020-02-28_15_46_57-17768472681883944158?project=apache-beam-testing
Worker logs: https://console.cloud.google.com/dataflow/jobs/us-central1/2020-02-28_15_53_50-15162977642457255622?project=apache-beam-testing
Worker logs: https://console.cloud.google.com/dataflow/jobs/us-central1/2020-02-28_16_00_44-5017014031878956738?project=apache-beam-testing
Worker logs: https://console.cloud.google.com/dataflow/jobs/us-central1/2020-02-28_15_07_59-3192250593908200864?project=apache-beam-testing
Worker logs: https://console.cloud.google.com/dataflow/jobs/us-central1/2020-02-28_15_15_43-15901778576189056084?project=apache-beam-testing
Worker logs: https://console.cloud.google.com/dataflow/jobs/us-central1/2020-02-28_15_23_02-2128922591335587564?project=apache-beam-testing
Worker logs: https://console.cloud.google.com/dataflow/jobs/us-central1/2020-02-28_15_29_40-6393745603432180152?project=apache-beam-testing
Worker logs: https://console.cloud.google.com/dataflow/jobs/us-central1/2020-02-28_15_36_49-12975927746241352505?project=apache-beam-testing
Worker logs: https://console.cloud.google.com/dataflow/jobs/us-central1/2020-02-28_15_44_16-6105216793651784167?project=apache-beam-testing
FAILURE: Build failed with an exception.
* Where:
Build file '<https://builds.apache.org/job/beam_PostCommit_Python2/ws/src/sdks/python/test-suites/portable/py2/build.gradle'> line: 143
* What went wrong:
Execution failed for task ':sdks:python:test-suites:portable:py2:crossLanguagePortableWordCount'.
> Process 'command 'sh'' finished with non-zero exit value 1
* Try:
Run with --stacktrace option to get the stack trace. Run with --info or --debug option to get more log output. Run with --scan to get full insights.
* Get more help at https://help.gradle.org
Deprecated Gradle features were used in this build, making it incompatible with Gradle 6.0.
Use '--warning-mode all' to show the individual deprecation warnings.
See https://docs.gradle.org/5.2.1/userguide/command_line_interface.html#sec:command_line_warnings
BUILD FAILED in 1h 2m 57s
124 actionable tasks: 99 executed, 22 from cache, 3 up-to-date
Publishing build scan...
https://gradle.com/s/hzaja57d6v23s
Build step 'Invoke Gradle script' changed build result to FAILURE
Build step 'Invoke Gradle script' marked build as failure
---------------------------------------------------------------------
To unsubscribe, e-mail: builds-unsubscribe@beam.apache.org
For additional commands, e-mail: builds-help@beam.apache.org
Build failed in Jenkins: beam_PostCommit_Python2 #1843
Posted by Apache Jenkins Server <je...@builds.apache.org>.
See <https://builds.apache.org/job/beam_PostCommit_Python2/1843/display/redirect?page=changes>
Changes:
[jkai] [BEAM-8331] rewrite the calcite JDBC urls
------------------------------------------
[...truncated 10.41 MB...]
{
"encoding": {
"@type": "kind:windowed_value",
"component_encodings": [
{
"@type": "FastPrimitivesCoder$eNprYEpOLEhMzkiNT0pNzNVLzk9JLSqGUlxuicUlAUWZuZklmWWpxc4gQa5CBs3GQsbaQqZQ/vi0xJycpMTk7Hiw+kJmPEYFZCZn56RCjWABGsFaW8iWVJykBwDlGS3/",
"component_encodings": [
{
"@type": "FastPrimitivesCoder$eNprYEpOLEhMzkiNT0pNzNVLzk9JLSqGUlxuicUlAUWZuZklmWWpxc4gQa5CBs3GQsbaQqZQ/vi0xJycpMTk7Hiw+kJmPEYFZCZn56RCjWABGsFaW8iWVJykBwDlGS3/",
"component_encodings": [],
"pipeline_proto_coder_id": "ref_Coder_FastPrimitivesCoder_5"
},
{
"@type": "FastPrimitivesCoder$eNprYEpOLEhMzkiNT0pNzNVLzk9JLSqGUlxuicUlAUWZuZklmWWpxc4gQa5CBs3GQsbaQqZQ/vi0xJycpMTk7Hiw+kJmPEYFZCZn56RCjWABGsFaW8iWVJykBwDlGS3/",
"component_encodings": [],
"pipeline_proto_coder_id": "ref_Coder_FastPrimitivesCoder_5"
}
],
"is_pair_like": true,
"pipeline_proto_coder_id": "ref_Coder_FastPrimitivesCoder_5"
},
{
"@type": "kind:global_window"
}
],
"is_wrapper": true
},
"output_name": "None",
"user_name": "assert_that/Unkey.out"
}
],
"parallel_input": {
"@type": "OutputReference",
"output_name": "None",
"step_name": "s21"
},
"serialized_fn": "<string of 1056 bytes>",
"user_name": "assert_that/Unkey"
}
},
{
"kind": "ParallelDo",
"name": "s23",
"properties": {
"display_data": [
{
"key": "fn",
"label": "Transform Function",
"namespace": "apache_beam.transforms.core.CallableWrapperDoFn",
"type": "STRING",
"value": "_equal"
},
{
"key": "fn",
"label": "Transform Function",
"namespace": "apache_beam.transforms.core.ParDo",
"shortValue": "CallableWrapperDoFn",
"type": "STRING",
"value": "apache_beam.transforms.core.CallableWrapperDoFn"
}
],
"non_parallel_inputs": {},
"output_info": [
{
"encoding": {
"@type": "kind:windowed_value",
"component_encodings": [
{
"@type": "FastPrimitivesCoder$eNprYEpOLEhMzkiNT0pNzNVLzk9JLSqGUlxuicUlAUWZuZklmWWpxc4gQa5CBs3GQsbaQqZQ/vi0xJycpMTk7Hiw+kJmPEYFZCZn56RCjWABGsFaW8iWVJykBwDlGS3/",
"component_encodings": [
{
"@type": "FastPrimitivesCoder$eNprYEpOLEhMzkiNT0pNzNVLzk9JLSqGUlxuicUlAUWZuZklmWWpxc4gQa5CBs3GQsbaQqZQ/vi0xJycpMTk7Hiw+kJmPEYFZCZn56RCjWABGsFaW8iWVJykBwDlGS3/",
"component_encodings": [],
"pipeline_proto_coder_id": "ref_Coder_FastPrimitivesCoder_5"
},
{
"@type": "FastPrimitivesCoder$eNprYEpOLEhMzkiNT0pNzNVLzk9JLSqGUlxuicUlAUWZuZklmWWpxc4gQa5CBs3GQsbaQqZQ/vi0xJycpMTk7Hiw+kJmPEYFZCZn56RCjWABGsFaW8iWVJykBwDlGS3/",
"component_encodings": [],
"pipeline_proto_coder_id": "ref_Coder_FastPrimitivesCoder_5"
}
],
"is_pair_like": true,
"pipeline_proto_coder_id": "ref_Coder_FastPrimitivesCoder_5"
},
{
"@type": "kind:global_window"
}
],
"is_wrapper": true
},
"output_name": "None",
"user_name": "assert_that/Match.out"
}
],
"parallel_input": {
"@type": "OutputReference",
"output_name": "None",
"step_name": "s22"
},
"serialized_fn": "<string of 1736 bytes>",
"user_name": "assert_that/Match"
}
}
],
"type": "JOB_TYPE_BATCH"
}
INFO:apache_beam.runners.dataflow.internal.apiclient:Create job: <Job
createTime: u'2020-02-28T22:54:48.263061Z'
currentStateTime: u'1970-01-01T00:00:00Z'
id: u'2020-02-28_14_54_46-15565136122227894258'
location: u'us-central1'
name: u'beamapp-jenkins-0228222836-663167'
projectId: u'apache-beam-testing'
stageStates: []
startTime: u'2020-02-28T22:54:48.263061Z'
steps: []
tempFiles: []
type: TypeValueValuesEnum(JOB_TYPE_BATCH, 1)>
INFO:apache_beam.runners.dataflow.internal.apiclient:Created job with id: [2020-02-28_14_54_46-15565136122227894258]
INFO:apache_beam.runners.dataflow.internal.apiclient:To access the Dataflow monitoring console, please navigate to https://console.cloud.google.com/dataflow/jobs/us-central1/2020-02-28_14_54_46-15565136122227894258?project=apache-beam-testing
INFO:apache_beam.runners.dataflow.dataflow_runner:Job 2020-02-28_14_54_46-15565136122227894258 is in state JOB_STATE_RUNNING
INFO:apache_beam.runners.dataflow.dataflow_runner:2020-02-28T22:54:46.695Z: JOB_MESSAGE_DETAILED: Autoscaling was automatically enabled for job 2020-02-28_14_54_46-15565136122227894258.
INFO:apache_beam.runners.dataflow.dataflow_runner:2020-02-28T22:54:46.695Z: JOB_MESSAGE_DETAILED: Autoscaling is enabled for job 2020-02-28_14_54_46-15565136122227894258. The number of workers will be between 1 and 1000.
INFO:apache_beam.runners.dataflow.dataflow_runner:2020-02-28T22:54:50.262Z: JOB_MESSAGE_DETAILED: Checking permissions granted to controller Service Account.
INFO:apache_beam.runners.dataflow.dataflow_runner:2020-02-28T22:54:51.091Z: JOB_MESSAGE_BASIC: Worker configuration: n1-standard-1 in us-central1-c.
INFO:apache_beam.runners.dataflow.dataflow_runner:2020-02-28T22:54:51.588Z: JOB_MESSAGE_DETAILED: Expanding CoGroupByKey operations into optimizable parts.
INFO:apache_beam.runners.dataflow.dataflow_runner:2020-02-28T22:54:51.631Z: JOB_MESSAGE_DEBUG: Combiner lifting skipped for step assert_that/Group/GroupByKey: GroupByKey not followed by a combiner.
INFO:apache_beam.runners.dataflow.dataflow_runner:2020-02-28T22:54:51.707Z: JOB_MESSAGE_DEBUG: Combiner lifting skipped for step read from datastore/GroupByKey: GroupByKey not followed by a combiner.
INFO:apache_beam.runners.dataflow.dataflow_runner:2020-02-28T22:54:51.754Z: JOB_MESSAGE_DETAILED: Expanding GroupByKey operations into optimizable parts.
INFO:apache_beam.runners.dataflow.dataflow_runner:2020-02-28T22:54:51.787Z: JOB_MESSAGE_DETAILED: Lifting ValueCombiningMappingFns into MergeBucketsMappingFns
INFO:apache_beam.runners.dataflow.dataflow_runner:2020-02-28T22:54:51.918Z: JOB_MESSAGE_DEBUG: Annotating graph with Autotuner information.
INFO:apache_beam.runners.dataflow.dataflow_runner:2020-02-28T22:54:51.978Z: JOB_MESSAGE_DETAILED: Fusing adjacent ParDo, Read, Write, and Flatten operations
INFO:apache_beam.runners.dataflow.dataflow_runner:2020-02-28T22:54:52.024Z: JOB_MESSAGE_DETAILED: Fusing consumer read from datastore/SplitQuery into read from datastore/UserQuery/Read
INFO:apache_beam.runners.dataflow.dataflow_runner:2020-02-28T22:54:52.059Z: JOB_MESSAGE_DETAILED: Fusing consumer read from datastore/GroupByKey/Reify into read from datastore/SplitQuery
INFO:apache_beam.runners.dataflow.dataflow_runner:2020-02-28T22:54:52.105Z: JOB_MESSAGE_DETAILED: Fusing consumer read from datastore/GroupByKey/Write into read from datastore/GroupByKey/Reify
INFO:apache_beam.runners.dataflow.dataflow_runner:2020-02-28T22:54:52.140Z: JOB_MESSAGE_DETAILED: Fusing consumer read from datastore/GroupByKey/GroupByWindow into read from datastore/GroupByKey/Read
INFO:apache_beam.runners.dataflow.dataflow_runner:2020-02-28T22:54:52.171Z: JOB_MESSAGE_DETAILED: Fusing consumer read from datastore/Values into read from datastore/GroupByKey/GroupByWindow
INFO:apache_beam.runners.dataflow.dataflow_runner:2020-02-28T22:54:52.211Z: JOB_MESSAGE_DETAILED: Fusing consumer read from datastore/Flatten into read from datastore/Values
INFO:apache_beam.runners.dataflow.dataflow_runner:2020-02-28T22:54:52.238Z: JOB_MESSAGE_DETAILED: Fusing consumer read from datastore/Read into read from datastore/Flatten
INFO:apache_beam.runners.dataflow.dataflow_runner:2020-02-28T22:54:52.273Z: JOB_MESSAGE_DETAILED: Fusing consumer Globally/CombineGlobally(CountCombineFn)/KeyWithVoid into read from datastore/Read
INFO:apache_beam.runners.dataflow.dataflow_runner:2020-02-28T22:54:52.304Z: JOB_MESSAGE_DETAILED: Fusing consumer Globally/CombineGlobally(CountCombineFn)/CombinePerKey/GroupByKey+Globally/CombineGlobally(CountCombineFn)/CombinePerKey/Combine/Partial into Globally/CombineGlobally(CountCombineFn)/KeyWithVoid
INFO:apache_beam.runners.dataflow.dataflow_runner:2020-02-28T22:54:52.331Z: JOB_MESSAGE_DETAILED: Fusing consumer Globally/CombineGlobally(CountCombineFn)/CombinePerKey/GroupByKey/Reify into Globally/CombineGlobally(CountCombineFn)/CombinePerKey/GroupByKey+Globally/CombineGlobally(CountCombineFn)/CombinePerKey/Combine/Partial
INFO:apache_beam.runners.dataflow.dataflow_runner:2020-02-28T22:54:52.363Z: JOB_MESSAGE_DETAILED: Fusing consumer Globally/CombineGlobally(CountCombineFn)/CombinePerKey/GroupByKey/Write into Globally/CombineGlobally(CountCombineFn)/CombinePerKey/GroupByKey/Reify
INFO:apache_beam.runners.dataflow.dataflow_runner:2020-02-28T22:54:52.388Z: JOB_MESSAGE_DETAILED: Fusing consumer Globally/CombineGlobally(CountCombineFn)/CombinePerKey/Combine into Globally/CombineGlobally(CountCombineFn)/CombinePerKey/GroupByKey/Read
INFO:apache_beam.runners.dataflow.dataflow_runner:2020-02-28T22:54:52.423Z: JOB_MESSAGE_DETAILED: Fusing consumer Globally/CombineGlobally(CountCombineFn)/CombinePerKey/Combine/Extract into Globally/CombineGlobally(CountCombineFn)/CombinePerKey/Combine
INFO:apache_beam.runners.dataflow.dataflow_runner:2020-02-28T22:54:52.460Z: JOB_MESSAGE_DETAILED: Fusing consumer Globally/CombineGlobally(CountCombineFn)/UnKey into Globally/CombineGlobally(CountCombineFn)/CombinePerKey/Combine/Extract
INFO:apache_beam.runners.dataflow.dataflow_runner:2020-02-28T22:54:52.494Z: JOB_MESSAGE_DETAILED: Unzipping flatten s19 for input s17.None
INFO:apache_beam.runners.dataflow.dataflow_runner:2020-02-28T22:54:52.525Z: JOB_MESSAGE_DETAILED: Fusing unzipped copy of assert_that/Group/GroupByKey/Reify, through flatten assert_that/Group/Flatten, into producer assert_that/Group/pair_with_0
INFO:apache_beam.runners.dataflow.dataflow_runner:2020-02-28T22:54:52.564Z: JOB_MESSAGE_DETAILED: Fusing consumer assert_that/Group/GroupByKey/GroupByWindow into assert_that/Group/GroupByKey/Read
INFO:apache_beam.runners.dataflow.dataflow_runner:2020-02-28T22:54:52.604Z: JOB_MESSAGE_DETAILED: Fusing consumer assert_that/Group/Map(_merge_tagged_vals_under_key) into assert_that/Group/GroupByKey/GroupByWindow
INFO:apache_beam.runners.dataflow.dataflow_runner:2020-02-28T22:54:52.630Z: JOB_MESSAGE_DETAILED: Fusing consumer assert_that/Unkey into assert_that/Group/Map(_merge_tagged_vals_under_key)
INFO:apache_beam.runners.dataflow.dataflow_runner:2020-02-28T22:54:52.654Z: JOB_MESSAGE_DETAILED: Fusing consumer assert_that/Match into assert_that/Unkey
INFO:apache_beam.runners.dataflow.dataflow_runner:2020-02-28T22:54:52.689Z: JOB_MESSAGE_DETAILED: Unzipping flatten s19-u40 for input s20-reify-value9-c38
INFO:apache_beam.runners.dataflow.dataflow_runner:2020-02-28T22:54:52.722Z: JOB_MESSAGE_DETAILED: Fusing unzipped copy of assert_that/Group/GroupByKey/Write, through flatten assert_that/Group/Flatten/Unzipped-1, into producer assert_that/Group/GroupByKey/Reify
INFO:apache_beam.runners.dataflow.dataflow_runner:2020-02-28T22:54:52.744Z: JOB_MESSAGE_DETAILED: Fusing consumer assert_that/Group/pair_with_0 into assert_that/Create/Read
INFO:apache_beam.runners.dataflow.dataflow_runner:2020-02-28T22:54:52.784Z: JOB_MESSAGE_DETAILED: Fusing consumer assert_that/Group/GroupByKey/Reify into assert_that/Group/pair_with_1
INFO:apache_beam.runners.dataflow.dataflow_runner:2020-02-28T22:54:52.820Z: JOB_MESSAGE_DETAILED: Fusing consumer assert_that/Group/GroupByKey/Write into assert_that/Group/GroupByKey/Reify
INFO:apache_beam.runners.dataflow.dataflow_runner:2020-02-28T22:54:52.859Z: JOB_MESSAGE_DETAILED: Fusing consumer Globally/CombineGlobally(CountCombineFn)/InjectDefault/InjectDefault into Globally/CombineGlobally(CountCombineFn)/DoOnce/Read
INFO:apache_beam.runners.dataflow.dataflow_runner:2020-02-28T22:54:52.897Z: JOB_MESSAGE_DETAILED: Fusing consumer assert_that/WindowInto(WindowIntoFn) into Globally/CombineGlobally(CountCombineFn)/InjectDefault/InjectDefault
INFO:apache_beam.runners.dataflow.dataflow_runner:2020-02-28T22:54:52.929Z: JOB_MESSAGE_DETAILED: Fusing consumer assert_that/ToVoidKey into assert_that/WindowInto(WindowIntoFn)
INFO:apache_beam.runners.dataflow.dataflow_runner:2020-02-28T22:54:52.956Z: JOB_MESSAGE_DETAILED: Fusing consumer assert_that/Group/pair_with_1 into assert_that/ToVoidKey
INFO:apache_beam.runners.dataflow.dataflow_runner:2020-02-28T22:54:52.997Z: JOB_MESSAGE_DEBUG: Workflow config is missing a default resource spec.
INFO:apache_beam.runners.dataflow.dataflow_runner:2020-02-28T22:54:53.031Z: JOB_MESSAGE_DEBUG: Adding StepResource setup and teardown to workflow graph.
INFO:apache_beam.runners.dataflow.dataflow_runner:2020-02-28T22:54:53.069Z: JOB_MESSAGE_DEBUG: Adding workflow start and stop steps.
INFO:apache_beam.runners.dataflow.dataflow_runner:2020-02-28T22:54:53.109Z: JOB_MESSAGE_DEBUG: Assigning stage ids.
INFO:apache_beam.runners.dataflow.dataflow_runner:2020-02-28T22:54:53.300Z: JOB_MESSAGE_DEBUG: Executing wait step start51
INFO:apache_beam.runners.dataflow.dataflow_runner:2020-02-28T22:54:53.370Z: JOB_MESSAGE_BASIC: Executing operation assert_that/Group/GroupByKey/Create
INFO:apache_beam.runners.dataflow.dataflow_runner:2020-02-28T22:54:53.406Z: JOB_MESSAGE_DEBUG: Starting worker pool setup.
INFO:apache_beam.runners.dataflow.dataflow_runner:2020-02-28T22:54:53.406Z: JOB_MESSAGE_BASIC: Executing operation read from datastore/GroupByKey/Create
INFO:apache_beam.runners.dataflow.dataflow_runner:2020-02-28T22:54:53.440Z: JOB_MESSAGE_BASIC: Executing operation Globally/CombineGlobally(CountCombineFn)/CombinePerKey/GroupByKey/Create
INFO:apache_beam.runners.dataflow.dataflow_runner:2020-02-28T22:54:53.440Z: JOB_MESSAGE_BASIC: Starting 1 workers in us-central1-c...
INFO:apache_beam.runners.dataflow.dataflow_runner:2020-02-28T22:54:53.547Z: JOB_MESSAGE_BASIC: Finished operation assert_that/Group/GroupByKey/Create
INFO:apache_beam.runners.dataflow.dataflow_runner:2020-02-28T22:54:53.576Z: JOB_MESSAGE_BASIC: Finished operation read from datastore/GroupByKey/Create
INFO:apache_beam.runners.dataflow.dataflow_runner:2020-02-28T22:54:53.583Z: JOB_MESSAGE_BASIC: Finished operation Globally/CombineGlobally(CountCombineFn)/CombinePerKey/GroupByKey/Create
INFO:apache_beam.runners.dataflow.dataflow_runner:2020-02-28T22:54:53.660Z: JOB_MESSAGE_DEBUG: Value "assert_that/Group/GroupByKey/Session" materialized.
INFO:apache_beam.runners.dataflow.dataflow_runner:2020-02-28T22:54:53.696Z: JOB_MESSAGE_DEBUG: Value "read from datastore/GroupByKey/Session" materialized.
INFO:apache_beam.runners.dataflow.dataflow_runner:2020-02-28T22:54:53.716Z: JOB_MESSAGE_DEBUG: Value "Globally/CombineGlobally(CountCombineFn)/CombinePerKey/GroupByKey/Session" materialized.
INFO:apache_beam.runners.dataflow.dataflow_runner:2020-02-28T22:54:53.746Z: JOB_MESSAGE_BASIC: Executing operation assert_that/Create/Read+assert_that/Group/pair_with_0+assert_that/Group/GroupByKey/Reify+assert_that/Group/GroupByKey/Write
INFO:apache_beam.runners.dataflow.dataflow_runner:2020-02-28T22:54:53.767Z: JOB_MESSAGE_BASIC: Executing operation read from datastore/UserQuery/Read+read from datastore/SplitQuery+read from datastore/GroupByKey/Reify+read from datastore/GroupByKey/Write
INFO:apache_beam.runners.dataflow.dataflow_runner:2020-02-28T22:55:16.360Z: JOB_MESSAGE_WARNING: Your project already contains 100 Dataflow-created metric descriptors and Stackdriver will not create new Dataflow custom metrics for this job. Each unique user-defined metric name (independent of the DoFn in which it is defined) produces a new metric descriptor. To delete old / unused metric descriptors see https://developers.google.com/apis-explorer/#p/monitoring/v3/monitoring.projects.metricDescriptors.list and https://developers.google.com/apis-explorer/#p/monitoring/v3/monitoring.projects.metricDescriptors.delete
INFO:apache_beam.runners.dataflow.dataflow_runner:2020-02-28T22:55:20.144Z: JOB_MESSAGE_DETAILED: Autoscaling: Raised the number of workers to 1 based on the rate of progress in the currently running step(s).
INFO:oauth2client.transport:Refreshing due to a 401 (attempt 1/2)
INFO:apache_beam.runners.dataflow.dataflow_runner:2020-02-28T22:56:31.371Z: JOB_MESSAGE_DETAILED: Workers have started successfully.
INFO:apache_beam.runners.dataflow.dataflow_runner:2020-02-28T22:56:31.410Z: JOB_MESSAGE_DETAILED: Workers have started successfully.
INFO:apache_beam.runners.dataflow.dataflow_runner:2020-02-28T22:59:39.863Z: JOB_MESSAGE_BASIC: Finished operation read from datastore/UserQuery/Read+read from datastore/SplitQuery+read from datastore/GroupByKey/Reify+read from datastore/GroupByKey/Write
INFO:apache_beam.runners.dataflow.dataflow_runner:2020-02-28T22:59:39.921Z: JOB_MESSAGE_BASIC: Executing operation read from datastore/GroupByKey/Close
INFO:apache_beam.runners.dataflow.dataflow_runner:2020-02-28T22:59:40.079Z: JOB_MESSAGE_BASIC: Finished operation read from datastore/GroupByKey/Close
INFO:apache_beam.runners.dataflow.dataflow_runner:2020-02-28T22:59:40.138Z: JOB_MESSAGE_BASIC: Executing operation read from datastore/GroupByKey/Read+read from datastore/GroupByKey/GroupByWindow+read from datastore/Values+read from datastore/Flatten+read from datastore/Read+Globally/CombineGlobally(CountCombineFn)/KeyWithVoid+Globally/CombineGlobally(CountCombineFn)/CombinePerKey/GroupByKey+Globally/CombineGlobally(CountCombineFn)/CombinePerKey/Combine/Partial+Globally/CombineGlobally(CountCombineFn)/CombinePerKey/GroupByKey/Reify+Globally/CombineGlobally(CountCombineFn)/CombinePerKey/GroupByKey/Write
INFO:apache_beam.runners.dataflow.dataflow_runner:2020-02-28T22:59:43.029Z: JOB_MESSAGE_BASIC: Finished operation assert_that/Create/Read+assert_that/Group/pair_with_0+assert_that/Group/GroupByKey/Reify+assert_that/Group/GroupByKey/Write
INFO:apache_beam.runners.dataflow.dataflow_runner:2020-02-28T22:59:52.906Z: JOB_MESSAGE_BASIC: Finished operation read from datastore/GroupByKey/Read+read from datastore/GroupByKey/GroupByWindow+read from datastore/Values+read from datastore/Flatten+read from datastore/Read+Globally/CombineGlobally(CountCombineFn)/KeyWithVoid+Globally/CombineGlobally(CountCombineFn)/CombinePerKey/GroupByKey+Globally/CombineGlobally(CountCombineFn)/CombinePerKey/Combine/Partial+Globally/CombineGlobally(CountCombineFn)/CombinePerKey/GroupByKey/Reify+Globally/CombineGlobally(CountCombineFn)/CombinePerKey/GroupByKey/Write
INFO:apache_beam.runners.dataflow.dataflow_runner:2020-02-28T22:59:52.966Z: JOB_MESSAGE_BASIC: Executing operation Globally/CombineGlobally(CountCombineFn)/CombinePerKey/GroupByKey/Close
INFO:apache_beam.runners.dataflow.dataflow_runner:2020-02-28T22:59:53.012Z: JOB_MESSAGE_BASIC: Finished operation Globally/CombineGlobally(CountCombineFn)/CombinePerKey/GroupByKey/Close
INFO:apache_beam.runners.dataflow.dataflow_runner:2020-02-28T22:59:53.068Z: JOB_MESSAGE_BASIC: Executing operation Globally/CombineGlobally(CountCombineFn)/CombinePerKey/GroupByKey/Read+Globally/CombineGlobally(CountCombineFn)/CombinePerKey/Combine+Globally/CombineGlobally(CountCombineFn)/CombinePerKey/Combine/Extract+Globally/CombineGlobally(CountCombineFn)/UnKey
INFO:apache_beam.runners.dataflow.dataflow_runner:2020-02-28T22:59:58.782Z: JOB_MESSAGE_BASIC: Finished operation Globally/CombineGlobally(CountCombineFn)/CombinePerKey/GroupByKey/Read+Globally/CombineGlobally(CountCombineFn)/CombinePerKey/Combine+Globally/CombineGlobally(CountCombineFn)/CombinePerKey/Combine/Extract+Globally/CombineGlobally(CountCombineFn)/UnKey
INFO:apache_beam.runners.dataflow.dataflow_runner:2020-02-28T22:59:58.836Z: JOB_MESSAGE_DEBUG: Value "Globally/CombineGlobally(CountCombineFn)/UnKey.out" materialized.
INFO:apache_beam.runners.dataflow.dataflow_runner:2020-02-28T22:59:58.889Z: JOB_MESSAGE_BASIC: Executing operation Globally/CombineGlobally(CountCombineFn)/InjectDefault/_UnpickledSideInput(UnKey.out.0)
INFO:apache_beam.runners.dataflow.dataflow_runner:2020-02-28T22:59:58.930Z: JOB_MESSAGE_BASIC: Finished operation Globally/CombineGlobally(CountCombineFn)/InjectDefault/_UnpickledSideInput(UnKey.out.0)
INFO:apache_beam.runners.dataflow.dataflow_runner:2020-02-28T22:59:58.990Z: JOB_MESSAGE_DEBUG: Value "Globally/CombineGlobally(CountCombineFn)/InjectDefault/_UnpickledSideInput(UnKey.out.0).output" materialized.
INFO:apache_beam.runners.dataflow.dataflow_runner:2020-02-28T22:59:59.052Z: JOB_MESSAGE_BASIC: Executing operation Globally/CombineGlobally(CountCombineFn)/DoOnce/Read+Globally/CombineGlobally(CountCombineFn)/InjectDefault/InjectDefault+assert_that/WindowInto(WindowIntoFn)+assert_that/ToVoidKey+assert_that/Group/pair_with_1+assert_that/Group/GroupByKey/Reify+assert_that/Group/GroupByKey/Write
INFO:apache_beam.runners.dataflow.dataflow_runner:2020-02-28T23:00:03.849Z: JOB_MESSAGE_BASIC: Finished operation Globally/CombineGlobally(CountCombineFn)/DoOnce/Read+Globally/CombineGlobally(CountCombineFn)/InjectDefault/InjectDefault+assert_that/WindowInto(WindowIntoFn)+assert_that/ToVoidKey+assert_that/Group/pair_with_1+assert_that/Group/GroupByKey/Reify+assert_that/Group/GroupByKey/Write
INFO:apache_beam.runners.dataflow.dataflow_runner:2020-02-28T23:00:03.904Z: JOB_MESSAGE_BASIC: Executing operation assert_that/Group/GroupByKey/Close
INFO:apache_beam.runners.dataflow.dataflow_runner:2020-02-28T23:00:03.951Z: JOB_MESSAGE_BASIC: Finished operation assert_that/Group/GroupByKey/Close
INFO:apache_beam.runners.dataflow.dataflow_runner:2020-02-28T23:00:04.006Z: JOB_MESSAGE_BASIC: Executing operation assert_that/Group/GroupByKey/Read+assert_that/Group/GroupByKey/GroupByWindow+assert_that/Group/Map(_merge_tagged_vals_under_key)+assert_that/Unkey+assert_that/Match
INFO:apache_beam.runners.dataflow.dataflow_runner:2020-02-28T23:00:13.406Z: JOB_MESSAGE_BASIC: Finished operation assert_that/Group/GroupByKey/Read+assert_that/Group/GroupByKey/GroupByWindow+assert_that/Group/Map(_merge_tagged_vals_under_key)+assert_that/Unkey+assert_that/Match
INFO:apache_beam.runners.dataflow.dataflow_runner:2020-02-28T23:00:13.491Z: JOB_MESSAGE_DEBUG: Executing success step success49
INFO:apache_beam.runners.dataflow.dataflow_runner:2020-02-28T23:00:13.618Z: JOB_MESSAGE_DETAILED: Cleaning up.
INFO:apache_beam.runners.dataflow.dataflow_runner:2020-02-28T23:00:13.659Z: JOB_MESSAGE_DEBUG: Starting worker pool teardown.
INFO:apache_beam.runners.dataflow.dataflow_runner:2020-02-28T23:00:13.686Z: JOB_MESSAGE_BASIC: Stopping worker pool...
INFO:apache_beam.runners.dataflow.dataflow_runner:2020-02-28T23:01:22.546Z: JOB_MESSAGE_DETAILED: Autoscaling: Resized worker pool from 1 to 0.
INFO:apache_beam.runners.dataflow.dataflow_runner:2020-02-28T23:01:22.587Z: JOB_MESSAGE_BASIC: Worker pool stopped.
INFO:apache_beam.runners.dataflow.dataflow_runner:2020-02-28T23:01:22.624Z: JOB_MESSAGE_DEBUG: Tearing down pending resources...
INFO:apache_beam.runners.dataflow.dataflow_runner:Job 2020-02-28_14_54_46-15565136122227894258 is in state JOB_STATE_DONE
test_datastore_write_limit (apache_beam.io.gcp.datastore_write_it_test.DatastoreWriteIT) ... ok
----------------------------------------------------------------------
XML: nosetests-postCommitIT-df.xml
----------------------------------------------------------------------
XML: <https://builds.apache.org/job/beam_PostCommit_Python2/ws/src/sdks/python/nosetests.xml>
----------------------------------------------------------------------
Ran 55 tests in 3473.859s
OK (SKIP=7)
FAILURE: Build failed with an exception.
* Where:
Build file '<https://builds.apache.org/job/beam_PostCommit_Python2/ws/src/sdks/python/test-suites/portable/py2/build.gradle'> line: 143
* What went wrong:
Execution failed for task ':sdks:python:test-suites:portable:py2:crossLanguagePortableWordCount'.
> Process 'command 'sh'' finished with non-zero exit value 1
* Try:
Run with --stacktrace option to get the stack trace. Run with --info or --debug option to get more log output. Run with --scan to get full insights.
* Get more help at https://help.gradle.org
Deprecated Gradle features were used in this build, making it incompatible with Gradle 6.0.
Use '--warning-mode all' to show the individual deprecation warnings.
See https://docs.gradle.org/5.2.1/userguide/command_line_interface.html#sec:command_line_warnings
BUILD FAILED in 59m 8s
124 actionable tasks: 98 executed, 23 from cache, 3 up-to-date
Publishing build scan...
https://gradle.com/s/mlfaphnyldfcm
Build step 'Invoke Gradle script' changed build result to FAILURE
Build step 'Invoke Gradle script' marked build as failure
---------------------------------------------------------------------
To unsubscribe, e-mail: builds-unsubscribe@beam.apache.org
For additional commands, e-mail: builds-help@beam.apache.org
Build failed in Jenkins: beam_PostCommit_Python2 #1842
Posted by Apache Jenkins Server <je...@builds.apache.org>.
See <https://builds.apache.org/job/beam_PostCommit_Python2/1842/display/redirect?page=changes>
Changes:
[kcweaver] [BEAM-9401] bind Flink MiniCluster to localhost
------------------------------------------
[...truncated 10.45 MB...]
"label": "Transform Function",
"namespace": "apache_beam.transforms.core.CallableWrapperDoFn",
"type": "STRING",
"value": "_equal"
},
{
"key": "fn",
"label": "Transform Function",
"namespace": "apache_beam.transforms.core.ParDo",
"shortValue": "CallableWrapperDoFn",
"type": "STRING",
"value": "apache_beam.transforms.core.CallableWrapperDoFn"
}
],
"non_parallel_inputs": {},
"output_info": [
{
"encoding": {
"@type": "kind:windowed_value",
"component_encodings": [
{
"@type": "FastPrimitivesCoder$eNprYEpOLEhMzkiNT0pNzNVLzk9JLSqGUlxuicUlAUWZuZklmWWpxc4gQa5CBs3GQsbaQqZQ/vi0xJycpMTk7Hiw+kJmPEYFZCZn56RCjWABGsFaW8iWVJykBwDlGS3/",
"component_encodings": [
{
"@type": "FastPrimitivesCoder$eNprYEpOLEhMzkiNT0pNzNVLzk9JLSqGUlxuicUlAUWZuZklmWWpxc4gQa5CBs3GQsbaQqZQ/vi0xJycpMTk7Hiw+kJmPEYFZCZn56RCjWABGsFaW8iWVJykBwDlGS3/",
"component_encodings": [],
"pipeline_proto_coder_id": "ref_Coder_FastPrimitivesCoder_5"
},
{
"@type": "FastPrimitivesCoder$eNprYEpOLEhMzkiNT0pNzNVLzk9JLSqGUlxuicUlAUWZuZklmWWpxc4gQa5CBs3GQsbaQqZQ/vi0xJycpMTk7Hiw+kJmPEYFZCZn56RCjWABGsFaW8iWVJykBwDlGS3/",
"component_encodings": [],
"pipeline_proto_coder_id": "ref_Coder_FastPrimitivesCoder_5"
}
],
"is_pair_like": true,
"pipeline_proto_coder_id": "ref_Coder_FastPrimitivesCoder_5"
},
{
"@type": "kind:global_window"
}
],
"is_wrapper": true
},
"output_name": "None",
"user_name": "assert_that/Match.out"
}
],
"parallel_input": {
"@type": "OutputReference",
"output_name": "None",
"step_name": "s22"
},
"serialized_fn": "<string of 1736 bytes>",
"user_name": "assert_that/Match"
}
}
],
"type": "JOB_TYPE_BATCH"
}
INFO:apache_beam.runners.dataflow.internal.apiclient:Create job: <Job
createTime: u'2020-02-28T21:51:39.392673Z'
currentStateTime: u'1970-01-01T00:00:00Z'
id: u'2020-02-28_13_51_38-15479530698248575890'
location: u'us-central1'
name: u'beamapp-jenkins-0228212409-752642'
projectId: u'apache-beam-testing'
stageStates: []
startTime: u'2020-02-28T21:51:39.392673Z'
steps: []
tempFiles: []
type: TypeValueValuesEnum(JOB_TYPE_BATCH, 1)>
INFO:apache_beam.runners.dataflow.internal.apiclient:Created job with id: [2020-02-28_13_51_38-15479530698248575890]
INFO:apache_beam.runners.dataflow.internal.apiclient:To access the Dataflow monitoring console, please navigate to https://console.cloud.google.com/dataflow/jobs/us-central1/2020-02-28_13_51_38-15479530698248575890?project=apache-beam-testing
INFO:apache_beam.runners.dataflow.dataflow_runner:Job 2020-02-28_13_51_38-15479530698248575890 is in state JOB_STATE_RUNNING
INFO:apache_beam.runners.dataflow.dataflow_runner:2020-02-28T21:51:38.268Z: JOB_MESSAGE_DETAILED: Autoscaling was automatically enabled for job 2020-02-28_13_51_38-15479530698248575890.
INFO:apache_beam.runners.dataflow.dataflow_runner:2020-02-28T21:51:38.268Z: JOB_MESSAGE_DETAILED: Autoscaling is enabled for job 2020-02-28_13_51_38-15479530698248575890. The number of workers will be between 1 and 1000.
INFO:apache_beam.runners.dataflow.dataflow_runner:2020-02-28T21:51:41.672Z: JOB_MESSAGE_DETAILED: Checking permissions granted to controller Service Account.
INFO:apache_beam.runners.dataflow.dataflow_runner:2020-02-28T21:51:43.081Z: JOB_MESSAGE_BASIC: Worker configuration: n1-standard-1 in us-central1-c.
INFO:apache_beam.runners.dataflow.dataflow_runner:2020-02-28T21:51:43.913Z: JOB_MESSAGE_DETAILED: Expanding CoGroupByKey operations into optimizable parts.
INFO:apache_beam.runners.dataflow.dataflow_runner:2020-02-28T21:51:43.938Z: JOB_MESSAGE_DEBUG: Combiner lifting skipped for step assert_that/Group/GroupByKey: GroupByKey not followed by a combiner.
INFO:apache_beam.runners.dataflow.dataflow_runner:2020-02-28T21:51:43.996Z: JOB_MESSAGE_DEBUG: Combiner lifting skipped for step read from datastore/GroupByKey: GroupByKey not followed by a combiner.
INFO:apache_beam.runners.dataflow.dataflow_runner:2020-02-28T21:51:44.026Z: JOB_MESSAGE_DETAILED: Expanding GroupByKey operations into optimizable parts.
INFO:apache_beam.runners.dataflow.dataflow_runner:2020-02-28T21:51:44.058Z: JOB_MESSAGE_DETAILED: Lifting ValueCombiningMappingFns into MergeBucketsMappingFns
INFO:apache_beam.runners.dataflow.dataflow_runner:2020-02-28T21:51:44.165Z: JOB_MESSAGE_DEBUG: Annotating graph with Autotuner information.
INFO:apache_beam.runners.dataflow.dataflow_runner:2020-02-28T21:51:44.222Z: JOB_MESSAGE_DETAILED: Fusing adjacent ParDo, Read, Write, and Flatten operations
INFO:apache_beam.runners.dataflow.dataflow_runner:2020-02-28T21:51:44.251Z: JOB_MESSAGE_DETAILED: Fusing consumer read from datastore/SplitQuery into read from datastore/UserQuery/Read
INFO:apache_beam.runners.dataflow.dataflow_runner:2020-02-28T21:51:44.283Z: JOB_MESSAGE_DETAILED: Fusing consumer read from datastore/GroupByKey/Reify into read from datastore/SplitQuery
INFO:apache_beam.runners.dataflow.dataflow_runner:2020-02-28T21:51:44.309Z: JOB_MESSAGE_DETAILED: Fusing consumer read from datastore/GroupByKey/Write into read from datastore/GroupByKey/Reify
INFO:apache_beam.runners.dataflow.dataflow_runner:2020-02-28T21:51:44.344Z: JOB_MESSAGE_DETAILED: Fusing consumer read from datastore/GroupByKey/GroupByWindow into read from datastore/GroupByKey/Read
INFO:apache_beam.runners.dataflow.dataflow_runner:2020-02-28T21:51:44.369Z: JOB_MESSAGE_DETAILED: Fusing consumer read from datastore/Values into read from datastore/GroupByKey/GroupByWindow
INFO:apache_beam.runners.dataflow.dataflow_runner:2020-02-28T21:51:44.400Z: JOB_MESSAGE_DETAILED: Fusing consumer read from datastore/Flatten into read from datastore/Values
INFO:apache_beam.runners.dataflow.dataflow_runner:2020-02-28T21:51:44.431Z: JOB_MESSAGE_DETAILED: Fusing consumer read from datastore/Read into read from datastore/Flatten
INFO:apache_beam.runners.dataflow.dataflow_runner:2020-02-28T21:51:44.460Z: JOB_MESSAGE_DETAILED: Fusing consumer Globally/CombineGlobally(CountCombineFn)/KeyWithVoid into read from datastore/Read
INFO:apache_beam.runners.dataflow.dataflow_runner:2020-02-28T21:51:44.486Z: JOB_MESSAGE_DETAILED: Fusing consumer Globally/CombineGlobally(CountCombineFn)/CombinePerKey/GroupByKey+Globally/CombineGlobally(CountCombineFn)/CombinePerKey/Combine/Partial into Globally/CombineGlobally(CountCombineFn)/KeyWithVoid
INFO:apache_beam.runners.dataflow.dataflow_runner:2020-02-28T21:51:44.514Z: JOB_MESSAGE_DETAILED: Fusing consumer Globally/CombineGlobally(CountCombineFn)/CombinePerKey/GroupByKey/Reify into Globally/CombineGlobally(CountCombineFn)/CombinePerKey/GroupByKey+Globally/CombineGlobally(CountCombineFn)/CombinePerKey/Combine/Partial
INFO:apache_beam.runners.dataflow.dataflow_runner:2020-02-28T21:51:44.551Z: JOB_MESSAGE_DETAILED: Fusing consumer Globally/CombineGlobally(CountCombineFn)/CombinePerKey/GroupByKey/Write into Globally/CombineGlobally(CountCombineFn)/CombinePerKey/GroupByKey/Reify
INFO:apache_beam.runners.dataflow.dataflow_runner:2020-02-28T21:51:44.580Z: JOB_MESSAGE_DETAILED: Fusing consumer Globally/CombineGlobally(CountCombineFn)/CombinePerKey/Combine into Globally/CombineGlobally(CountCombineFn)/CombinePerKey/GroupByKey/Read
INFO:apache_beam.runners.dataflow.dataflow_runner:2020-02-28T21:51:44.606Z: JOB_MESSAGE_DETAILED: Fusing consumer Globally/CombineGlobally(CountCombineFn)/CombinePerKey/Combine/Extract into Globally/CombineGlobally(CountCombineFn)/CombinePerKey/Combine
INFO:apache_beam.runners.dataflow.dataflow_runner:2020-02-28T21:51:44.630Z: JOB_MESSAGE_DETAILED: Fusing consumer Globally/CombineGlobally(CountCombineFn)/UnKey into Globally/CombineGlobally(CountCombineFn)/CombinePerKey/Combine/Extract
INFO:apache_beam.runners.dataflow.dataflow_runner:2020-02-28T21:51:44.658Z: JOB_MESSAGE_DETAILED: Unzipping flatten s19 for input s17.None
INFO:apache_beam.runners.dataflow.dataflow_runner:2020-02-28T21:51:44.684Z: JOB_MESSAGE_DETAILED: Fusing unzipped copy of assert_that/Group/GroupByKey/Reify, through flatten assert_that/Group/Flatten, into producer assert_that/Group/pair_with_0
INFO:apache_beam.runners.dataflow.dataflow_runner:2020-02-28T21:51:44.711Z: JOB_MESSAGE_DETAILED: Fusing consumer assert_that/Group/GroupByKey/GroupByWindow into assert_that/Group/GroupByKey/Read
INFO:apache_beam.runners.dataflow.dataflow_runner:2020-02-28T21:51:44.740Z: JOB_MESSAGE_DETAILED: Fusing consumer assert_that/Group/Map(_merge_tagged_vals_under_key) into assert_that/Group/GroupByKey/GroupByWindow
INFO:apache_beam.runners.dataflow.dataflow_runner:2020-02-28T21:51:44.767Z: JOB_MESSAGE_DETAILED: Fusing consumer assert_that/Unkey into assert_that/Group/Map(_merge_tagged_vals_under_key)
INFO:apache_beam.runners.dataflow.dataflow_runner:2020-02-28T21:51:44.790Z: JOB_MESSAGE_DETAILED: Fusing consumer assert_that/Match into assert_that/Unkey
INFO:apache_beam.runners.dataflow.dataflow_runner:2020-02-28T21:51:44.818Z: JOB_MESSAGE_DETAILED: Unzipping flatten s19-u40 for input s20-reify-value9-c38
INFO:apache_beam.runners.dataflow.dataflow_runner:2020-02-28T21:51:44.840Z: JOB_MESSAGE_DETAILED: Fusing unzipped copy of assert_that/Group/GroupByKey/Write, through flatten assert_that/Group/Flatten/Unzipped-1, into producer assert_that/Group/GroupByKey/Reify
INFO:apache_beam.runners.dataflow.dataflow_runner:2020-02-28T21:51:44.871Z: JOB_MESSAGE_DETAILED: Fusing consumer assert_that/Group/pair_with_0 into assert_that/Create/Read
INFO:apache_beam.runners.dataflow.dataflow_runner:2020-02-28T21:51:44.898Z: JOB_MESSAGE_DETAILED: Fusing consumer assert_that/Group/GroupByKey/Reify into assert_that/Group/pair_with_1
INFO:apache_beam.runners.dataflow.dataflow_runner:2020-02-28T21:51:44.925Z: JOB_MESSAGE_DETAILED: Fusing consumer assert_that/Group/GroupByKey/Write into assert_that/Group/GroupByKey/Reify
INFO:apache_beam.runners.dataflow.dataflow_runner:2020-02-28T21:51:44.947Z: JOB_MESSAGE_DETAILED: Fusing consumer Globally/CombineGlobally(CountCombineFn)/InjectDefault/InjectDefault into Globally/CombineGlobally(CountCombineFn)/DoOnce/Read
INFO:apache_beam.runners.dataflow.dataflow_runner:2020-02-28T21:51:44.977Z: JOB_MESSAGE_DETAILED: Fusing consumer assert_that/WindowInto(WindowIntoFn) into Globally/CombineGlobally(CountCombineFn)/InjectDefault/InjectDefault
INFO:apache_beam.runners.dataflow.dataflow_runner:2020-02-28T21:51:45.067Z: JOB_MESSAGE_DETAILED: Fusing consumer assert_that/ToVoidKey into assert_that/WindowInto(WindowIntoFn)
INFO:apache_beam.runners.dataflow.dataflow_runner:2020-02-28T21:51:45.094Z: JOB_MESSAGE_DETAILED: Fusing consumer assert_that/Group/pair_with_1 into assert_that/ToVoidKey
INFO:apache_beam.runners.dataflow.dataflow_runner:2020-02-28T21:51:45.127Z: JOB_MESSAGE_DEBUG: Workflow config is missing a default resource spec.
INFO:apache_beam.runners.dataflow.dataflow_runner:2020-02-28T21:51:45.154Z: JOB_MESSAGE_DEBUG: Adding StepResource setup and teardown to workflow graph.
INFO:apache_beam.runners.dataflow.dataflow_runner:2020-02-28T21:51:45.176Z: JOB_MESSAGE_DEBUG: Adding workflow start and stop steps.
INFO:apache_beam.runners.dataflow.dataflow_runner:2020-02-28T21:51:45.204Z: JOB_MESSAGE_DEBUG: Assigning stage ids.
INFO:apache_beam.runners.dataflow.dataflow_runner:2020-02-28T21:51:45.451Z: JOB_MESSAGE_DEBUG: Executing wait step start51
INFO:apache_beam.runners.dataflow.dataflow_runner:2020-02-28T21:51:45.517Z: JOB_MESSAGE_BASIC: Executing operation assert_that/Group/GroupByKey/Create
INFO:apache_beam.runners.dataflow.dataflow_runner:2020-02-28T21:51:45.544Z: JOB_MESSAGE_BASIC: Executing operation read from datastore/GroupByKey/Create
INFO:apache_beam.runners.dataflow.dataflow_runner:2020-02-28T21:51:45.561Z: JOB_MESSAGE_DEBUG: Starting worker pool setup.
INFO:apache_beam.runners.dataflow.dataflow_runner:2020-02-28T21:51:45.570Z: JOB_MESSAGE_BASIC: Executing operation Globally/CombineGlobally(CountCombineFn)/CombinePerKey/GroupByKey/Create
INFO:apache_beam.runners.dataflow.dataflow_runner:2020-02-28T21:51:45.588Z: JOB_MESSAGE_BASIC: Starting 1 workers in us-central1-c...
INFO:apache_beam.runners.dataflow.dataflow_runner:2020-02-28T21:51:45.644Z: JOB_MESSAGE_BASIC: Finished operation assert_that/Group/GroupByKey/Create
INFO:apache_beam.runners.dataflow.dataflow_runner:2020-02-28T21:51:45.660Z: JOB_MESSAGE_BASIC: Finished operation read from datastore/GroupByKey/Create
INFO:apache_beam.runners.dataflow.dataflow_runner:2020-02-28T21:51:45.660Z: JOB_MESSAGE_BASIC: Finished operation Globally/CombineGlobally(CountCombineFn)/CombinePerKey/GroupByKey/Create
INFO:apache_beam.runners.dataflow.dataflow_runner:2020-02-28T21:51:45.705Z: JOB_MESSAGE_DEBUG: Value "assert_that/Group/GroupByKey/Session" materialized.
INFO:apache_beam.runners.dataflow.dataflow_runner:2020-02-28T21:51:45.728Z: JOB_MESSAGE_DEBUG: Value "Globally/CombineGlobally(CountCombineFn)/CombinePerKey/GroupByKey/Session" materialized.
INFO:apache_beam.runners.dataflow.dataflow_runner:2020-02-28T21:51:45.756Z: JOB_MESSAGE_DEBUG: Value "read from datastore/GroupByKey/Session" materialized.
INFO:apache_beam.runners.dataflow.dataflow_runner:2020-02-28T21:51:45.781Z: JOB_MESSAGE_BASIC: Executing operation assert_that/Create/Read+assert_that/Group/pair_with_0+assert_that/Group/GroupByKey/Reify+assert_that/Group/GroupByKey/Write
INFO:apache_beam.runners.dataflow.dataflow_runner:2020-02-28T21:51:45.814Z: JOB_MESSAGE_BASIC: Executing operation read from datastore/UserQuery/Read+read from datastore/SplitQuery+read from datastore/GroupByKey/Reify+read from datastore/GroupByKey/Write
INFO:apache_beam.runners.dataflow.dataflow_runner:2020-02-28T21:52:09.626Z: JOB_MESSAGE_WARNING: Your project already contains 100 Dataflow-created metric descriptors and Stackdriver will not create new Dataflow custom metrics for this job. Each unique user-defined metric name (independent of the DoFn in which it is defined) produces a new metric descriptor. To delete old / unused metric descriptors see https://developers.google.com/apis-explorer/#p/monitoring/v3/monitoring.projects.metricDescriptors.list and https://developers.google.com/apis-explorer/#p/monitoring/v3/monitoring.projects.metricDescriptors.delete
INFO:apache_beam.runners.dataflow.dataflow_runner:2020-02-28T21:52:09.670Z: JOB_MESSAGE_DETAILED: Autoscaling: Raised the number of workers to 1 based on the rate of progress in the currently running step(s).
INFO:apache_beam.runners.dataflow.dataflow_runner:2020-02-28T21:53:17.149Z: JOB_MESSAGE_DETAILED: Workers have started successfully.
INFO:apache_beam.runners.dataflow.dataflow_runner:2020-02-28T21:53:17.185Z: JOB_MESSAGE_DETAILED: Workers have started successfully.
INFO:oauth2client.transport:Refreshing due to a 401 (attempt 1/2)
INFO:apache_beam.runners.dataflow.dataflow_runner:2020-02-28T21:56:26.149Z: JOB_MESSAGE_BASIC: Finished operation assert_that/Create/Read+assert_that/Group/pair_with_0+assert_that/Group/GroupByKey/Reify+assert_that/Group/GroupByKey/Write
INFO:apache_beam.runners.dataflow.dataflow_runner:2020-02-28T21:56:29.691Z: JOB_MESSAGE_BASIC: Finished operation read from datastore/UserQuery/Read+read from datastore/SplitQuery+read from datastore/GroupByKey/Reify+read from datastore/GroupByKey/Write
INFO:apache_beam.runners.dataflow.dataflow_runner:2020-02-28T21:56:29.760Z: JOB_MESSAGE_BASIC: Executing operation read from datastore/GroupByKey/Close
INFO:apache_beam.runners.dataflow.dataflow_runner:2020-02-28T21:56:29.816Z: JOB_MESSAGE_BASIC: Finished operation read from datastore/GroupByKey/Close
INFO:apache_beam.runners.dataflow.dataflow_runner:2020-02-28T21:56:29.879Z: JOB_MESSAGE_BASIC: Executing operation read from datastore/GroupByKey/Read+read from datastore/GroupByKey/GroupByWindow+read from datastore/Values+read from datastore/Flatten+read from datastore/Read+Globally/CombineGlobally(CountCombineFn)/KeyWithVoid+Globally/CombineGlobally(CountCombineFn)/CombinePerKey/GroupByKey+Globally/CombineGlobally(CountCombineFn)/CombinePerKey/Combine/Partial+Globally/CombineGlobally(CountCombineFn)/CombinePerKey/GroupByKey/Reify+Globally/CombineGlobally(CountCombineFn)/CombinePerKey/GroupByKey/Write
INFO:apache_beam.runners.dataflow.dataflow_runner:2020-02-28T21:56:39.553Z: JOB_MESSAGE_BASIC: Finished operation read from datastore/GroupByKey/Read+read from datastore/GroupByKey/GroupByWindow+read from datastore/Values+read from datastore/Flatten+read from datastore/Read+Globally/CombineGlobally(CountCombineFn)/KeyWithVoid+Globally/CombineGlobally(CountCombineFn)/CombinePerKey/GroupByKey+Globally/CombineGlobally(CountCombineFn)/CombinePerKey/Combine/Partial+Globally/CombineGlobally(CountCombineFn)/CombinePerKey/GroupByKey/Reify+Globally/CombineGlobally(CountCombineFn)/CombinePerKey/GroupByKey/Write
INFO:apache_beam.runners.dataflow.dataflow_runner:2020-02-28T21:56:39.617Z: JOB_MESSAGE_BASIC: Executing operation Globally/CombineGlobally(CountCombineFn)/CombinePerKey/GroupByKey/Close
INFO:apache_beam.runners.dataflow.dataflow_runner:2020-02-28T21:56:39.675Z: JOB_MESSAGE_BASIC: Finished operation Globally/CombineGlobally(CountCombineFn)/CombinePerKey/GroupByKey/Close
INFO:apache_beam.runners.dataflow.dataflow_runner:2020-02-28T21:56:39.729Z: JOB_MESSAGE_BASIC: Executing operation Globally/CombineGlobally(CountCombineFn)/CombinePerKey/GroupByKey/Read+Globally/CombineGlobally(CountCombineFn)/CombinePerKey/Combine+Globally/CombineGlobally(CountCombineFn)/CombinePerKey/Combine/Extract+Globally/CombineGlobally(CountCombineFn)/UnKey
INFO:apache_beam.runners.dataflow.dataflow_runner:2020-02-28T21:56:45.493Z: JOB_MESSAGE_BASIC: Finished operation Globally/CombineGlobally(CountCombineFn)/CombinePerKey/GroupByKey/Read+Globally/CombineGlobally(CountCombineFn)/CombinePerKey/Combine+Globally/CombineGlobally(CountCombineFn)/CombinePerKey/Combine/Extract+Globally/CombineGlobally(CountCombineFn)/UnKey
INFO:apache_beam.runners.dataflow.dataflow_runner:2020-02-28T21:56:45.547Z: JOB_MESSAGE_DEBUG: Value "Globally/CombineGlobally(CountCombineFn)/UnKey.out" materialized.
INFO:apache_beam.runners.dataflow.dataflow_runner:2020-02-28T21:56:45.599Z: JOB_MESSAGE_BASIC: Executing operation Globally/CombineGlobally(CountCombineFn)/InjectDefault/_UnpickledSideInput(UnKey.out.0)
INFO:apache_beam.runners.dataflow.dataflow_runner:2020-02-28T21:56:45.649Z: JOB_MESSAGE_BASIC: Finished operation Globally/CombineGlobally(CountCombineFn)/InjectDefault/_UnpickledSideInput(UnKey.out.0)
INFO:apache_beam.runners.dataflow.dataflow_runner:2020-02-28T21:56:45.718Z: JOB_MESSAGE_DEBUG: Value "Globally/CombineGlobally(CountCombineFn)/InjectDefault/_UnpickledSideInput(UnKey.out.0).output" materialized.
INFO:apache_beam.runners.dataflow.dataflow_runner:2020-02-28T21:56:45.768Z: JOB_MESSAGE_BASIC: Executing operation Globally/CombineGlobally(CountCombineFn)/DoOnce/Read+Globally/CombineGlobally(CountCombineFn)/InjectDefault/InjectDefault+assert_that/WindowInto(WindowIntoFn)+assert_that/ToVoidKey+assert_that/Group/pair_with_1+assert_that/Group/GroupByKey/Reify+assert_that/Group/GroupByKey/Write
INFO:apache_beam.runners.dataflow.dataflow_runner:2020-02-28T21:56:50.547Z: JOB_MESSAGE_BASIC: Finished operation Globally/CombineGlobally(CountCombineFn)/DoOnce/Read+Globally/CombineGlobally(CountCombineFn)/InjectDefault/InjectDefault+assert_that/WindowInto(WindowIntoFn)+assert_that/ToVoidKey+assert_that/Group/pair_with_1+assert_that/Group/GroupByKey/Reify+assert_that/Group/GroupByKey/Write
INFO:apache_beam.runners.dataflow.dataflow_runner:2020-02-28T21:56:50.603Z: JOB_MESSAGE_BASIC: Executing operation assert_that/Group/GroupByKey/Close
INFO:apache_beam.runners.dataflow.dataflow_runner:2020-02-28T21:56:50.662Z: JOB_MESSAGE_BASIC: Finished operation assert_that/Group/GroupByKey/Close
INFO:apache_beam.runners.dataflow.dataflow_runner:2020-02-28T21:56:50.733Z: JOB_MESSAGE_BASIC: Executing operation assert_that/Group/GroupByKey/Read+assert_that/Group/GroupByKey/GroupByWindow+assert_that/Group/Map(_merge_tagged_vals_under_key)+assert_that/Unkey+assert_that/Match
INFO:apache_beam.runners.dataflow.dataflow_runner:2020-02-28T21:57:00.095Z: JOB_MESSAGE_BASIC: Finished operation assert_that/Group/GroupByKey/Read+assert_that/Group/GroupByKey/GroupByWindow+assert_that/Group/Map(_merge_tagged_vals_under_key)+assert_that/Unkey+assert_that/Match
INFO:apache_beam.runners.dataflow.dataflow_runner:2020-02-28T21:57:00.160Z: JOB_MESSAGE_DEBUG: Executing success step success49
INFO:apache_beam.runners.dataflow.dataflow_runner:2020-02-28T21:57:00.283Z: JOB_MESSAGE_DETAILED: Cleaning up.
INFO:apache_beam.runners.dataflow.dataflow_runner:2020-02-28T21:57:00.330Z: JOB_MESSAGE_DEBUG: Starting worker pool teardown.
INFO:apache_beam.runners.dataflow.dataflow_runner:2020-02-28T21:57:00.354Z: JOB_MESSAGE_BASIC: Stopping worker pool...
INFO:apache_beam.runners.dataflow.dataflow_runner:2020-02-28T21:58:10.135Z: JOB_MESSAGE_DETAILED: Autoscaling: Resized worker pool from 1 to 0.
INFO:apache_beam.runners.dataflow.dataflow_runner:2020-02-28T21:58:10.185Z: JOB_MESSAGE_BASIC: Worker pool stopped.
INFO:apache_beam.runners.dataflow.dataflow_runner:2020-02-28T21:58:10.222Z: JOB_MESSAGE_DEBUG: Tearing down pending resources...
INFO:apache_beam.runners.dataflow.dataflow_runner:Job 2020-02-28_13_51_38-15479530698248575890 is in state JOB_STATE_DONE
test_datastore_write_limit (apache_beam.io.gcp.datastore_write_it_test.DatastoreWriteIT) ... ok
----------------------------------------------------------------------
XML: nosetests-postCommitIT-df.xml
----------------------------------------------------------------------
XML: <https://builds.apache.org/job/beam_PostCommit_Python2/ws/src/sdks/python/nosetests.xml>
----------------------------------------------------------------------
Ran 55 tests in 3611.995s
OK (SKIP=7)
Worker logs: https://console.cloud.google.com/dataflow/jobs/us-central1/2020-02-28_12_58_44-18262584362783159771?project=apache-beam-testing
Worker logs: https://console.cloud.google.com/dataflow/jobs/us-central1/2020-02-28_13_12_48-4968547659515304651?project=apache-beam-testing
Worker logs: https://console.cloud.google.com/dataflow/jobs/us-central1/2020-02-28_13_21_48-948420808144834959?project=apache-beam-testing
Worker logs: https://console.cloud.google.com/dataflow/jobs/us-central1/2020-02-28_13_29_45-8514560714259774634?project=apache-beam-testing
Worker logs: https://console.cloud.google.com/dataflow/jobs/us-central1/2020-02-28_13_36_49-7466030484944901676?project=apache-beam-testing
Worker logs: https://console.cloud.google.com/dataflow/jobs/us-central1/2020-02-28_12_58_38-10527636990296093208?project=apache-beam-testing
Worker logs: https://console.cloud.google.com/dataflow/jobs/us-central1/2020-02-28_13_17_58-14144908265021579007?project=apache-beam-testing
Worker logs: https://console.cloud.google.com/dataflow/jobs/us-central1/2020-02-28_13_34_50-1833258357133700699?project=apache-beam-testing
Worker logs: https://console.cloud.google.com/dataflow/jobs/us-central1/2020-02-28_13_41_43-9690390700861054974?project=apache-beam-testing
Worker logs: https://console.cloud.google.com/dataflow/jobs/us-central1/2020-02-28_12_58_38-13455602087039995447?project=apache-beam-testing
Worker logs: https://console.cloud.google.com/dataflow/jobs/us-central1/2020-02-28_13_05_37-12511460256127484772?project=apache-beam-testing
Worker logs: https://console.cloud.google.com/dataflow/jobs/us-central1/2020-02-28_13_14_04-10204492091242730608?project=apache-beam-testing
Worker logs: https://console.cloud.google.com/dataflow/jobs/us-central1/2020-02-28_13_20_59-13728080180554327247?project=apache-beam-testing
Worker logs: https://console.cloud.google.com/dataflow/jobs/us-central1/2020-02-28_13_27_10-2951390133156749131?project=apache-beam-testing
Worker logs: https://console.cloud.google.com/dataflow/jobs/us-central1/2020-02-28_13_34_14-17154543520904755364?project=apache-beam-testing
Worker logs: https://console.cloud.google.com/dataflow/jobs/us-central1/2020-02-28_12_58_42-3107555102710030664?project=apache-beam-testing
Worker logs: https://console.cloud.google.com/dataflow/jobs/us-central1/2020-02-28_13_10_48-16038151270295634118?project=apache-beam-testing
Worker logs: https://console.cloud.google.com/dataflow/jobs/us-central1/2020-02-28_13_17_50-10809259390568557062?project=apache-beam-testing
Worker logs: https://console.cloud.google.com/dataflow/jobs/us-central1/2020-02-28_13_24_46-7156738391548569676?project=apache-beam-testing
Worker logs: https://console.cloud.google.com/dataflow/jobs/us-central1/2020-02-28_13_31_13-2010221151822534593?project=apache-beam-testing
Worker logs: https://console.cloud.google.com/dataflow/jobs/us-central1/2020-02-28_13_38_19-5038714825191514300?project=apache-beam-testing
Worker logs: https://console.cloud.google.com/dataflow/jobs/us-central1/2020-02-28_12_58_39-17274806079309359160?project=apache-beam-testing
Worker logs: https://console.cloud.google.com/dataflow/jobs/us-central1/2020-02-28_13_14_24-10747295030963037601?project=apache-beam-testing
Worker logs: https://console.cloud.google.com/dataflow/jobs/us-central1/2020-02-28_13_21_56-11366647357165560956?project=apache-beam-testing
Worker logs: https://console.cloud.google.com/dataflow/jobs/us-central1/2020-02-28_13_28_40-177557489958149349?project=apache-beam-testing
Worker logs: https://console.cloud.google.com/dataflow/jobs/us-central1/2020-02-28_13_35_48-6610312889992825278?project=apache-beam-testing
Worker logs: https://console.cloud.google.com/dataflow/jobs/us-central1/2020-02-28_12_58_40-1672348352891557116?project=apache-beam-testing
Worker logs: https://console.cloud.google.com/dataflow/jobs/us-central1/2020-02-28_13_06_17-2307769646061173344?project=apache-beam-testing
Worker logs: https://console.cloud.google.com/dataflow/jobs/us-central1/2020-02-28_13_13_29-1107599530861022124?project=apache-beam-testing
Worker logs: https://console.cloud.google.com/dataflow/jobs/us-central1/2020-02-28_13_20_37-16248739299598204656?project=apache-beam-testing
Worker logs: https://console.cloud.google.com/dataflow/jobs/us-central1/2020-02-28_13_27_54-2436960486987868461?project=apache-beam-testing
Worker logs: https://console.cloud.google.com/dataflow/jobs/us-central1/2020-02-28_13_35_10-15765028511091600217?project=apache-beam-testing
Worker logs: https://console.cloud.google.com/dataflow/jobs/us-central1/2020-02-28_12_58_40-14096140254979263212?project=apache-beam-testing
Worker logs: https://console.cloud.google.com/dataflow/jobs/us-central1/2020-02-28_13_06_12-10221779730752637380?project=apache-beam-testing
Worker logs: https://console.cloud.google.com/dataflow/jobs/us-central1/2020-02-28_13_13_31-2254655349968442657?project=apache-beam-testing
Worker logs: https://console.cloud.google.com/dataflow/jobs/us-central1/2020-02-28_13_20_29-8949533183345196650?project=apache-beam-testing
Worker logs: https://console.cloud.google.com/dataflow/jobs/us-central1/2020-02-28_13_27_35-3744503101813510599?project=apache-beam-testing
Worker logs: https://console.cloud.google.com/dataflow/jobs/us-central1/2020-02-28_13_34_20-14261341931490116395?project=apache-beam-testing
Worker logs: https://console.cloud.google.com/dataflow/jobs/us-central1/2020-02-28_13_40_56-12519638459874213629?project=apache-beam-testing
Worker logs: https://console.cloud.google.com/dataflow/jobs/us-central1/2020-02-28_12_58_40-14376551922689410708?project=apache-beam-testing
Worker logs: https://console.cloud.google.com/dataflow/jobs/us-central1/2020-02-28_13_07_00-17882922161568906937?project=apache-beam-testing
Worker logs: https://console.cloud.google.com/dataflow/jobs/us-central1/2020-02-28_13_16_38-5980165072202049167?project=apache-beam-testing
Worker logs: https://console.cloud.google.com/dataflow/jobs/us-central1/2020-02-28_13_24_24-8092158495940999347?project=apache-beam-testing
Worker logs: https://console.cloud.google.com/dataflow/jobs/us-central1/2020-02-28_13_30_59-1321479701742614371?project=apache-beam-testing
Worker logs: https://console.cloud.google.com/dataflow/jobs/us-central1/2020-02-28_13_38_10-1815064332465722779?project=apache-beam-testing
Worker logs: https://console.cloud.google.com/dataflow/jobs/us-central1/2020-02-28_13_45_04-12809742563639454043?project=apache-beam-testing
Worker logs: https://console.cloud.google.com/dataflow/jobs/us-central1/2020-02-28_13_51_38-15479530698248575890?project=apache-beam-testing
FAILURE: Build failed with an exception.
* Where:
Build file '<https://builds.apache.org/job/beam_PostCommit_Python2/ws/src/sdks/python/test-suites/portable/py2/build.gradle'> line: 143
* What went wrong:
Execution failed for task ':sdks:python:test-suites:portable:py2:crossLanguagePortableWordCount'.
> Process 'command 'sh'' finished with non-zero exit value 1
* Try:
Run with --stacktrace option to get the stack trace. Run with --info or --debug option to get more log output. Run with --scan to get full insights.
* Get more help at https://help.gradle.org
Deprecated Gradle features were used in this build, making it incompatible with Gradle 6.0.
Use '--warning-mode all' to show the individual deprecation warnings.
See https://docs.gradle.org/5.2.1/userguide/command_line_interface.html#sec:command_line_warnings
BUILD FAILED in 1h 1m 43s
124 actionable tasks: 99 executed, 22 from cache, 3 up-to-date
Publishing build scan...
https://gradle.com/s/7xow7kjbqda2o
Build step 'Invoke Gradle script' changed build result to FAILURE
Build step 'Invoke Gradle script' marked build as failure
---------------------------------------------------------------------
To unsubscribe, e-mail: builds-unsubscribe@beam.apache.org
For additional commands, e-mail: builds-help@beam.apache.org