You are viewing a plain text version of this content. The canonical link for it is here.
Posted to dev@hive.apache.org by Apache Jenkins Server <je...@builds.apache.org> on 2012/11/08 15:28:30 UTC

Hive-trunk-h0.21 - Build # 1781 - Still Failing

Changes for Build #1764
[kevinwilfong] HIVE-3610. Add a command "Explain dependency ..." (Sambavi Muthukrishnan via kevinwilfong)


Changes for Build #1765

Changes for Build #1766
[hashutosh] HIVE-3441 : testcases escape1,escape2 fail on windows (Thejas Nair via Ashutosh Chauhan)

[kevinwilfong] HIVE-3499. add tests to use bucketing metadata for partitions. (njain via kevinwilfong)


Changes for Build #1767
[kevinwilfong] HIVE-3276. optimize union sub-queries. (njain via kevinwilfong)


Changes for Build #1768

Changes for Build #1769

Changes for Build #1770
[namit] HIVE-3570 Add/fix facility to collect operator specific statisticsin hive + add hash-in/hash-out
counter for GroupBy Optr (Satadru Pan via namit)

[namit] HIVE-3554 Hive List Bucketing - Query logic
(Gang Tim Liu via namit)

[cws] HIVE-3563. Drop database cascade fails when there are indexes on any tables (Prasad Mujumdar via cws)


Changes for Build #1771
[kevinwilfong] HIVE-3640. Reducer allocation is incorrect if enforce bucketing and mapred.reduce.tasks are both set. (Vighnesh Avadhani via kevinwilfong)


Changes for Build #1772

Changes for Build #1773

Changes for Build #1774

Changes for Build #1775
[namit] HIVE-3673 Sort merge join not used when join columns have different names
(Kevin Wilfong via namit)


Changes for Build #1776
[kevinwilfong] HIVE-3627. eclipse misses library: javolution-@javolution-version@.jar. (Gang Tim Liu via kevinwilfong)


Changes for Build #1777
[kevinwilfong] HIVE-3524. Storing certain Exception objects thrown in HiveMetaStore.java in MetaStoreEndFunctionContext. (Maheshwaran Srinivasan via kevinwilfong)

[cws] HIVE-1977. DESCRIBE TABLE syntax doesn't support specifying a database qualified table name (Zhenxiao Luo via cws)

[cws] HIVE-3674. Test case TestParse broken after recent checkin (Sambavi Muthukrishnan via cws)


Changes for Build #1778
[cws] HIVE-1362. Column level scalar valued statistics on Tables and Partitions (Shreepadma Venugopalan via cws)


Changes for Build #1779

Changes for Build #1780
[kevinwilfong] HIVE-3686. Fix compile errors introduced by the interaction of HIVE-1362 and HIVE-3524. (Shreepadma Venugopalan via kevinwilfong)


Changes for Build #1781
[namit] HIVE-3687 smb_mapjoin_13.q is nondeterministic
(Kevin Wilfong via namit)




5 tests failed.
REGRESSION:  org.apache.hadoop.hive.cli.TestNegativeMinimrCliDriver.testNegativeCliDriver_mapreduce_stack_trace_turnoff_hadoop20

Error Message:
Unexpected exception See build/ql/tmp/hive.log, or try "ant test ... -Dtest.silent=false" to get more logs.

Stack Trace:
junit.framework.AssertionFailedError: Unexpected exception
See build/ql/tmp/hive.log, or try "ant test ... -Dtest.silent=false" to get more logs.
	at junit.framework.Assert.fail(Assert.java:47)
	at org.apache.hadoop.hive.cli.TestNegativeMinimrCliDriver.testNegativeCliDriver_mapreduce_stack_trace_turnoff_hadoop20(TestNegativeMinimrCliDriver.java:291)
	at sun.reflect.NativeMethodAccessorImpl.invoke0(Native Method)
	at sun.reflect.NativeMethodAccessorImpl.invoke(NativeMethodAccessorImpl.java:39)
	at sun.reflect.DelegatingMethodAccessorImpl.invoke(DelegatingMethodAccessorImpl.java:25)
	at java.lang.reflect.Method.invoke(Method.java:597)
	at junit.framework.TestCase.runTest(TestCase.java:168)
	at junit.framework.TestCase.runBare(TestCase.java:134)
	at junit.framework.TestResult$1.protect(TestResult.java:110)
	at junit.framework.TestResult.runProtected(TestResult.java:128)
	at junit.framework.TestResult.run(TestResult.java:113)
	at junit.framework.TestCase.run(TestCase.java:124)
	at junit.framework.TestSuite.runTest(TestSuite.java:232)
	at junit.framework.TestSuite.run(TestSuite.java:227)
	at org.apache.tools.ant.taskdefs.optional.junit.JUnitTestRunner.run(JUnitTestRunner.java:518)
	at org.apache.tools.ant.taskdefs.optional.junit.JUnitTestRunner.launch(JUnitTestRunner.java:1052)
	at org.apache.tools.ant.taskdefs.optional.junit.JUnitTestRunner.main(JUnitTestRunner.java:906)


REGRESSION:  org.apache.hadoop.hive.cli.TestNegativeMinimrCliDriver.testNegativeCliDriver_minimr_broken_pipe

Error Message:
Unexpected exception See build/ql/tmp/hive.log, or try "ant test ... -Dtest.silent=false" to get more logs.

Stack Trace:
junit.framework.AssertionFailedError: Unexpected exception
See build/ql/tmp/hive.log, or try "ant test ... -Dtest.silent=false" to get more logs.
	at junit.framework.Assert.fail(Assert.java:47)
	at org.apache.hadoop.hive.cli.TestNegativeMinimrCliDriver.testNegativeCliDriver_minimr_broken_pipe(TestNegativeMinimrCliDriver.java:329)
	at sun.reflect.NativeMethodAccessorImpl.invoke0(Native Method)
	at sun.reflect.NativeMethodAccessorImpl.invoke(NativeMethodAccessorImpl.java:39)
	at sun.reflect.DelegatingMethodAccessorImpl.invoke(DelegatingMethodAccessorImpl.java:25)
	at java.lang.reflect.Method.invoke(Method.java:597)
	at junit.framework.TestCase.runTest(TestCase.java:168)
	at junit.framework.TestCase.runBare(TestCase.java:134)
	at junit.framework.TestResult$1.protect(TestResult.java:110)
	at junit.framework.TestResult.runProtected(TestResult.java:128)
	at junit.framework.TestResult.run(TestResult.java:113)
	at junit.framework.TestCase.run(TestCase.java:124)
	at junit.framework.TestSuite.runTest(TestSuite.java:232)
	at junit.framework.TestSuite.run(TestSuite.java:227)
	at org.apache.tools.ant.taskdefs.optional.junit.JUnitTestRunner.run(JUnitTestRunner.java:518)
	at org.apache.tools.ant.taskdefs.optional.junit.JUnitTestRunner.launch(JUnitTestRunner.java:1052)
	at org.apache.tools.ant.taskdefs.optional.junit.JUnitTestRunner.main(JUnitTestRunner.java:906)


REGRESSION:  org.apache.hadoop.hive.ql.TestLocationQueries.testAlterTablePartitionLocation_alter5

Error Message:
load command: LOAD DATA LOCAL INPATH '/x1/jenkins/jenkins-slave/workspace/Hive-trunk-h0.21/hive/data/files/kv1.txt' OVERWRITE INTO TABLE srcpart PARTITION (ds='2008-04-09',hr='11') failed with exit code= 10

Stack Trace:
java.lang.Exception: load command: LOAD DATA LOCAL INPATH '/x1/jenkins/jenkins-slave/workspace/Hive-trunk-h0.21/hive/data/files/kv1.txt' OVERWRITE INTO TABLE srcpart PARTITION (ds='2008-04-09',hr='11') failed with exit code= 10
	at org.apache.hadoop.hive.ql.QTestUtil.runLoadCmd(QTestUtil.java:514)
	at org.apache.hadoop.hive.ql.QTestUtil.createSources(QTestUtil.java:558)
	at org.apache.hadoop.hive.ql.QTestUtil.queryListRunnerSingleThreaded(QTestUtil.java:1208)
	at org.apache.hadoop.hive.ql.TestLocationQueries.testAlterTablePartitionLocation_alter5(TestLocationQueries.java:103)
	at sun.reflect.NativeMethodAccessorImpl.invoke0(Native Method)
	at sun.reflect.NativeMethodAccessorImpl.invoke(NativeMethodAccessorImpl.java:39)
	at sun.reflect.DelegatingMethodAccessorImpl.invoke(DelegatingMethodAccessorImpl.java:25)
	at java.lang.reflect.Method.invoke(Method.java:597)
	at junit.framework.TestCase.runTest(TestCase.java:168)
	at junit.framework.TestCase.runBare(TestCase.java:134)
	at junit.framework.TestResult$1.protect(TestResult.java:110)
	at junit.framework.TestResult.runProtected(TestResult.java:128)
	at junit.framework.TestResult.run(TestResult.java:113)
	at junit.framework.TestCase.run(TestCase.java:124)
	at junit.framework.TestSuite.runTest(TestSuite.java:232)
	at junit.framework.TestSuite.run(TestSuite.java:227)
	at org.apache.tools.ant.taskdefs.optional.junit.JUnitTestRunner.run(JUnitTestRunner.java:518)
	at org.apache.tools.ant.taskdefs.optional.junit.JUnitTestRunner.launch(JUnitTestRunner.java:1052)
	at org.apache.tools.ant.taskdefs.optional.junit.JUnitTestRunner.main(JUnitTestRunner.java:906)


FAILED:  org.apache.hadoop.hive.metastore.TestMetaStoreEndFunctionListener.testEndFunctionListener

Error Message:
-1

Stack Trace:
java.lang.ArrayIndexOutOfBoundsException: -1
	at java.util.ArrayList.get(ArrayList.java:324)
	at org.apache.hadoop.hive.metastore.TestMetaStoreEndFunctionListener.testEndFunctionListener(TestMetaStoreEndFunctionListener.java:99)
	at sun.reflect.NativeMethodAccessorImpl.invoke0(Native Method)
	at sun.reflect.NativeMethodAccessorImpl.invoke(NativeMethodAccessorImpl.java:39)
	at sun.reflect.DelegatingMethodAccessorImpl.invoke(DelegatingMethodAccessorImpl.java:25)
	at java.lang.reflect.Method.invoke(Method.java:597)
	at junit.framework.TestCase.runTest(TestCase.java:168)
	at junit.framework.TestCase.runBare(TestCase.java:134)
	at junit.framework.TestResult$1.protect(TestResult.java:110)
	at junit.framework.TestResult.runProtected(TestResult.java:128)
	at junit.framework.TestResult.run(TestResult.java:113)
	at junit.framework.TestCase.run(TestCase.java:124)
	at junit.framework.TestSuite.runTest(TestSuite.java:232)
	at junit.framework.TestSuite.run(TestSuite.java:227)
	at org.apache.tools.ant.taskdefs.optional.junit.JUnitTestRunner.run(JUnitTestRunner.java:518)
	at org.apache.tools.ant.taskdefs.optional.junit.JUnitTestRunner.launch(JUnitTestRunner.java:1052)
	at org.apache.tools.ant.taskdefs.optional.junit.JUnitTestRunner.main(JUnitTestRunner.java:906)


FAILED:  org.apache.hadoop.hive.metastore.TestMetaStoreEventListener.testListener

Error Message:
java.net.SocketException: Broken pipe

Stack Trace:
org.apache.thrift.transport.TTransportException: java.net.SocketException: Broken pipe
	at org.apache.thrift.transport.TIOStreamTransport.write(TIOStreamTransport.java:147)
	at org.apache.thrift.protocol.TBinaryProtocol.writeI32(TBinaryProtocol.java:163)
	at org.apache.thrift.protocol.TBinaryProtocol.writeString(TBinaryProtocol.java:186)
	at org.apache.thrift.protocol.TBinaryProtocol.writeMessageBegin(TBinaryProtocol.java:92)
	at org.apache.thrift.TServiceClient.sendBase(TServiceClient.java:62)
	at org.apache.hadoop.hive.metastore.api.ThriftHiveMetastore$Client.send_get_database(ThriftHiveMetastore.java:396)
	at org.apache.hadoop.hive.metastore.api.ThriftHiveMetastore$Client.get_database(ThriftHiveMetastore.java:388)
	at org.apache.hadoop.hive.metastore.HiveMetaStoreClient.getDatabase(HiveMetaStoreClient.java:715)
	at org.apache.hadoop.hive.metastore.TestMetaStoreEventListener.testListener(TestMetaStoreEventListener.java:191)
	at sun.reflect.NativeMethodAccessorImpl.invoke0(Native Method)
	at sun.reflect.NativeMethodAccessorImpl.invoke(NativeMethodAccessorImpl.java:39)
	at sun.reflect.DelegatingMethodAccessorImpl.invoke(DelegatingMethodAccessorImpl.java:25)
	at java.lang.reflect.Method.invoke(Method.java:597)
	at junit.framework.TestCase.runTest(TestCase.java:168)
	at junit.framework.TestCase.runBare(TestCase.java:134)
	at junit.framework.TestResult$1.protect(TestResult.java:110)
	at junit.framework.TestResult.runProtected(TestResult.java:128)
	at junit.framework.TestResult.run(TestResult.java:113)
	at junit.framework.TestCase.run(TestCase.java:124)
	at junit.framework.TestSuite.runTest(TestSuite.java:232)
	at junit.framework.TestSuite.run(TestSuite.java:227)
	at org.apache.tools.ant.taskdefs.optional.junit.JUnitTestRunner.run(JUnitTestRunner.java:518)
	at org.apache.tools.ant.taskdefs.optional.junit.JUnitTestRunner.launch(JUnitTestRunner.java:1052)
	at org.apache.tools.ant.taskdefs.optional.junit.JUnitTestRunner.main(JUnitTestRunner.java:906)
Caused by: java.net.SocketException: Broken pipe
	at java.net.SocketOutputStream.socketWrite0(Native Method)
	at java.net.SocketOutputStream.socketWrite(SocketOutputStream.java:92)
	at java.net.SocketOutputStream.write(SocketOutputStream.java:136)
	at org.apache.thrift.transport.TIOStreamTransport.write(TIOStreamTransport.java:145)
	... 23 more




The Apache Jenkins build system has built Hive-trunk-h0.21 (build #1781)

Status: Still Failing

Check console output at https://builds.apache.org/job/Hive-trunk-h0.21/1781/ to view the results.

Hive-trunk-h0.21 - Build # 1782 - Still Failing

Posted by Apache Jenkins Server <je...@builds.apache.org>.
Changes for Build #1764
[kevinwilfong] HIVE-3610. Add a command "Explain dependency ..." (Sambavi Muthukrishnan via kevinwilfong)


Changes for Build #1765

Changes for Build #1766
[hashutosh] HIVE-3441 : testcases escape1,escape2 fail on windows (Thejas Nair via Ashutosh Chauhan)

[kevinwilfong] HIVE-3499. add tests to use bucketing metadata for partitions. (njain via kevinwilfong)


Changes for Build #1767
[kevinwilfong] HIVE-3276. optimize union sub-queries. (njain via kevinwilfong)


Changes for Build #1768

Changes for Build #1769

Changes for Build #1770
[namit] HIVE-3570 Add/fix facility to collect operator specific statisticsin hive + add hash-in/hash-out
counter for GroupBy Optr (Satadru Pan via namit)

[namit] HIVE-3554 Hive List Bucketing - Query logic
(Gang Tim Liu via namit)

[cws] HIVE-3563. Drop database cascade fails when there are indexes on any tables (Prasad Mujumdar via cws)


Changes for Build #1771
[kevinwilfong] HIVE-3640. Reducer allocation is incorrect if enforce bucketing and mapred.reduce.tasks are both set. (Vighnesh Avadhani via kevinwilfong)


Changes for Build #1772

Changes for Build #1773

Changes for Build #1774

Changes for Build #1775
[namit] HIVE-3673 Sort merge join not used when join columns have different names
(Kevin Wilfong via namit)


Changes for Build #1776
[kevinwilfong] HIVE-3627. eclipse misses library: javolution-@javolution-version@.jar. (Gang Tim Liu via kevinwilfong)


Changes for Build #1777
[kevinwilfong] HIVE-3524. Storing certain Exception objects thrown in HiveMetaStore.java in MetaStoreEndFunctionContext. (Maheshwaran Srinivasan via kevinwilfong)

[cws] HIVE-1977. DESCRIBE TABLE syntax doesn't support specifying a database qualified table name (Zhenxiao Luo via cws)

[cws] HIVE-3674. Test case TestParse broken after recent checkin (Sambavi Muthukrishnan via cws)


Changes for Build #1778
[cws] HIVE-1362. Column level scalar valued statistics on Tables and Partitions (Shreepadma Venugopalan via cws)


Changes for Build #1779

Changes for Build #1780
[kevinwilfong] HIVE-3686. Fix compile errors introduced by the interaction of HIVE-1362 and HIVE-3524. (Shreepadma Venugopalan via kevinwilfong)


Changes for Build #1781
[namit] HIVE-3687 smb_mapjoin_13.q is nondeterministic
(Kevin Wilfong via namit)


Changes for Build #1782
[hashutosh] HIVE-2715: Upgrade Thrift dependency to 0.9.0 (Ashutosh Chauhan)




6 tests failed.
REGRESSION:  org.apache.hadoop.hive.metastore.TestRemoteHiveMetaStore.testSynchronized

Error Message:
expected:<1> but was:<2>

Stack Trace:
junit.framework.AssertionFailedError: expected:<1> but was:<2>
	at junit.framework.Assert.fail(Assert.java:47)
	at junit.framework.Assert.failNotEquals(Assert.java:277)
	at junit.framework.Assert.assertEquals(Assert.java:64)
	at junit.framework.Assert.assertEquals(Assert.java:195)
	at junit.framework.Assert.assertEquals(Assert.java:201)
	at org.apache.hadoop.hive.metastore.TestHiveMetaStore.testSynchronized(TestHiveMetaStore.java:2088)
	at sun.reflect.NativeMethodAccessorImpl.invoke0(Native Method)
	at sun.reflect.NativeMethodAccessorImpl.invoke(NativeMethodAccessorImpl.java:39)
	at sun.reflect.DelegatingMethodAccessorImpl.invoke(DelegatingMethodAccessorImpl.java:25)
	at java.lang.reflect.Method.invoke(Method.java:597)
	at junit.framework.TestCase.runTest(TestCase.java:168)
	at junit.framework.TestCase.runBare(TestCase.java:134)
	at junit.framework.TestResult$1.protect(TestResult.java:110)
	at junit.framework.TestResult.runProtected(TestResult.java:128)
	at junit.framework.TestResult.run(TestResult.java:113)
	at junit.framework.TestCase.run(TestCase.java:124)
	at junit.framework.TestSuite.runTest(TestSuite.java:232)
	at junit.framework.TestSuite.run(TestSuite.java:227)
	at org.apache.tools.ant.taskdefs.optional.junit.JUnitTestRunner.run(JUnitTestRunner.java:518)
	at org.apache.tools.ant.taskdefs.optional.junit.JUnitTestRunner.launch(JUnitTestRunner.java:1052)
	at org.apache.tools.ant.taskdefs.optional.junit.JUnitTestRunner.main(JUnitTestRunner.java:906)


REGRESSION:  org.apache.hadoop.hive.metastore.TestSetUGIOnBothClientServer.testSynchronized

Error Message:
expected:<1> but was:<2>

Stack Trace:
junit.framework.AssertionFailedError: expected:<1> but was:<2>
	at junit.framework.Assert.fail(Assert.java:47)
	at junit.framework.Assert.failNotEquals(Assert.java:277)
	at junit.framework.Assert.assertEquals(Assert.java:64)
	at junit.framework.Assert.assertEquals(Assert.java:195)
	at junit.framework.Assert.assertEquals(Assert.java:201)
	at org.apache.hadoop.hive.metastore.TestHiveMetaStore.testSynchronized(TestHiveMetaStore.java:2088)
	at sun.reflect.NativeMethodAccessorImpl.invoke0(Native Method)
	at sun.reflect.NativeMethodAccessorImpl.invoke(NativeMethodAccessorImpl.java:39)
	at sun.reflect.DelegatingMethodAccessorImpl.invoke(DelegatingMethodAccessorImpl.java:25)
	at java.lang.reflect.Method.invoke(Method.java:597)
	at junit.framework.TestCase.runTest(TestCase.java:168)
	at junit.framework.TestCase.runBare(TestCase.java:134)
	at junit.framework.TestResult$1.protect(TestResult.java:110)
	at junit.framework.TestResult.runProtected(TestResult.java:128)
	at junit.framework.TestResult.run(TestResult.java:113)
	at junit.framework.TestCase.run(TestCase.java:124)
	at junit.framework.TestSuite.runTest(TestSuite.java:232)
	at junit.framework.TestSuite.run(TestSuite.java:227)
	at org.apache.tools.ant.taskdefs.optional.junit.JUnitTestRunner.run(JUnitTestRunner.java:518)
	at org.apache.tools.ant.taskdefs.optional.junit.JUnitTestRunner.launch(JUnitTestRunner.java:1052)
	at org.apache.tools.ant.taskdefs.optional.junit.JUnitTestRunner.main(JUnitTestRunner.java:906)


REGRESSION:  org.apache.hadoop.hive.metastore.TestSetUGIOnOnlyClient.testSynchronized

Error Message:
expected:<1> but was:<2>

Stack Trace:
junit.framework.AssertionFailedError: expected:<1> but was:<2>
	at junit.framework.Assert.fail(Assert.java:47)
	at junit.framework.Assert.failNotEquals(Assert.java:277)
	at junit.framework.Assert.assertEquals(Assert.java:64)
	at junit.framework.Assert.assertEquals(Assert.java:195)
	at junit.framework.Assert.assertEquals(Assert.java:201)
	at org.apache.hadoop.hive.metastore.TestHiveMetaStore.testSynchronized(TestHiveMetaStore.java:2088)
	at sun.reflect.NativeMethodAccessorImpl.invoke0(Native Method)
	at sun.reflect.NativeMethodAccessorImpl.invoke(NativeMethodAccessorImpl.java:39)
	at sun.reflect.DelegatingMethodAccessorImpl.invoke(DelegatingMethodAccessorImpl.java:25)
	at java.lang.reflect.Method.invoke(Method.java:597)
	at junit.framework.TestCase.runTest(TestCase.java:168)
	at junit.framework.TestCase.runBare(TestCase.java:134)
	at junit.framework.TestResult$1.protect(TestResult.java:110)
	at junit.framework.TestResult.runProtected(TestResult.java:128)
	at junit.framework.TestResult.run(TestResult.java:113)
	at junit.framework.TestCase.run(TestCase.java:124)
	at junit.framework.TestSuite.runTest(TestSuite.java:232)
	at junit.framework.TestSuite.run(TestSuite.java:227)
	at org.apache.tools.ant.taskdefs.optional.junit.JUnitTestRunner.run(JUnitTestRunner.java:518)
	at org.apache.tools.ant.taskdefs.optional.junit.JUnitTestRunner.launch(JUnitTestRunner.java:1052)
	at org.apache.tools.ant.taskdefs.optional.junit.JUnitTestRunner.main(JUnitTestRunner.java:906)


REGRESSION:  org.apache.hadoop.hive.metastore.TestSetUGIOnOnlyServer.testSynchronized

Error Message:
expected:<1> but was:<2>

Stack Trace:
junit.framework.AssertionFailedError: expected:<1> but was:<2>
	at junit.framework.Assert.fail(Assert.java:47)
	at junit.framework.Assert.failNotEquals(Assert.java:277)
	at junit.framework.Assert.assertEquals(Assert.java:64)
	at junit.framework.Assert.assertEquals(Assert.java:195)
	at junit.framework.Assert.assertEquals(Assert.java:201)
	at org.apache.hadoop.hive.metastore.TestHiveMetaStore.testSynchronized(TestHiveMetaStore.java:2088)
	at sun.reflect.NativeMethodAccessorImpl.invoke0(Native Method)
	at sun.reflect.NativeMethodAccessorImpl.invoke(NativeMethodAccessorImpl.java:39)
	at sun.reflect.DelegatingMethodAccessorImpl.invoke(DelegatingMethodAccessorImpl.java:25)
	at java.lang.reflect.Method.invoke(Method.java:597)
	at junit.framework.TestCase.runTest(TestCase.java:168)
	at junit.framework.TestCase.runBare(TestCase.java:134)
	at junit.framework.TestResult$1.protect(TestResult.java:110)
	at junit.framework.TestResult.runProtected(TestResult.java:128)
	at junit.framework.TestResult.run(TestResult.java:113)
	at junit.framework.TestCase.run(TestCase.java:124)
	at junit.framework.TestSuite.runTest(TestSuite.java:232)
	at junit.framework.TestSuite.run(TestSuite.java:227)
	at org.apache.tools.ant.taskdefs.optional.junit.JUnitTestRunner.run(JUnitTestRunner.java:518)
	at org.apache.tools.ant.taskdefs.optional.junit.JUnitTestRunner.launch(JUnitTestRunner.java:1052)
	at org.apache.tools.ant.taskdefs.optional.junit.JUnitTestRunner.main(JUnitTestRunner.java:906)


REGRESSION:  org.apache.hadoop.hive.cli.TestNegativeCliDriver.testNegativeCliDriver_script_broken_pipe1

Error Message:
Unexpected exception See build/ql/tmp/hive.log, or try "ant test ... -Dtest.silent=false" to get more logs.

Stack Trace:
junit.framework.AssertionFailedError: Unexpected exception
See build/ql/tmp/hive.log, or try "ant test ... -Dtest.silent=false" to get more logs.
	at junit.framework.Assert.fail(Assert.java:47)
	at org.apache.hadoop.hive.cli.TestNegativeCliDriver.testNegativeCliDriver_script_broken_pipe1(TestNegativeCliDriver.java:11943)
	at sun.reflect.NativeMethodAccessorImpl.invoke0(Native Method)
	at sun.reflect.NativeMethodAccessorImpl.invoke(NativeMethodAccessorImpl.java:39)
	at sun.reflect.DelegatingMethodAccessorImpl.invoke(DelegatingMethodAccessorImpl.java:25)
	at java.lang.reflect.Method.invoke(Method.java:597)
	at junit.framework.TestCase.runTest(TestCase.java:168)
	at junit.framework.TestCase.runBare(TestCase.java:134)
	at junit.framework.TestResult$1.protect(TestResult.java:110)
	at junit.framework.TestResult.runProtected(TestResult.java:128)
	at junit.framework.TestResult.run(TestResult.java:113)
	at junit.framework.TestCase.run(TestCase.java:124)
	at junit.framework.TestSuite.runTest(TestSuite.java:232)
	at junit.framework.TestSuite.run(TestSuite.java:227)
	at org.apache.tools.ant.taskdefs.optional.junit.JUnitTestRunner.run(JUnitTestRunner.java:518)
	at org.apache.tools.ant.taskdefs.optional.junit.JUnitTestRunner.launch(JUnitTestRunner.java:1052)
	at org.apache.tools.ant.taskdefs.optional.junit.JUnitTestRunner.main(JUnitTestRunner.java:906)


FAILED:  org.apache.hadoop.hive.metastore.TestMetaStoreEventListener.testListener

Error Message:
expected:<1> but was:<0>

Stack Trace:
junit.framework.AssertionFailedError: expected:<1> but was:<0>
	at junit.framework.Assert.fail(Assert.java:47)
	at junit.framework.Assert.failNotEquals(Assert.java:277)
	at junit.framework.Assert.assertEquals(Assert.java:64)
	at junit.framework.Assert.assertEquals(Assert.java:195)
	at junit.framework.Assert.assertEquals(Assert.java:201)
	at org.apache.hadoop.hive.metastore.TestMetaStoreEventListener.testListener(TestMetaStoreEventListener.java:192)
	at sun.reflect.NativeMethodAccessorImpl.invoke0(Native Method)
	at sun.reflect.NativeMethodAccessorImpl.invoke(NativeMethodAccessorImpl.java:39)
	at sun.reflect.DelegatingMethodAccessorImpl.invoke(DelegatingMethodAccessorImpl.java:25)
	at java.lang.reflect.Method.invoke(Method.java:597)
	at junit.framework.TestCase.runTest(TestCase.java:168)
	at junit.framework.TestCase.runBare(TestCase.java:134)
	at junit.framework.TestResult$1.protect(TestResult.java:110)
	at junit.framework.TestResult.runProtected(TestResult.java:128)
	at junit.framework.TestResult.run(TestResult.java:113)
	at junit.framework.TestCase.run(TestCase.java:124)
	at junit.framework.TestSuite.runTest(TestSuite.java:232)
	at junit.framework.TestSuite.run(TestSuite.java:227)
	at org.apache.tools.ant.taskdefs.optional.junit.JUnitTestRunner.run(JUnitTestRunner.java:518)
	at org.apache.tools.ant.taskdefs.optional.junit.JUnitTestRunner.launch(JUnitTestRunner.java:1052)
	at org.apache.tools.ant.taskdefs.optional.junit.JUnitTestRunner.main(JUnitTestRunner.java:906)




The Apache Jenkins build system has built Hive-trunk-h0.21 (build #1782)

Status: Still Failing

Check console output at https://builds.apache.org/job/Hive-trunk-h0.21/1782/ to view the results.