You are viewing a plain text version of this content. The canonical link for it is here.
Posted to commits@clerezza.apache.org by Apache Jenkins Server <je...@builds.apache.org> on 2020/05/17 21:16:36 UTC
Build failed in Jenkins: clerezza #1139
See <https://builds.apache.org/job/clerezza/1139/display/redirect?page=changes>
Changes:
[Hasan] [maven-release-plugin] prepare for next development iteration
------------------------------------------
Started by an SCM change
Running as SYSTEM
No JDK named ?OpenJDK 8 (on Ubuntu only) ? found
No JDK named ?OpenJDK 8 (on Ubuntu only) ? found
[EnvInject] - Loading node environment variables.
No JDK named ?OpenJDK 8 (on Ubuntu only) ? found
Building remotely on H27 (ubuntu) in workspace <https://builds.apache.org/job/clerezza/ws/>
No JDK named ?OpenJDK 8 (on Ubuntu only) ? found
No credentials specified
No JDK named ?OpenJDK 8 (on Ubuntu only) ? found
> git rev-parse --is-inside-work-tree # timeout=10
Fetching changes from the remote Git repository
> git config remote.origin.url https://gitbox.apache.org/repos/asf/clerezza.git # timeout=10
Fetching upstream changes from https://gitbox.apache.org/repos/asf/clerezza.git
> git --version # timeout=10
> git fetch --tags --progress -- https://gitbox.apache.org/repos/asf/clerezza.git +refs/heads/*:refs/remotes/origin/*
> git rev-parse refs/remotes/origin/master^{commit} # timeout=10
> git rev-parse refs/remotes/origin/origin/master^{commit} # timeout=10
No JDK named ?OpenJDK 8 (on Ubuntu only) ? found
Checking out Revision e9af3f50f0a065bfab7f2c849d3460d5d257aa7b (refs/remotes/origin/master)
> git config core.sparsecheckout # timeout=10
> git checkout -f e9af3f50f0a065bfab7f2c849d3460d5d257aa7b
Commit message: "[maven-release-plugin] prepare for next development iteration"
> git rev-list --no-walk a2c5e49c1c509672d00f55bff85c57f6b9aecdf6 # timeout=10
No JDK named ?OpenJDK 8 (on Ubuntu only) ? found
[locks-and-latches] Checking to see if we really have the locks
[locks-and-latches] Have all the locks, build can start
No JDK named ?OpenJDK 8 (on Ubuntu only) ? found
Parsing POMs
[locks-and-latches] Releasing all the locks
[locks-and-latches] All the locks released
ERROR: Failed to parse POMs
hudson.remoting.ProxyException: hudson.maven.MavenModuleSetBuild$MavenExecutionException: org.apache.maven.project.ProjectBuildingException: Some problems were encountered while processing the POMs:
[FATAL] Non-resolvable parent POM for org.apache.clerezza:clerezza-reactor:2.0.0-SNAPSHOT: Could not find artifact org.apache.clerezza:clerezza:pom:8-SNAPSHOT and 'parent.relativePath' points at wrong local POM @ line 32, column 13
at hudson.maven.MavenModuleSetBuild$PomParser.invoke(MavenModuleSetBuild.java:1390)
at hudson.maven.MavenModuleSetBuild$PomParser.invoke(MavenModuleSetBuild.java:1126)
at hudson.FilePath$FileCallableWrapper.call(FilePath.java:3052)
at hudson.remoting.UserRequest.perform(UserRequest.java:212)
at hudson.remoting.UserRequest.perform(UserRequest.java:54)
at hudson.remoting.Request$2.run(Request.java:369)
at hudson.remoting.InterceptingExecutorService$1.call(InterceptingExecutorService.java:72)
at java.util.concurrent.FutureTask.run(FutureTask.java:266)
at java.util.concurrent.ThreadPoolExecutor.runWorker(ThreadPoolExecutor.java:1149)
at java.util.concurrent.ThreadPoolExecutor$Worker.run(ThreadPoolExecutor.java:624)
at java.lang.Thread.run(Thread.java:748)
Suppressed: hudson.remoting.Channel$CallSiteStackTrace: Remote call to H27
at hudson.remoting.Channel.attachCallSiteStackTrace(Channel.java:1743)
at hudson.remoting.UserRequest$ExceptionResponse.retrieve(UserRequest.java:357)
at hudson.remoting.Channel.call(Channel.java:957)
at hudson.FilePath.act(FilePath.java:1072)
at hudson.FilePath.act(FilePath.java:1061)
at hudson.maven.MavenModuleSetBuild$MavenModuleSetBuildExecution.parsePoms(MavenModuleSetBuild.java:987)
at hudson.maven.MavenModuleSetBuild$MavenModuleSetBuildExecution.doRun(MavenModuleSetBuild.java:691)
at hudson.model.AbstractBuild$AbstractBuildExecution.run(AbstractBuild.java:504)
at hudson.model.Run.execute(Run.java:1815)
at hudson.maven.MavenModuleSetBuild.run(MavenModuleSetBuild.java:543)
at hudson.model.ResourceController.execute(ResourceController.java:97)
at hudson.model.Executor.run(Executor.java:429)
Caused by: hudson.remoting.ProxyException: org.apache.maven.project.ProjectBuildingException: Some problems were encountered while processing the POMs:
[FATAL] Non-resolvable parent POM for org.apache.clerezza:clerezza-reactor:2.0.0-SNAPSHOT: Could not find artifact org.apache.clerezza:clerezza:pom:8-SNAPSHOT and 'parent.relativePath' points at wrong local POM @ line 32, column 13
at org.apache.maven.project.DefaultProjectBuilder.build(DefaultProjectBuilder.java:383)
at hudson.maven.MavenEmbedder.buildProjects(MavenEmbedder.java:370)
at hudson.maven.MavenEmbedder.readProjects(MavenEmbedder.java:340)
at hudson.maven.MavenModuleSetBuild$PomParser.invoke(MavenModuleSetBuild.java:1329)
... 10 more
No JDK named ?OpenJDK 8 (on Ubuntu only) ? found
No JDK named ?OpenJDK 8 (on Ubuntu only) ? found
No JDK named ?OpenJDK 8 (on Ubuntu only) ? found
Jenkins build is back to normal : clerezza #1140
Posted by Apache Jenkins Server <je...@builds.apache.org>.
See <https://builds.apache.org/job/clerezza/1140/display/redirect?page=changes>