You are viewing a plain text version of this content. The canonical link for it is here.
Posted to builds@beam.apache.org by Apache Jenkins Server <je...@builds.apache.org> on 2023/10/11 20:27:39 UTC
Build failed in Jenkins: beam_PostCommit_XVR_Spark3 #3691
See <https://ci-beam.apache.org/job/beam_PostCommit_XVR_Spark3/3691/display/redirect>
Changes:
------------------------------------------
[...truncated 215.41 KB...]
> Run with --stacktrace option to get the stack trace.
> Run with --info or --debug option to get more log output.
> Get more help at https://help.gradle.org.
==============================================================================
14: Task failed with an exception.
-----------
* What went wrong:
Execution failed for task ':release:go-licenses:go:dockerRun'.
> Process 'command 'docker'' finished with non-zero exit value 1
* Try:
> Run with --stacktrace option to get the stack trace.
> Run with --info or --debug option to get more log output.
> Get more help at https://help.gradle.org.
==============================================================================
Deprecated Gradle features were used in this build, making it incompatible with Gradle 9.0.
You can use '--warning-mode all' to show the individual deprecation warnings and determine if they come from your own scripts or plugins.
For more on this, please refer to https://docs.gradle.org/8.3/userguide/command_line_interface.html#sec:command_line_warnings in the Gradle documentation.
BUILD FAILED in 2m 11s
239 actionable tasks: 162 executed, 68 from cache, 9 up-to-date
Publishing build scan...
https://ge.apache.org/s/rg6f2jo7qm45e
The remote build cache was disabled during the build due to errors.
FAILURE: Build completed with 15 failures.
1: Task failed with an exception.
-----------
* What went wrong:
Execution failed for task ':sdks:java:io:expansion-service:shadowJar'.
> Failed to load cache entry 655aae41b8f022bf90861fbace577224 for task ':sdks:java:io:expansion-service:shadowJar': Could not load from remote cache: No space left on device
* Try:
> Run with --stacktrace option to get the stack trace.
> Run with --info or --debug option to get more log output.
> Run with --scan to get full insights.
> Get more help at https://help.gradle.org.
==============================================================================
2: Task failed with an exception.
-----------
* Where:
Build file '<https://ci-beam.apache.org/job/beam_PostCommit_XVR_Spark3/ws/src/sdks/python/build.gradle'> line: 47
* What went wrong:
Execution failed for task ':sdks:python:sdist'.
> Process 'command 'sh'' finished with non-zero exit value 1
* Try:
> Run with --stacktrace option to get the stack trace.
> Run with --info or --debug option to get more log output.
> Run with --scan to get full insights.
> Get more help at https://help.gradle.org.
==============================================================================
3: Task failed with an exception.
-----------
* What went wrong:
Execution failed for task ':sdks:java:io:google-cloud-platform:expansion-service:distTar'.
> Could not add file '<https://ci-beam.apache.org/job/beam_PostCommit_XVR_Spark3/ws/src/sdks/java/extensions/schemaio-expansion-service/build/libs/beam-sdks-java-extensions-schemaio-expansion-service-2.52.0-SNAPSHOT.jar'> to TAR '<https://ci-beam.apache.org/job/beam_PostCommit_XVR_Spark3/ws/src/sdks/java/io/google-cloud-platform/expansion-service/build/distributions/expansion-service-2.52.0-SNAPSHOT.tar'.>
* Try:
> Run with --stacktrace option to get the stack trace.
> Run with --info or --debug option to get more log output.
> Run with --scan to get full insights.
> Get more help at https://help.gradle.org.
==============================================================================
4: Task failed with an exception.
-----------
* What went wrong:
Execution failed for task ':sdks:java:io:debezium:expansion-service:shadowJar'.
> Failed to store cache entry d5b42f8f020626c2a44284d43563019b for task ':sdks:java:io:debezium:expansion-service:shadowJar': No space left on device
* Try:
> Run with --stacktrace option to get the stack trace.
> Run with --info or --debug option to get more log output.
> Run with --scan to get full insights.
> Get more help at https://help.gradle.org.
==============================================================================
5: Task failed with an exception.
-----------
* What went wrong:
Execution failed for task ':sdks:java:extensions:sql:copyFmppTemplatesFromCalciteCore'.
> Could not copy zip entry /home/jenkins/.gradle/caches/modules-2/files-2.1/org.apache.beam/beam-vendor-calcite-1_28_0/0.2/b8ec320b972b575ab37767bf8d4cfadff1fe304a/beam-vendor-calcite-1_28_0-0.2.jar!codegen/templates/Parser.jj to '<https://ci-beam.apache.org/job/beam_PostCommit_XVR_Spark3/ws/src/sdks/java/extensions/sql/build/templates-fmpp/codegen/templates/Parser.jj'.>
> java.io.IOException: No space left on device
* Try:
> Run with --stacktrace option to get the stack trace.
> Run with --info or --debug option to get more log output.
> Run with --scan to get full insights.
> Get more help at https://help.gradle.org.
==============================================================================
6: Task failed with an exception.
-----------
* What went wrong:
Execution failed for task ':runners:spark:3:job-server:shadowJar'.
> Failed to store cache entry 6854f13efa7f2e9bf2af5c103cbe6c27 for task ':runners:spark:3:job-server:shadowJar': Could not pack tree 'archiveFile': java.io.IOException: No space left on device
* Try:
> Run with --stacktrace option to get the stack trace.
> Run with --info or --debug option to get more log output.
> Run with --scan to get full insights.
> Get more help at https://help.gradle.org.
==============================================================================
7: Task failed with an exception.
-----------
* What went wrong:
Execution failed for task ':sdks:java:io:google-cloud-platform:expansion-service:distZip'.
> Could not add file '<https://ci-beam.apache.org/job/beam_PostCommit_XVR_Spark3/ws/src/sdks/java/extensions/schemaio-expansion-service/build/libs/beam-sdks-java-extensions-schemaio-expansion-service-2.52.0-SNAPSHOT.jar'> to ZIP '<https://ci-beam.apache.org/job/beam_PostCommit_XVR_Spark3/ws/src/sdks/java/io/google-cloud-platform/expansion-service/build/distributions/expansion-service-2.52.0-SNAPSHOT.zip'.>
* Try:
> Run with --stacktrace option to get the stack trace.
> Run with --info or --debug option to get more log output.
> Run with --scan to get full insights.
> Get more help at https://help.gradle.org.
==============================================================================
8: Task failed with an exception.
-----------
* What went wrong:
Execution failed for task ':sdks:java:io:google-cloud-platform:expansion-service:shadowJar'.
> Failed to store cache entry 9e5a320d9fc521a8cd24c8c6bdf6a495 for task ':sdks:java:io:google-cloud-platform:expansion-service:shadowJar': No space left on device
* Try:
> Run with --stacktrace option to get the stack trace.
> Run with --info or --debug option to get more log output.
> Run with --scan to get full insights.
> Get more help at https://help.gradle.org.
==============================================================================
9: Task failed with an exception.
-----------
* What went wrong:
Execution failed for task ':sdks:java:io:google-cloud-platform:expansion-service:analyzeClassesDependencies'.
> Could not resolve all dependencies for configuration ':sdks:java:io:google-cloud-platform:expansion-service:permitUnusedDeclared'.
> Problems writing to Binary store in /home/jenkins/.gradle/.tmp/gradle971722107512938567.bin (exist: true)
* Try:
> Run with --stacktrace option to get the stack trace.
> Run with --info or --debug option to get more log output.
> Run with --scan to get full insights.
> Get more help at https://help.gradle.org.
==============================================================================
10: Task failed with an exception.
-----------
* What went wrong:
Execution failed for task ':sdks:java:io:google-cloud-platform:expansion-service:spotlessJava'.
> Failed to load cache entry d638cb170357d0be187d8a5b9fc10e9d for task ':sdks:java:io:google-cloud-platform:expansion-service:spotlessJava': Could not load from local cache: Couldn't create directory: <https://ci-beam.apache.org/job/beam_PostCommit_XVR_Spark3/ws/src/sdks/java/io/google-cloud-platform/expansion-service/build/spotless/spotlessJava>
* Try:
> Run with --stacktrace option to get the stack trace.
> Run with --info or --debug option to get more log output.
> Run with --scan to get full insights.
> Get more help at https://help.gradle.org.
==============================================================================
11: Task failed with an exception.
-----------
* What went wrong:
Execution failed for task ':sdks:java:extensions:sql:udf:compileJava'.
> Compilation failed; see the compiler error output for details.
* Try:
> Run with --info option to get more log output.
> Run with --scan to get full insights.
==============================================================================
12: Task failed with an exception.
-----------
* What went wrong:
Execution failed for task ':sdks:java:io:mongodb:compileJava'.
> Compilation failed; see the compiler error output for details.
* Try:
> Run with --info option to get more log output.
> Run with --scan to get full insights.
==============================================================================
13: Task failed with an exception.
-----------
* What went wrong:
Execution failed for task ':release:go-licenses:py:dockerRun'.
> Process 'command 'docker'' finished with non-zero exit value 1
* Try:
> Run with --stacktrace option to get the stack trace.
> Run with --info or --debug option to get more log output.
> Run with --scan to get full insights.
> Get more help at https://help.gradle.org.
==============================================================================
14: Task failed with an exception.
-----------
* What went wrong:
Execution failed for task ':release:go-licenses:go:dockerRun'.
> Process 'command 'docker'' finished with non-zero exit value 1
* Try:
> Run with --stacktrace option to get the stack trace.
> Run with --info or --debug option to get more log output.
> Run with --scan to get full insights.
> Get more help at https://help.gradle.org.
==============================================================================
15: Task failed with an exception.
-----------
* What went wrong:
Could not add entry ':sdks:java:extensions:sql:udf:compileJava' to cache executionHistory.bin (<https://ci-beam.apache.org/job/beam_PostCommit_XVR_Spark3/ws/src/.gradle/8.3/executionHistory/executionHistory.bin).>
> java.io.IOException: No space left on device
* Try:
> Run with --stacktrace option to get the stack trace.
> Run with --info or --debug option to get more log output.
> Run with --scan to get full insights.
> Get more help at https://help.gradle.org.
==============================================================================
Deprecated Gradle features were used in this build, making it incompatible with Gradle 9.0.
You can use '--warning-mode all' to show the individual deprecation warnings and determine if they come from your own scripts or plugins.
For more on this, please refer to https://docs.gradle.org/8.3/userguide/command_line_interface.html#sec:command_line_warnings in the Gradle documentation.
BUILD FAILED in 2m 12s
FAILURE: Build failed with an exception.
* What went wrong:
Could not receive a message from the daemon.
* Try:
> Run with --stacktrace option to get the stack trace.
> Run with --info or --debug option to get more log output.
> Run with --scan to get full insights.
> Get more help at https://help.gradle.org.
Build step 'Invoke Gradle script' changed build result to FAILURE
Build step 'Invoke Gradle script' marked build as failure
---------------------------------------------------------------------
To unsubscribe, e-mail: builds-unsubscribe@beam.apache.org
For additional commands, e-mail: builds-help@beam.apache.org
Jenkins build is back to normal : beam_PostCommit_XVR_Spark3 #3693
Posted by Apache Jenkins Server <je...@builds.apache.org>.
See <https://ci-beam.apache.org/job/beam_PostCommit_XVR_Spark3/3693/display/redirect?page=changes>
---------------------------------------------------------------------
To unsubscribe, e-mail: builds-unsubscribe@beam.apache.org
For additional commands, e-mail: builds-help@beam.apache.org
Build failed in Jenkins: beam_PostCommit_XVR_Spark3 #3692
Posted by Apache Jenkins Server <je...@builds.apache.org>.
See <https://ci-beam.apache.org/job/beam_PostCommit_XVR_Spark3/3692/display/redirect>
Changes:
------------------------------------------
[...truncated 1.76 MB...]
timeout func_only: False
----------------------------- live log collection ------------------------------
WARNING apache_beam.runners.interactive.interactive_environment:interactive_environment.py:189 Dependencies required for Interactive Beam PCollection visualization are not available, please use: `pip install apache-beam[interactive]` to install necessary dependencies to enable all data visualization features.
WARNING apache_beam.runners.interactive.interactive_environment:interactive_environment.py:198 You cannot use Interactive Beam features when you are not in an interactive environment such as a Jupyter notebook or ipython terminal.
WARNING root:avroio_test.py:54 python-snappy is not installed; some tests will be skipped.
WARNING root:tfrecordio_test.py:55 Tensorflow is not installed, so skipping some tests.
collected 7102 items / 9 errors / 7102 deselected / 18 skipped / 0 selected
Traceback (most recent call last):
File "<https://ci-beam.apache.org/job/beam_PostCommit_XVR_Spark3/ws/src/build/gradleenv/1922375555/lib/python3.11/site-packages/_pytest/junitxml.py",> line 683, in pytest_sessionfinish
!!!!!!!!!!!!!!!!!!! Interrupted: 9 errors during collection !!!!!!!!!!!!!!!!!!!!
logfile.write(ET.tostring(testsuites, encoding="unicode"))
OSError: [Errno 28] No space left on device
During handling of the above exception, another exception occurred:
OSError: [Errno 28] No space left on device
During handling of the above exception, another exception occurred:
Traceback (most recent call last):
File "<https://ci-beam.apache.org/job/beam_PostCommit_XVR_Spark3/ws/src/build/gradleenv/1922375555/bin/pytest",> line 8, in <module>
sys.exit(console_main())
^^^^^^^^^^^^^^
File "<https://ci-beam.apache.org/job/beam_PostCommit_XVR_Spark3/ws/src/build/gradleenv/1922375555/lib/python3.11/site-packages/_pytest/config/__init__.py",> line 192, in console_main
code = main()
^^^^^^
File "<https://ci-beam.apache.org/job/beam_PostCommit_XVR_Spark3/ws/src/build/gradleenv/1922375555/lib/python3.11/site-packages/_pytest/config/__init__.py",> line 169, in main
ret: Union[ExitCode, int] = config.hook.pytest_cmdline_main(
^^^^^^^^^^^^^^^^^^^^^^^^^^^^^^^^
File "<https://ci-beam.apache.org/job/beam_PostCommit_XVR_Spark3/ws/src/build/gradleenv/1922375555/lib/python3.11/site-packages/pluggy/_hooks.py",> line 493, in __call__
return self._hookexec(self.name, self._hookimpls, kwargs, firstresult)
^^^^^^^^^^^^^^^^^^^^^^^^^^^^^^^^^^^^^^^^^^^^^^^^^^^^^^^^^^^^^^^
File "<https://ci-beam.apache.org/job/beam_PostCommit_XVR_Spark3/ws/src/build/gradleenv/1922375555/lib/python3.11/site-packages/pluggy/_manager.py",> line 115, in _hookexec
return self._inner_hookexec(hook_name, methods, kwargs, firstresult)
^^^^^^^^^^^^^^^^^^^^^^^^^^^^^^^^^^^^^^^^^^^^^^^^^^^^^^^^^^^^^
File "<https://ci-beam.apache.org/job/beam_PostCommit_XVR_Spark3/ws/src/build/gradleenv/1922375555/lib/python3.11/site-packages/pluggy/_callers.py",> line 113, in _multicall
raise exception.with_traceback(exception.__traceback__)
File "<https://ci-beam.apache.org/job/beam_PostCommit_XVR_Spark3/ws/src/build/gradleenv/1922375555/lib/python3.11/site-packages/pluggy/_callers.py",> line 77, in _multicall
res = hook_impl.function(*args)
^^^^^^^^^^^^^^^^^^^^^^^^^
File "<https://ci-beam.apache.org/job/beam_PostCommit_XVR_Spark3/ws/src/build/gradleenv/1922375555/lib/python3.11/site-packages/_pytest/main.py",> line 318, in pytest_cmdline_main
return wrap_session(config, _main)
^^^^^^^^^^^^^^^^^^^^^^^^^^^
File "<https://ci-beam.apache.org/job/beam_PostCommit_XVR_Spark3/ws/src/build/gradleenv/1922375555/lib/python3.11/site-packages/_pytest/main.py",> line 306, in wrap_session
config.hook.pytest_sessionfinish(
File "<https://ci-beam.apache.org/job/beam_PostCommit_XVR_Spark3/ws/src/build/gradleenv/1922375555/lib/python3.11/site-packages/pluggy/_hooks.py",> line 493, in __call__
return self._hookexec(self.name, self._hookimpls, kwargs, firstresult)
^^^^^^^^^^^^^^^^^^^^^^^^^^^^^^^^^^^^^^^^^^^^^^^^^^^^^^^^^^^^^^^
File "<https://ci-beam.apache.org/job/beam_PostCommit_XVR_Spark3/ws/src/build/gradleenv/1922375555/lib/python3.11/site-packages/pluggy/_manager.py",> line 115, in _hookexec
return self._inner_hookexec(hook_name, methods, kwargs, firstresult)
^^^^^^^^^^^^^^^^^^^^^^^^^^^^^^^^^^^^^^^^^^^^^^^^^^^^^^^^^^^^^
File "<https://ci-beam.apache.org/job/beam_PostCommit_XVR_Spark3/ws/src/build/gradleenv/1922375555/lib/python3.11/site-packages/pluggy/_callers.py",> line 130, in _multicall
teardown[0].send(outcome)
File "<https://ci-beam.apache.org/job/beam_PostCommit_XVR_Spark3/ws/src/build/gradleenv/1922375555/lib/python3.11/site-packages/_pytest/terminal.py",> line 857, in pytest_sessionfinish
outcome.get_result()
File "<https://ci-beam.apache.org/job/beam_PostCommit_XVR_Spark3/ws/src/build/gradleenv/1922375555/lib/python3.11/site-packages/pluggy/_result.py",> line 114, in get_result
raise exc.with_traceback(exc.__traceback__)
File "<https://ci-beam.apache.org/job/beam_PostCommit_XVR_Spark3/ws/src/build/gradleenv/1922375555/lib/python3.11/site-packages/pluggy/_callers.py",> line 77, in _multicall
res = hook_impl.function(*args)
^^^^^^^^^^^^^^^^^^^^^^^^^
File "<https://ci-beam.apache.org/job/beam_PostCommit_XVR_Spark3/ws/src/build/gradleenv/1922375555/lib/python3.11/site-packages/_pytest/junitxml.py",> line 652, in pytest_sessionfinish
with open(self.logfile, "w", encoding="utf-8") as logfile:
OSError: [Errno 28] No space left on device
> Task :runners:spark:3:job-server:validatesCrossLanguageRunnerPythonUsingSql FAILED
> Task :runners:spark:3:job-server:sparkJobServerCleanup
<https://ci-beam.apache.org/job/beam_PostCommit_XVR_Spark3/ws/src/sdks/python/scripts/run_job_server.sh>: line 19: cannot create temp file for here-document: No space left on device
Stopping job server pid: 2421368.
> Task :runners:spark:3:job-server:validatesCrossLanguageRunnerCleanup
<https://ci-beam.apache.org/job/beam_PostCommit_XVR_Spark3/ws/src/sdks/python/scripts/run_expansion_services.sh>: line 19: cannot create temp file for here-document: No space left on device
Stopping expansion service pid: 2428090.
Stopping expansion service pid: 2428091.
FAILURE: Build completed with 3 failures.
1: Task failed with an exception.
-----------
* What went wrong:
Execution failed for task ':runners:spark:3:job-server:validatesCrossLanguageRunnerJavaUsingPython'.
> There were failing tests. See the report at: file://<https://ci-beam.apache.org/job/beam_PostCommit_XVR_Spark3/ws/src/runners/spark/3/job-server/build/reports/tests/validatesCrossLanguageRunnerJavaUsingPython/index.html>
==============================================================================
2: Task failed with an exception.
-----------
* What went wrong:
Execution failed for task ':runners:spark:3:job-server:validatesCrossLanguageRunnerPythonUsingJava'.
> Process 'command 'sh'' finished with non-zero exit value 2
* Try:
> Run with --stacktrace option to get the stack trace.
> Run with --info or --debug option to get more log output.
> Get more help at https://help.gradle.org.
==============================================================================
3: Task failed with an exception.
-----------
* What went wrong:
Execution failed for task ':runners:spark:3:job-server:validatesCrossLanguageRunnerPythonUsingSql'.
> Process 'command 'sh'' finished with non-zero exit value 1
* Try:
> Run with --stacktrace option to get the stack trace.
> Run with --info or --debug option to get more log output.
> Get more help at https://help.gradle.org.
==============================================================================
Deprecated Gradle features were used in this build, making it incompatible with Gradle 9.0.
You can use '--warning-mode all' to show the individual deprecation warnings and determine if they come from your own scripts or plugins.
For more on this, please refer to https://docs.gradle.org/8.3/userguide/command_line_interface.html#sec:command_line_warnings in the Gradle documentation.
BUILD FAILED in 30m 16s
182 actionable tasks: 26 executed, 156 up-to-date
A build scan cannot be produced as an error occurred gathering build data.
Please report this problem via https://gradle.com/help/plugin and include the following via copy/paste:
----------
Gradle version: 8.3
Plugin version: 3.13.2
java.lang.RuntimeException: Could not serialize event class 'com.gradle.scan.agent.serialization.scan.a.b'.
at com.gradle.scan.plugin.internal.h.c.c.a(SourceFile:112)
at com.gradle.scan.plugin.internal.h.a.a(SourceFile:42)
at com.gradle.scan.plugin.internal.h.a.b(SourceFile:34)
at com.gradle.scan.plugin.internal.c.c.a(SourceFile:46)
at com.gradle.scan.plugin.internal.p.d.a(SourceFile:55)
at com.gradle.scan.plugin.internal.r.a.b(SourceFile:111)
at com.gradle.scan.plugin.internal.p.d.a(SourceFile:54)
at com.gradle.scan.plugin.internal.p.b.a(SourceFile:23)
at org.gradle.internal.enterprise.impl.DefaultGradleEnterprisePluginAdapter.buildFinished(DefaultGradleEnterprisePluginAdapter.java:79)
at org.gradle.internal.enterprise.core.GradleEnterprisePluginManager.buildFinished(GradleEnterprisePluginManager.java:76)
at org.gradle.launcher.exec.BuildCompletionNotifyingBuildActionRunner.notifyEnterprisePluginManager(BuildCompletionNotifyingBuildActionRunner.java:53)
at org.gradle.launcher.exec.BuildCompletionNotifyingBuildActionRunner.run(BuildCompletionNotifyingBuildActionRunner.java:48)
at org.gradle.launcher.exec.RootBuildLifecycleBuildActionExecutor.lambda$execute$0(RootBuildLifecycleBuildActionExecutor.java:40)
at org.gradle.composite.internal.DefaultRootBuildState.run(DefaultRootBuildState.java:123)
at org.gradle.launcher.exec.RootBuildLifecycleBuildActionExecutor.execute(RootBuildLifecycleBuildActionExecutor.java:40)
at org.gradle.internal.buildtree.InitDeprecationLoggingActionExecutor.execute(InitDeprecationLoggingActionExecutor.java:58)
at org.gradle.internal.buildtree.DefaultBuildTreeContext.execute(DefaultBuildTreeContext.java:40)
at org.gradle.launcher.exec.BuildTreeLifecycleBuildActionExecutor.lambda$execute$0(BuildTreeLifecycleBuildActionExecutor.java:65)
at org.gradle.internal.buildtree.BuildTreeState.run(BuildTreeState.java:58)
at org.gradle.launcher.exec.BuildTreeLifecycleBuildActionExecutor.execute(BuildTreeLifecycleBuildActionExecutor.java:65)
at org.gradle.launcher.exec.RunAsBuildOperationBuildActionExecutor$3.call(RunAsBuildOperationBuildActionExecutor.java:61)
at org.gradle.launcher.exec.RunAsBuildOperationBuildActionExecutor$3.call(RunAsBuildOperationBuildActionExecutor.java:57)
at org.gradle.internal.operations.DefaultBuildOperationRunner$CallableBuildOperationWorker.execute(DefaultBuildOperationRunner.java:204)
at org.gradle.internal.operations.DefaultBuildOperationRunner$CallableBuildOperationWorker.execute(DefaultBuildOperationRunner.java:199)
at org.gradle.internal.operations.DefaultBuildOperationRunner$2.execute(DefaultBuildOperationRunner.java:66)
at org.gradle.internal.operations.DefaultBuildOperationRunner$2.execute(DefaultBuildOperationRunner.java:59)
at org.gradle.internal.operations.DefaultBuildOperationRunner.execute(DefaultBuildOperationRunner.java:157)
at org.gradle.internal.operations.DefaultBuildOperationRunner.execute(DefaultBuildOperationRunner.java:59)
at org.gradle.internal.operations.DefaultBuildOperationRunner.call(DefaultBuildOperationRunner.java:53)
at org.gradle.internal.operations.DefaultBuildOperationExecutor.call(DefaultBuildOperationExecutor.java:73)
at org.gradle.launcher.exec.RunAsBuildOperationBuildActionExecutor.execute(RunAsBuildOperationBuildActionExecutor.java:57)
at org.gradle.launcher.exec.RunAsWorkerThreadBuildActionExecutor.lambda$execute$0(RunAsWorkerThreadBuildActionExecutor.java:36)
at org.gradle.internal.work.DefaultWorkerLeaseService.withLocks(DefaultWorkerLeaseService.java:264)
at org.gradle.internal.work.DefaultWorkerLeaseService.runAsWorkerThread(DefaultWorkerLeaseService.java:128)
at org.gradle.launcher.exec.RunAsWorkerThreadBuildActionExecutor.execute(RunAsWorkerThreadBuildActionExecutor.java:36)
at org.gradle.tooling.internal.provider.continuous.ContinuousBuildActionExecutor.execute(ContinuousBuildActionExecutor.java:110)
at org.gradle.tooling.internal.provider.SubscribableBuildActionExecutor.execute(SubscribableBuildActionExecutor.java:64)
at org.gradle.internal.session.DefaultBuildSessionContext.execute(DefaultBuildSessionContext.java:46)
at org.gradle.tooling.internal.provider.BuildSessionLifecycleBuildActionExecuter$ActionImpl.apply(BuildSessionLifecycleBuildActionExecuter.java:92)
at org.gradle.tooling.internal.provider.BuildSessionLifecycleBuildActionExecuter$ActionImpl.apply(BuildSessionLifecycleBuildActionExecuter.java:80)
at org.gradle.internal.session.BuildSessionState.run(BuildSessionState.java:69)
at org.gradle.tooling.internal.provider.BuildSessionLifecycleBuildActionExecuter.execute(BuildSessionLifecycleBuildActionExecuter.java:62)
at org.gradle.tooling.internal.provider.BuildSessionLifecycleBuildActionExecuter.execute(BuildSessionLifecycleBuildActionExecuter.java:41)
at org.gradle.tooling.internal.provider.StartParamsValidatingActionExecuter.execute(StartParamsValidatingActionExecuter.java:64)
at org.gradle.tooling.internal.provider.StartParamsValidatingActionExecuter.execute(StartParamsValidatingActionExecuter.java:32)
at org.gradle.tooling.internal.provider.SessionFailureReportingActionExecuter.execute(SessionFailureReportingActionExecuter.java:51)
at org.gradle.tooling.internal.provider.SessionFailureReportingActionExecuter.execute(SessionFailureReportingActionExecuter.java:39)
at org.gradle.tooling.internal.provider.SetupLoggingActionExecuter.execute(SetupLoggingActionExecuter.java:47)
at org.gradle.tooling.internal.provider.SetupLoggingActionExecuter.execute(SetupLoggingActionExecuter.java:31)
at org.gradle.launcher.daemon.server.exec.ExecuteBuild.doBuild(ExecuteBuild.java:65)
at org.gradle.launcher.daemon.server.exec.BuildCommandOnly.execute(BuildCommandOnly.java:37)
at org.gradle.launcher.daemon.server.api.DaemonCommandExecution.proceed(DaemonCommandExecution.java:104)
at org.gradle.launcher.daemon.server.exec.WatchForDisconnection.execute(WatchForDisconnection.java:39)
at org.gradle.launcher.daemon.server.api.DaemonCommandExecution.proceed(DaemonCommandExecution.java:104)
at org.gradle.launcher.daemon.server.exec.ResetDeprecationLogger.execute(ResetDeprecationLogger.java:29)
at org.gradle.launcher.daemon.server.api.DaemonCommandExecution.proceed(DaemonCommandExecution.java:104)
at org.gradle.launcher.daemon.server.exec.RequestStopIfSingleUsedDaemon.execute(RequestStopIfSingleUsedDaemon.java:35)
at org.gradle.launcher.daemon.server.api.DaemonCommandExecution.proceed(DaemonCommandExecution.java:104)
at org.gradle.launcher.daemon.server.exec.ForwardClientInput$2.create(ForwardClientInput.java:78)
at org.gradle.launcher.daemon.server.exec.ForwardClientInput$2.create(ForwardClientInput.java:75)
at org.gradle.util.internal.Swapper.swap(Swapper.java:38)
at org.gradle.launcher.daemon.server.exec.ForwardClientInput.execute(ForwardClientInput.java:75)
at org.gradle.launcher.daemon.server.api.DaemonCommandExecution.proceed(DaemonCommandExecution.java:104)
at org.gradle.launcher.daemon.server.exec.LogAndCheckHealth.execute(LogAndCheckHealth.java:53)
at org.gradle.launcher.daemon.server.api.DaemonCommandExecution.proceed(DaemonCommandExecution.java:104)
at org.gradle.launcher.daemon.server.exec.LogToClient.doBuild(LogToClient.java:63)
at org.gradle.launcher.daemon.server.exec.BuildCommandOnly.execute(BuildCommandOnly.java:37)
at org.gradle.launcher.daemon.server.api.DaemonCommandExecution.proceed(DaemonCommandExecution.java:104)
at org.gradle.launcher.daemon.server.exec.EstablishBuildEnvironment.doBuild(EstablishBuildEnvironment.java:84)
at org.gradle.launcher.daemon.server.exec.BuildCommandOnly.execute(BuildCommandOnly.java:37)
at org.gradle.launcher.daemon.server.api.DaemonCommandExecution.proceed(DaemonCommandExecution.java:104)
at org.gradle.launcher.daemon.server.exec.StartBuildOrRespondWithBusy$1.run(StartBuildOrRespondWithBusy.java:52)
at org.gradle.launcher.daemon.server.DaemonStateCoordinator$1.run(DaemonStateCoordinator.java:297)
at org.gradle.internal.concurrent.ExecutorPolicy$CatchAndRecordFailures.onExecute(ExecutorPolicy.java:64)
at org.gradle.internal.concurrent.AbstractManagedExecutor$1.run(AbstractManagedExecutor.java:47)
Caused by: java.lang.RuntimeException: java.io.IOException: No space left on device
at com.gradle.scan.agent.serialization.scan.serializer.d.flush(SourceFile:245)
at com.gradle.scan.agent.serialization.scan.serializer.d.a(SourceFile:211)
at com.gradle.scan.agent.serialization.scan.serializer.d.a(SourceFile:338)
at com.gradle.scan.agent.serialization.scan.serializer.c.a(SourceFile:118)
at com.gradle.scan.agent.serialization.scan.serializer.c.a(SourceFile:106)
at com.gradle.scan.agent.serialization.scan.serializer.c.a(SourceFile:75)
at com.gradle.scan.plugin.internal.h.c.c.a(SourceFile:110)
... 74 more
Caused by: java.io.IOException: No space left on device
at com.gradle.scan.agent.serialization.scan.serializer.d.flush(SourceFile:243)
... 80 more
----------
FAILURE: Build failed with an exception.
* What went wrong:
Failed to notify root build lifecycle listener.
> Could not update /home/jenkins/.gradle/caches/8.3/file-changes/last-build.bin
> Could not update <https://ci-beam.apache.org/job/beam_PostCommit_XVR_Spark3/ws/src/.gradle/8.3/fileChanges/last-build.bin>
* Try:
> Run with --stacktrace option to get the stack trace.
> Run with --info or --debug option to get more log output.
> Run with --scan to get full insights.
> Get more help at https://help.gradle.org.
Deprecated Gradle features were used in this build, making it incompatible with Gradle 9.0.
You can use '--warning-mode all' to show the individual deprecation warnings and determine if they come from your own scripts or plugins.
For more on this, please refer to https://docs.gradle.org/8.3/userguide/command_line_interface.html#sec:command_line_warnings in the Gradle documentation.
BUILD FAILED in 30m 16s
FAILURE: Build failed with an exception.
* What went wrong:
Could not receive a message from the daemon.
* Try:
> Run with --stacktrace option to get the stack trace.
> Run with --info or --debug option to get more log output.
> Run with --scan to get full insights.
> Get more help at https://help.gradle.org.
Build step 'Invoke Gradle script' changed build result to FAILURE
Build step 'Invoke Gradle script' marked build as failure
---------------------------------------------------------------------
To unsubscribe, e-mail: builds-unsubscribe@beam.apache.org
For additional commands, e-mail: builds-help@beam.apache.org