You are viewing a plain text version of this content. The canonical link for it is here.
Posted to dev@nutch.apache.org by Apache Jenkins Server <je...@builds.apache.org> on 2013/01/11 05:29:12 UTC
Build failed in Jenkins: Nutch-2.x-Windows #4
See <https://builds.apache.org/job/Nutch-2.x-Windows/4/>
------------------------------------------
[...truncated 2988 lines...]
jar:
[jar] Building jar: <https://builds.apache.org/job/Nutch-2.x-Windows/ws/2.x\build\urlfilter-validator\urlfilter-validator.jar>
deps-test:
deploy:
[copy] Copying 1 file to <https://builds.apache.org/job/Nutch-2.x-Windows/ws/2.x\build\plugins\urlfilter-validator>
copy-generated-lib:
[copy] Copying 1 file to <https://builds.apache.org/job/Nutch-2.x-Windows/ws/2.x\build\plugins\urlfilter-validator>
init:
[mkdir] Created dir: <https://builds.apache.org/job/Nutch-2.x-Windows/ws/2.x\build\urlnormalizer-basic>
[mkdir] Created dir: <https://builds.apache.org/job/Nutch-2.x-Windows/ws/2.x\build\urlnormalizer-basic\classes>
[mkdir] Created dir: <https://builds.apache.org/job/Nutch-2.x-Windows/ws/2.x\build\urlnormalizer-basic\test>
[mkdir] Created dir: <https://builds.apache.org/job/Nutch-2.x-Windows/ws/2.x\build\plugins\urlnormalizer-basic>
init-plugin:
deps-jar:
clean-lib:
resolve-default:
[ivy:resolve] :: loading settings :: file = <https://builds.apache.org/job/Nutch-2.x-Windows/ws/2.x\ivy\ivysettings.xml>
compile:
[echo] Compiling plugin: urlnormalizer-basic
[javac] <https://builds.apache.org/job/Nutch-2.x-Windows/ws/2.x\src\plugin\build-plugin.xml>:117: warning: 'includeantruntime' was not set, defaulting to build.sysclasspath=last; set to false for repeatable builds
[javac] Compiling 1 source file to <https://builds.apache.org/job/Nutch-2.x-Windows/ws/2.x\build\urlnormalizer-basic\classes>
[javac] warning: [options] bootstrap class path not set in conjunction with -source 1.6
[javac] 1 warning
jar:
[jar] Building jar: <https://builds.apache.org/job/Nutch-2.x-Windows/ws/2.x\build\urlnormalizer-basic\urlnormalizer-basic.jar>
deps-test:
deploy:
[copy] Copying 1 file to <https://builds.apache.org/job/Nutch-2.x-Windows/ws/2.x\build\plugins\urlnormalizer-basic>
copy-generated-lib:
[copy] Copying 1 file to <https://builds.apache.org/job/Nutch-2.x-Windows/ws/2.x\build\plugins\urlnormalizer-basic>
init:
[mkdir] Created dir: <https://builds.apache.org/job/Nutch-2.x-Windows/ws/2.x\build\urlnormalizer-pass>
[mkdir] Created dir: <https://builds.apache.org/job/Nutch-2.x-Windows/ws/2.x\build\urlnormalizer-pass\classes>
[mkdir] Created dir: <https://builds.apache.org/job/Nutch-2.x-Windows/ws/2.x\build\urlnormalizer-pass\test>
[mkdir] Created dir: <https://builds.apache.org/job/Nutch-2.x-Windows/ws/2.x\build\plugins\urlnormalizer-pass>
init-plugin:
deps-jar:
clean-lib:
resolve-default:
[ivy:resolve] :: loading settings :: file = <https://builds.apache.org/job/Nutch-2.x-Windows/ws/2.x\ivy\ivysettings.xml>
compile:
[echo] Compiling plugin: urlnormalizer-pass
[javac] <https://builds.apache.org/job/Nutch-2.x-Windows/ws/2.x\src\plugin\build-plugin.xml>:117: warning: 'includeantruntime' was not set, defaulting to build.sysclasspath=last; set to false for repeatable builds
[javac] Compiling 1 source file to <https://builds.apache.org/job/Nutch-2.x-Windows/ws/2.x\build\urlnormalizer-pass\classes>
[javac] warning: [options] bootstrap class path not set in conjunction with -source 1.6
[javac] 1 warning
jar:
[jar] Building jar: <https://builds.apache.org/job/Nutch-2.x-Windows/ws/2.x\build\urlnormalizer-pass\urlnormalizer-pass.jar>
deps-test:
deploy:
[copy] Copying 1 file to <https://builds.apache.org/job/Nutch-2.x-Windows/ws/2.x\build\plugins\urlnormalizer-pass>
copy-generated-lib:
[copy] Copying 1 file to <https://builds.apache.org/job/Nutch-2.x-Windows/ws/2.x\build\plugins\urlnormalizer-pass>
[mkdir] Created dir: <https://builds.apache.org/job/Nutch-2.x-Windows/ws/2.x\build\urlnormalizer-regex\test\data>
[copy] Copying 4 files to <https://builds.apache.org/job/Nutch-2.x-Windows/ws/2.x\build\urlnormalizer-regex\test\data>
init:
[mkdir] Created dir: <https://builds.apache.org/job/Nutch-2.x-Windows/ws/2.x\build\urlnormalizer-regex\classes>
[mkdir] Created dir: <https://builds.apache.org/job/Nutch-2.x-Windows/ws/2.x\build\plugins\urlnormalizer-regex>
init-plugin:
deps-jar:
clean-lib:
resolve-default:
[ivy:resolve] :: loading settings :: file = <https://builds.apache.org/job/Nutch-2.x-Windows/ws/2.x\ivy\ivysettings.xml>
compile:
[echo] Compiling plugin: urlnormalizer-regex
[javac] <https://builds.apache.org/job/Nutch-2.x-Windows/ws/2.x\src\plugin\build-plugin.xml>:117: warning: 'includeantruntime' was not set, defaulting to build.sysclasspath=last; set to false for repeatable builds
[javac] Compiling 1 source file to <https://builds.apache.org/job/Nutch-2.x-Windows/ws/2.x\build\urlnormalizer-regex\classes>
[javac] warning: [options] bootstrap class path not set in conjunction with -source 1.6
[javac] 1 warning
jar:
[jar] Building jar: <https://builds.apache.org/job/Nutch-2.x-Windows/ws/2.x\build\urlnormalizer-regex\urlnormalizer-regex.jar>
deps-test:
init:
init-plugin:
clean-lib:
resolve-default:
[ivy:resolve] :: loading settings :: file = <https://builds.apache.org/job/Nutch-2.x-Windows/ws/2.x\ivy\ivysettings.xml>
compile:
jar:
deps-test:
deploy:
copy-generated-lib:
deploy:
[copy] Copying 1 file to <https://builds.apache.org/job/Nutch-2.x-Windows/ws/2.x\build\plugins\urlnormalizer-regex>
copy-generated-lib:
[copy] Copying 1 file to <https://builds.apache.org/job/Nutch-2.x-Windows/ws/2.x\build\plugins\urlnormalizer-regex>
compile:
job:
[jar] Building jar: <https://builds.apache.org/job/Nutch-2.x-Windows/ws/2.x\build\apache-nutch-2.2-SNAPSHOT.job>
resolve-test:
[taskdef] Could not load definitions from resource org/sonar/ant/antlib.xml. It could not be found.
copy-libs:
compile-core-test:
[javac] <https://builds.apache.org/job/Nutch-2.x-Windows/ws/2.x\build.xml>:334: warning: 'includeantruntime' was not set, defaulting to build.sysclasspath=last; set to false for repeatable builds
[javac] Compiling 33 source files to <https://builds.apache.org/job/Nutch-2.x-Windows/ws/2.x\build\test\classes>
[javac] warning: [path] bad path element "<https://builds.apache.org/job/Nutch-2.x-Windows/ws/2.x\build\lib\jaxb-api.jar">: no such file or directory
[javac] warning: [path] bad path element "<https://builds.apache.org/job/Nutch-2.x-Windows/ws/2.x\build\lib\activation.jar">: no such file or directory
[javac] warning: [path] bad path element "<https://builds.apache.org/job/Nutch-2.x-Windows/ws/2.x\build\lib\jsr173_1.0_api.jar">: no such file or directory
[javac] warning: [path] bad path element "<https://builds.apache.org/job/Nutch-2.x-Windows/ws/2.x\build\lib\jaxb1-impl.jar">: no such file or directory
[javac] warning: [path] Unexpected extension for archive file: <https://builds.apache.org/job/Nutch-2.x-Windows/ws/2.x\build\apache-nutch-2.2-SNAPSHOT.job>
[javac] warning: [options] bootstrap class path not set in conjunction with -source 1.6
[javac] <https://builds.apache.org/job/Nutch-2.x-Windows/ws/2.x\src\test\org\apache\nutch\parse\TestParserFactory.java>:52: warning: [cast] redundant cast to Extension
[javac] Extension ext = (Extension)parserFactory.getExtensions("text/html").get(0);
[javac] ^
[javac] <https://builds.apache.org/job/Nutch-2.x-Windows/ws/2.x\src\test\org\apache\nutch\parse\TestParserFactory.java>:54: warning: [cast] redundant cast to Extension
[javac] ext = (Extension) parserFactory.getExtensions("text/html; charset=ISO-8859-1").get(0);
[javac] ^
[javac] <https://builds.apache.org/job/Nutch-2.x-Windows/ws/2.x\src\test\org\apache\nutch\parse\TestParserFactory.java>:56: warning: [cast] redundant cast to Extension
[javac] ext = (Extension)parserFactory.getExtensions("foo/bar").get(0);
[javac] ^
[javac] <https://builds.apache.org/job/Nutch-2.x-Windows/ws/2.x\src\test\org\apache\nutch\plugin\TestPluginSystem.java>:45: warning: [rawtypes] found raw type: LinkedList
[javac] private LinkedList fFolders = new LinkedList();
[javac] ^
[javac] missing type arguments for generic class LinkedList<E>
[javac] where E is a type-variable:
[javac] E extends Object declared in class LinkedList
[javac] <https://builds.apache.org/job/Nutch-2.x-Windows/ws/2.x\src\test\org\apache\nutch\plugin\TestPluginSystem.java>:45: warning: [rawtypes] found raw type: LinkedList
[javac] private LinkedList fFolders = new LinkedList();
[javac] ^
[javac] missing type arguments for generic class LinkedList<E>
[javac] where E is a type-variable:
[javac] E extends Object declared in class LinkedList
[javac] <https://builds.apache.org/job/Nutch-2.x-Windows/ws/2.x\src\test\org\apache\nutch\plugin\TestPluginSystem.java>:213: warning: [unchecked] unchecked call to add(E) as a member of the raw type LinkedList
[javac] fFolders.add(file);
[javac] ^
[javac] where E is a type-variable:
[javac] E extends Object declared in class LinkedList
[javac] 12 warnings
test-core:
[mkdir] Created dir: <https://builds.apache.org/job/Nutch-2.x-Windows/ws/2.x\build\test\data>
[copy] Copying 90 files to <https://builds.apache.org/job/Nutch-2.x-Windows/ws/2.x\build\test\data>
[copy] Copying 1 file to <https://builds.apache.org/job/Nutch-2.x-Windows/ws/2.x\build\test\classes>
[copy] Copying 1 file to <https://builds.apache.org/job/Nutch-2.x-Windows/ws/2.x\build\test\classes>
[copy] Copying 1 file to <https://builds.apache.org/job/Nutch-2.x-Windows/ws/2.x\build\test\classes>
[copy] Copying 1 file to <https://builds.apache.org/job/Nutch-2.x-Windows/ws/2.x\build\test\classes>
[copy] Copying 1 file to <https://builds.apache.org/job/Nutch-2.x-Windows/ws/2.x\build\test\classes>
[copy] Copying 1 file to <https://builds.apache.org/job/Nutch-2.x-Windows/ws/2.x\build\test\classes>
[junit] Running org.apache.nutch.api.TestAPI
[junit] Tests run: 1, Failures: 0, Errors: 0, Time elapsed: 0.059 sec
[junit] Running org.apache.nutch.crawl.TestGenerator
[junit] Tests run: 4, Failures: 0, Errors: 4, Time elapsed: 3.098 sec
[junit] Test org.apache.nutch.crawl.TestGenerator FAILED
[junit] Running org.apache.nutch.crawl.TestInjector
[junit] Tests run: 1, Failures: 0, Errors: 1, Time elapsed: 1.691 sec
[junit] Test org.apache.nutch.crawl.TestInjector FAILED
[junit] Running org.apache.nutch.crawl.TestSignatureFactory
[junit] Tests run: 1, Failures: 0, Errors: 0, Time elapsed: 0.35 sec
[junit] Running org.apache.nutch.crawl.TestURLPartitioner
[junit] Tests run: 7, Failures: 0, Errors: 0, Time elapsed: 1.796 sec
[junit] Running org.apache.nutch.crawl.TestUrlWithScore
[junit] Tests run: 4, Failures: 0, Errors: 0, Time elapsed: 0.201 sec
[junit] Running org.apache.nutch.fetcher.TestFetcher
[junit] Tests run: 2, Failures: 0, Errors: 1, Time elapsed: 2.145 sec
[junit] Test org.apache.nutch.fetcher.TestFetcher FAILED
[junit] Running org.apache.nutch.indexer.TestIndexingFilters
[junit] Tests run: 1, Failures: 0, Errors: 0, Time elapsed: 1.199 sec
[junit] Running org.apache.nutch.metadata.TestMetadata
[junit] Tests run: 10, Failures: 0, Errors: 0, Time elapsed: 0.177 sec
[junit] Running org.apache.nutch.metadata.TestSpellCheckedMetadata
[junit] Tests run: 11, Failures: 0, Errors: 0, Time elapsed: 2.581 sec
[junit] Running org.apache.nutch.net.TestURLFilters
[junit] Tests run: 1, Failures: 0, Errors: 0, Time elapsed: 0.739 sec
[junit] Running org.apache.nutch.net.TestURLNormalizers
[junit] Tests run: 1, Failures: 0, Errors: 0, Time elapsed: 0.496 sec
[junit] Running org.apache.nutch.parse.TestOutlinkExtractor
[junit] Tests run: 4, Failures: 0, Errors: 0, Time elapsed: 0.069 sec
[junit] Running org.apache.nutch.parse.TestParserFactory
[junit] Tests run: 2, Failures: 0, Errors: 0, Time elapsed: 1.638 sec
[junit] Running org.apache.nutch.plugin.TestPluginSystem
[junit] Tests run: 7, Failures: 0, Errors: 0, Time elapsed: 1.724 sec
[junit] Running org.apache.nutch.protocol.TestContent
[junit] Tests run: 2, Failures: 0, Errors: 0, Time elapsed: 0.514 sec
[junit] Running org.apache.nutch.protocol.TestProtocolFactory
[junit] Tests run: 2, Failures: 0, Errors: 0, Time elapsed: 1.058 sec
[junit] Running org.apache.nutch.storage.TestGoraStorage
[junit] Tests run: 3, Failures: 1, Errors: 0, Time elapsed: 165.054 sec
[junit] Test org.apache.nutch.storage.TestGoraStorage FAILED
[junit] Running org.apache.nutch.util.TestEncodingDetector
[junit] Tests run: 1, Failures: 0, Errors: 0, Time elapsed: 0.88 sec
[junit] Running org.apache.nutch.util.TestGZIPUtils
[junit] Tests run: 4, Failures: 0, Errors: 0, Time elapsed: 0.556 sec
[junit] Running org.apache.nutch.util.TestNodeWalker
[junit] Tests run: 1, Failures: 0, Errors: 0, Time elapsed: 0.428 sec
[junit] Running org.apache.nutch.util.TestPrefixStringMatcher
[junit] Tests run: 1, Failures: 0, Errors: 0, Time elapsed: 0.145 sec
[junit] Running org.apache.nutch.util.TestStringUtil
[junit] Tests run: 2, Failures: 0, Errors: 0, Time elapsed: 0.032 sec
[junit] Running org.apache.nutch.util.TestSuffixStringMatcher
[junit] Tests run: 1, Failures: 0, Errors: 0, Time elapsed: 0.128 sec
[junit] Running org.apache.nutch.util.TestTableUtil
[junit] Tests run: 2, Failures: 0, Errors: 0, Time elapsed: 0.053 sec
[junit] Running org.apache.nutch.util.TestURLUtil
[junit] Tests run: 4, Failures: 0, Errors: 0, Time elapsed: 0.561 sec
BUILD FAILED
<https://builds.apache.org/job/Nutch-2.x-Windows/ws/2.x\build.xml>:423: Tests failed!
Total time: 4 minutes 52 seconds
Build step 'Invoke Ant' marked build as failure
Publishing Javadoc
Build failed in Jenkins: Nutch-2.x-Windows #5
Posted by Apache Jenkins Server <je...@builds.apache.org>.
See <https://builds.apache.org/job/Nutch-2.x-Windows/5/changes>
Changes:
[lewismc] NUTCH-1274 Fix [cast] javac warnings
------------------------------------------
[...truncated 2942 lines...]
resolve-default:
[ivy:resolve] :: loading settings :: file = <https://builds.apache.org/job/Nutch-2.x-Windows/ws/2.x\ivy\ivysettings.xml>
compile:
[echo] Compiling plugin: urlfilter-validator
[javac] <https://builds.apache.org/job/Nutch-2.x-Windows/ws/2.x\src\plugin\build-plugin.xml>:117: warning: 'includeantruntime' was not set, defaulting to build.sysclasspath=last; set to false for repeatable builds
[javac] Compiling 1 source file to <https://builds.apache.org/job/Nutch-2.x-Windows/ws/2.x\build\urlfilter-validator\classes>
[javac] warning: [options] bootstrap class path not set in conjunction with -source 1.6
[javac] 1 warning
jar:
[jar] Building jar: <https://builds.apache.org/job/Nutch-2.x-Windows/ws/2.x\build\urlfilter-validator\urlfilter-validator.jar>
deps-test:
deploy:
[copy] Copying 1 file to <https://builds.apache.org/job/Nutch-2.x-Windows/ws/2.x\build\plugins\urlfilter-validator>
copy-generated-lib:
[copy] Copying 1 file to <https://builds.apache.org/job/Nutch-2.x-Windows/ws/2.x\build\plugins\urlfilter-validator>
init:
[mkdir] Created dir: <https://builds.apache.org/job/Nutch-2.x-Windows/ws/2.x\build\urlnormalizer-basic>
[mkdir] Created dir: <https://builds.apache.org/job/Nutch-2.x-Windows/ws/2.x\build\urlnormalizer-basic\classes>
[mkdir] Created dir: <https://builds.apache.org/job/Nutch-2.x-Windows/ws/2.x\build\urlnormalizer-basic\test>
[mkdir] Created dir: <https://builds.apache.org/job/Nutch-2.x-Windows/ws/2.x\build\plugins\urlnormalizer-basic>
init-plugin:
deps-jar:
clean-lib:
resolve-default:
[ivy:resolve] :: loading settings :: file = <https://builds.apache.org/job/Nutch-2.x-Windows/ws/2.x\ivy\ivysettings.xml>
compile:
[echo] Compiling plugin: urlnormalizer-basic
[javac] <https://builds.apache.org/job/Nutch-2.x-Windows/ws/2.x\src\plugin\build-plugin.xml>:117: warning: 'includeantruntime' was not set, defaulting to build.sysclasspath=last; set to false for repeatable builds
[javac] Compiling 1 source file to <https://builds.apache.org/job/Nutch-2.x-Windows/ws/2.x\build\urlnormalizer-basic\classes>
[javac] warning: [options] bootstrap class path not set in conjunction with -source 1.6
[javac] 1 warning
jar:
[jar] Building jar: <https://builds.apache.org/job/Nutch-2.x-Windows/ws/2.x\build\urlnormalizer-basic\urlnormalizer-basic.jar>
deps-test:
deploy:
[copy] Copying 1 file to <https://builds.apache.org/job/Nutch-2.x-Windows/ws/2.x\build\plugins\urlnormalizer-basic>
copy-generated-lib:
[copy] Copying 1 file to <https://builds.apache.org/job/Nutch-2.x-Windows/ws/2.x\build\plugins\urlnormalizer-basic>
init:
[mkdir] Created dir: <https://builds.apache.org/job/Nutch-2.x-Windows/ws/2.x\build\urlnormalizer-pass>
[mkdir] Created dir: <https://builds.apache.org/job/Nutch-2.x-Windows/ws/2.x\build\urlnormalizer-pass\classes>
[mkdir] Created dir: <https://builds.apache.org/job/Nutch-2.x-Windows/ws/2.x\build\urlnormalizer-pass\test>
[mkdir] Created dir: <https://builds.apache.org/job/Nutch-2.x-Windows/ws/2.x\build\plugins\urlnormalizer-pass>
init-plugin:
deps-jar:
clean-lib:
resolve-default:
[ivy:resolve] :: loading settings :: file = <https://builds.apache.org/job/Nutch-2.x-Windows/ws/2.x\ivy\ivysettings.xml>
compile:
[echo] Compiling plugin: urlnormalizer-pass
[javac] <https://builds.apache.org/job/Nutch-2.x-Windows/ws/2.x\src\plugin\build-plugin.xml>:117: warning: 'includeantruntime' was not set, defaulting to build.sysclasspath=last; set to false for repeatable builds
[javac] Compiling 1 source file to <https://builds.apache.org/job/Nutch-2.x-Windows/ws/2.x\build\urlnormalizer-pass\classes>
[javac] warning: [options] bootstrap class path not set in conjunction with -source 1.6
[javac] 1 warning
jar:
[jar] Building jar: <https://builds.apache.org/job/Nutch-2.x-Windows/ws/2.x\build\urlnormalizer-pass\urlnormalizer-pass.jar>
deps-test:
deploy:
[copy] Copying 1 file to <https://builds.apache.org/job/Nutch-2.x-Windows/ws/2.x\build\plugins\urlnormalizer-pass>
copy-generated-lib:
[copy] Copying 1 file to <https://builds.apache.org/job/Nutch-2.x-Windows/ws/2.x\build\plugins\urlnormalizer-pass>
[mkdir] Created dir: <https://builds.apache.org/job/Nutch-2.x-Windows/ws/2.x\build\urlnormalizer-regex\test\data>
[copy] Copying 4 files to <https://builds.apache.org/job/Nutch-2.x-Windows/ws/2.x\build\urlnormalizer-regex\test\data>
init:
[mkdir] Created dir: <https://builds.apache.org/job/Nutch-2.x-Windows/ws/2.x\build\urlnormalizer-regex\classes>
[mkdir] Created dir: <https://builds.apache.org/job/Nutch-2.x-Windows/ws/2.x\build\plugins\urlnormalizer-regex>
init-plugin:
deps-jar:
clean-lib:
resolve-default:
[ivy:resolve] :: loading settings :: file = <https://builds.apache.org/job/Nutch-2.x-Windows/ws/2.x\ivy\ivysettings.xml>
compile:
[echo] Compiling plugin: urlnormalizer-regex
[javac] <https://builds.apache.org/job/Nutch-2.x-Windows/ws/2.x\src\plugin\build-plugin.xml>:117: warning: 'includeantruntime' was not set, defaulting to build.sysclasspath=last; set to false for repeatable builds
[javac] Compiling 1 source file to <https://builds.apache.org/job/Nutch-2.x-Windows/ws/2.x\build\urlnormalizer-regex\classes>
[javac] warning: [options] bootstrap class path not set in conjunction with -source 1.6
[javac] 1 warning
jar:
[jar] Building jar: <https://builds.apache.org/job/Nutch-2.x-Windows/ws/2.x\build\urlnormalizer-regex\urlnormalizer-regex.jar>
deps-test:
init:
init-plugin:
clean-lib:
resolve-default:
[ivy:resolve] :: loading settings :: file = <https://builds.apache.org/job/Nutch-2.x-Windows/ws/2.x\ivy\ivysettings.xml>
compile:
jar:
deps-test:
deploy:
copy-generated-lib:
deploy:
[copy] Copying 1 file to <https://builds.apache.org/job/Nutch-2.x-Windows/ws/2.x\build\plugins\urlnormalizer-regex>
copy-generated-lib:
[copy] Copying 1 file to <https://builds.apache.org/job/Nutch-2.x-Windows/ws/2.x\build\plugins\urlnormalizer-regex>
compile:
job:
[jar] Building jar: <https://builds.apache.org/job/Nutch-2.x-Windows/ws/2.x\build\apache-nutch-2.2-SNAPSHOT.job>
resolve-test:
[taskdef] Could not load definitions from resource org/sonar/ant/antlib.xml. It could not be found.
copy-libs:
compile-core-test:
[javac] <https://builds.apache.org/job/Nutch-2.x-Windows/ws/2.x\build.xml>:334: warning: 'includeantruntime' was not set, defaulting to build.sysclasspath=last; set to false for repeatable builds
[javac] Compiling 33 source files to <https://builds.apache.org/job/Nutch-2.x-Windows/ws/2.x\build\test\classes>
[javac] warning: [path] bad path element "<https://builds.apache.org/job/Nutch-2.x-Windows/ws/2.x\build\lib\jaxb-api.jar">: no such file or directory
[javac] warning: [path] bad path element "<https://builds.apache.org/job/Nutch-2.x-Windows/ws/2.x\build\lib\activation.jar">: no such file or directory
[javac] warning: [path] bad path element "<https://builds.apache.org/job/Nutch-2.x-Windows/ws/2.x\build\lib\jsr173_1.0_api.jar">: no such file or directory
[javac] warning: [path] bad path element "<https://builds.apache.org/job/Nutch-2.x-Windows/ws/2.x\build\lib\jaxb1-impl.jar">: no such file or directory
[javac] warning: [path] Unexpected extension for archive file: <https://builds.apache.org/job/Nutch-2.x-Windows/ws/2.x\build\apache-nutch-2.2-SNAPSHOT.job>
[javac] warning: [options] bootstrap class path not set in conjunction with -source 1.6
[javac] <https://builds.apache.org/job/Nutch-2.x-Windows/ws/2.x\src\test\org\apache\nutch\plugin\TestPluginSystem.java>:45: warning: [rawtypes] found raw type: LinkedList
[javac] private LinkedList fFolders = new LinkedList();
[javac] ^
[javac] missing type arguments for generic class LinkedList<E>
[javac] where E is a type-variable:
[javac] E extends Object declared in class LinkedList
[javac] <https://builds.apache.org/job/Nutch-2.x-Windows/ws/2.x\src\test\org\apache\nutch\plugin\TestPluginSystem.java>:45: warning: [rawtypes] found raw type: LinkedList
[javac] private LinkedList fFolders = new LinkedList();
[javac] ^
[javac] missing type arguments for generic class LinkedList<E>
[javac] where E is a type-variable:
[javac] E extends Object declared in class LinkedList
[javac] <https://builds.apache.org/job/Nutch-2.x-Windows/ws/2.x\src\test\org\apache\nutch\plugin\TestPluginSystem.java>:213: warning: [unchecked] unchecked call to add(E) as a member of the raw type LinkedList
[javac] fFolders.add(file);
[javac] ^
[javac] where E is a type-variable:
[javac] E extends Object declared in class LinkedList
[javac] 9 warnings
test-core:
[mkdir] Created dir: <https://builds.apache.org/job/Nutch-2.x-Windows/ws/2.x\build\test\data>
[copy] Copying 90 files to <https://builds.apache.org/job/Nutch-2.x-Windows/ws/2.x\build\test\data>
[copy] Copying 1 file to <https://builds.apache.org/job/Nutch-2.x-Windows/ws/2.x\build\test\classes>
[copy] Copying 1 file to <https://builds.apache.org/job/Nutch-2.x-Windows/ws/2.x\build\test\classes>
[copy] Copying 1 file to <https://builds.apache.org/job/Nutch-2.x-Windows/ws/2.x\build\test\classes>
[copy] Copying 1 file to <https://builds.apache.org/job/Nutch-2.x-Windows/ws/2.x\build\test\classes>
[copy] Copying 1 file to <https://builds.apache.org/job/Nutch-2.x-Windows/ws/2.x\build\test\classes>
[copy] Copying 1 file to <https://builds.apache.org/job/Nutch-2.x-Windows/ws/2.x\build\test\classes>
[junit] Running org.apache.nutch.api.TestAPI
[junit] Tests run: 1, Failures: 0, Errors: 0, Time elapsed: 0.047 sec
[junit] Running org.apache.nutch.crawl.TestGenerator
[junit] Tests run: 4, Failures: 0, Errors: 4, Time elapsed: 3.509 sec
[junit] Test org.apache.nutch.crawl.TestGenerator FAILED
[junit] Running org.apache.nutch.crawl.TestInjector
[junit] Tests run: 1, Failures: 0, Errors: 1, Time elapsed: 1.962 sec
[junit] Test org.apache.nutch.crawl.TestInjector FAILED
[junit] Running org.apache.nutch.crawl.TestSignatureFactory
[junit] Tests run: 1, Failures: 0, Errors: 0, Time elapsed: 0.45 sec
[junit] Running org.apache.nutch.crawl.TestURLPartitioner
[junit] Tests run: 7, Failures: 0, Errors: 0, Time elapsed: 2.772 sec
[junit] Running org.apache.nutch.crawl.TestUrlWithScore
[junit] Tests run: 4, Failures: 0, Errors: 0, Time elapsed: 0.195 sec
[junit] Running org.apache.nutch.fetcher.TestFetcher
[junit] Tests run: 2, Failures: 0, Errors: 1, Time elapsed: 2.196 sec
[junit] Test org.apache.nutch.fetcher.TestFetcher FAILED
[junit] Running org.apache.nutch.indexer.TestIndexingFilters
[junit] Tests run: 1, Failures: 0, Errors: 0, Time elapsed: 1.275 sec
[junit] Running org.apache.nutch.metadata.TestMetadata
[junit] Tests run: 10, Failures: 0, Errors: 0, Time elapsed: 0.193 sec
[junit] Running org.apache.nutch.metadata.TestSpellCheckedMetadata
[junit] Tests run: 11, Failures: 0, Errors: 0, Time elapsed: 2.625 sec
[junit] Running org.apache.nutch.net.TestURLFilters
[junit] Tests run: 1, Failures: 0, Errors: 0, Time elapsed: 1.641 sec
[junit] Running org.apache.nutch.net.TestURLNormalizers
[junit] Tests run: 1, Failures: 0, Errors: 0, Time elapsed: 1.015 sec
[junit] Running org.apache.nutch.parse.TestOutlinkExtractor
[junit] Tests run: 4, Failures: 0, Errors: 0, Time elapsed: 0.101 sec
[junit] Running org.apache.nutch.parse.TestParserFactory
[junit] Tests run: 2, Failures: 0, Errors: 0, Time elapsed: 1.602 sec
[junit] Running org.apache.nutch.plugin.TestPluginSystem
[junit] Tests run: 7, Failures: 0, Errors: 0, Time elapsed: 1.898 sec
[junit] Running org.apache.nutch.protocol.TestContent
[junit] Tests run: 2, Failures: 0, Errors: 0, Time elapsed: 0.664 sec
[junit] Running org.apache.nutch.protocol.TestProtocolFactory
[junit] Tests run: 2, Failures: 0, Errors: 0, Time elapsed: 1.263 sec
[junit] Running org.apache.nutch.storage.TestGoraStorage
[junit] Tests run: 3, Failures: 0, Errors: 0, Time elapsed: 170.594 sec
[junit] Running org.apache.nutch.util.TestEncodingDetector
[junit] Tests run: 1, Failures: 0, Errors: 0, Time elapsed: 0.881 sec
[junit] Running org.apache.nutch.util.TestGZIPUtils
[junit] Tests run: 4, Failures: 0, Errors: 0, Time elapsed: 0.606 sec
[junit] Running org.apache.nutch.util.TestNodeWalker
[junit] Tests run: 1, Failures: 0, Errors: 0, Time elapsed: 0.423 sec
[junit] Running org.apache.nutch.util.TestPrefixStringMatcher
[junit] Tests run: 1, Failures: 0, Errors: 0, Time elapsed: 0.133 sec
[junit] Running org.apache.nutch.util.TestStringUtil
[junit] Tests run: 2, Failures: 0, Errors: 0, Time elapsed: 0.036 sec
[junit] Running org.apache.nutch.util.TestSuffixStringMatcher
[junit] Tests run: 1, Failures: 0, Errors: 0, Time elapsed: 0.097 sec
[junit] Running org.apache.nutch.util.TestTableUtil
[junit] Tests run: 2, Failures: 0, Errors: 0, Time elapsed: 0.046 sec
[junit] Running org.apache.nutch.util.TestURLUtil
[junit] Tests run: 4, Failures: 0, Errors: 0, Time elapsed: 0.578 sec
BUILD FAILED
<https://builds.apache.org/job/Nutch-2.x-Windows/ws/2.x\build.xml>:423: Tests failed!
Total time: 4 minutes 55 seconds
Build step 'Invoke Ant' marked build as failure
Publishing Javadoc
Updating NUTCH-1274