You are viewing a plain text version of this content. The canonical link for it is here.
Posted to commits@myfaces.apache.org by Apache Jenkins Server <je...@builds.apache.org> on 2012/09/13 23:28:50 UTC
Build failed in Jenkins: myfaces-current-2.0 #1169
See <https://builds.apache.org/job/myfaces-current-2.0/1169/>
------------------------------------------
Started by upstream project "maven-plugins" build number 998
Building remotely on solaris1 in workspace <https://builds.apache.org/job/myfaces-current-2.0/ws/>
Updating http://svn.apache.org/repos/asf/myfaces/current20
Fetching 'https://svn.apache.org/repos/asf/myfaces/core/branches/2.0.x' at -1 into '/zonestorage/hudson_solaris/home/hudson/hudson-slave/workspace/myfaces-current-2.0/current20/core'
At revision 1384547
Fetching 'https://svn.apache.org/repos/asf/myfaces/shared/trunk_4.0.x' at -1 into '/zonestorage/hudson_solaris/home/hudson/hudson-slave/workspace/myfaces-current-2.0/current20/shared'
At revision 1384548
At revision 1384547
no change for http://svn.apache.org/repos/asf/myfaces/current20 since the previous build
no change for https://svn.apache.org/repos/asf/myfaces/core/branches/2.0.x since the previous build
no change for https://svn.apache.org/repos/asf/myfaces/shared/trunk_4.0.x since the previous build
Parsing POMs
Modules changed, recalculating dependency graph
[current20] $ /home/hudson/tools/java/latest1.6/bin/java -cp /export/home/hudson/hudson-slave/maven-agent.jar:/export/home/hudson/hudson-slave/classworlds.jar hudson.maven.agent.Main /home/hudson/tools/maven/latest /zonestorage/hudson_solaris/home/hudson/hudson-slave/slave.jar /export/home/hudson/hudson-slave/maven-interceptor.jar 43365 /export/home/hudson/hudson-slave/maven2.1-interceptor.jar
ERROR: Failed to parse POMs
java.io.IOException: Not enough space
at java.lang.UNIXProcess.forkAndExec(Native Method)
at java.lang.UNIXProcess.<init>(UNIXProcess.java:53)
at java.lang.ProcessImpl.start(ProcessImpl.java:65)
at java.lang.ProcessBuilder.start(ProcessBuilder.java:451)
at hudson.Proc$LocalProc.<init>(Proc.java:244)
at hudson.Proc$LocalProc.<init>(Proc.java:216)
at hudson.Launcher$LocalLauncher.launch(Launcher.java:709)
at hudson.Launcher$ProcStarter.start(Launcher.java:338)
at hudson.Launcher$RemoteLaunchCallable.call(Launcher.java:934)
at hudson.Launcher$RemoteLaunchCallable.call(Launcher.java:901)
at hudson.remoting.UserRequest.perform(UserRequest.java:118)
at hudson.remoting.UserRequest.perform(UserRequest.java:48)
at hudson.remoting.Request$2.run(Request.java:326)
at hudson.remoting.InterceptingExecutorService$1.call(InterceptingExecutorService.java:72)
at java.util.concurrent.FutureTask$Sync.innerRun(FutureTask.java:269)
at java.util.concurrent.FutureTask.run(FutureTask.java:123)
at java.util.concurrent.ThreadPoolExecutor$Worker.runTask(ThreadPoolExecutor.java:651)
at java.util.concurrent.ThreadPoolExecutor$Worker.run(ThreadPoolExecutor.java:676)
at java.lang.Thread.run(Thread.java:595)
Build failed in Jenkins: myfaces-current-2.0 #1171
Posted by Apache Jenkins Server <je...@builds.apache.org>.
See <https://builds.apache.org/job/myfaces-current-2.0/1171/>
------------------------------------------
Started by upstream project "maven-plugins" build number 1000
Building remotely on solaris1 in workspace <https://builds.apache.org/job/myfaces-current-2.0/ws/>
Updating http://svn.apache.org/repos/asf/myfaces/current20
Fetching 'https://svn.apache.org/repos/asf/myfaces/core/branches/2.0.x' at -1 into '/zonestorage/hudson_solaris/home/hudson/hudson-slave/workspace/myfaces-current-2.0/current20/core'
At revision 1384648
Fetching 'https://svn.apache.org/repos/asf/myfaces/shared/trunk_4.0.x' at -1 into '/zonestorage/hudson_solaris/home/hudson/hudson-slave/workspace/myfaces-current-2.0/current20/shared'
At revision 1384648
At revision 1384648
no change for http://svn.apache.org/repos/asf/myfaces/current20 since the previous build
no change for https://svn.apache.org/repos/asf/myfaces/core/branches/2.0.x since the previous build
no change for https://svn.apache.org/repos/asf/myfaces/shared/trunk_4.0.x since the previous build
Parsing POMs
Modules changed, recalculating dependency graph
[current20] $ /home/hudson/tools/java/latest1.6/bin/java -cp /export/home/hudson/hudson-slave/maven-agent.jar:/export/home/hudson/hudson-slave/classworlds.jar hudson.maven.agent.Main /home/hudson/tools/maven/latest /zonestorage/hudson_solaris/home/hudson/hudson-slave/slave.jar /export/home/hudson/hudson-slave/maven-interceptor.jar 39654 /export/home/hudson/hudson-slave/maven2.1-interceptor.jar
<===[JENKINS REMOTING CAPACITY]===>channel started
log4j:WARN No appenders could be found for logger (org.apache.commons.beanutils.converters.BooleanConverter).
log4j:WARN Please initialize the log4j system properly.
Executing Maven: -B -f <https://builds.apache.org/job/myfaces-current-2.0/ws/current20/pom.xml> -Dmaven.repo.local=/export/home/hudson/hudson-slave/maven-repositories/0 clean deploy
[INFO] Scanning for projects...
[INFO] Reactor build order:
[INFO] Apache MyFaces JSF-2.0 Core Project
[INFO] Apache MyFaces JSF-2.0 Core API
[INFO] Apache MyFaces Shared For JSF 2.0 - Project
[INFO] Apache MyFaces Shared For JSF 2.0 - Core Mirror
[INFO] MyFaces Shared Tomahawk
[INFO] Apache MyFaces Shared Public API For JSF 2.0 - Core
[INFO] Apache MyFaces Shared For JSF 2.0 - Core
[INFO] Apache MyFaces JSF-2.0 Core Impl for Java EE 6
[INFO] Apache MyFaces JSF-2.0 Core Impl
[INFO] Apache MyFaces JSF-2.0 Core OSGi Bundle
[INFO] Apache MyFaces JSF-2.0 Core Module
[INFO] Apache MyFaces Composite Build
[WARNING] POM for 'biz.aQute:bndlib:pom:1.15.0:runtime' is invalid.
Its dependencies (if any) will NOT be available to the current build.
[INFO] ------------------------------------------------------------------------
[INFO] Building Apache MyFaces JSF-2.0 Core Project
[INFO] task-segment: [clean, deploy]
[INFO] ------------------------------------------------------------------------
[INFO] [clean:clean {execution: default-clean}]
[INFO] Deleting <https://builds.apache.org/job/myfaces-current-2.0/ws/current20/core/parent/target>
[INFO] [remote-resources:process {execution: default}]
#
# A fatal error has been detected by the Java Runtime Environment:
#
# SIGSEGV (0xb) at pc=0xfe28b1a2, pid=17086, tid=20
#
# JRE version: 6.0_22-b04
# Java VM: Java HotSpot(TM) Server VM (17.1-b03 mixed mode solaris-x86 )
# Problematic frame:
# C [libzip.so+0xb1a2]
#
# An error report file with more information is saved as:
# /zonestorage/hudson_solaris/home/hudson/hudson-slave/workspace/myfaces-current-2.0/current20/hs_err_pid17086.log
#
# If you would like to submit a bug report, please visit:
# http://java.sun.com/webapps/bugreport/crash.jsp
# The crash happened outside the Java Virtual Machine in native code.
# See problematic frame for where to report the bug.
#
ERROR: Maven JVM terminated unexpectedly with exit code 6
Build failed in Jenkins: myfaces-current-2.0 #1170
Posted by Apache Jenkins Server <je...@builds.apache.org>.
See <https://builds.apache.org/job/myfaces-current-2.0/1170/>
------------------------------------------
[...truncated 246 lines...]
This code can probably be written in a more efficient way.
){var _AJAXUTIL=this._AJAXUTIL,myfacesOptions ---> = <--- this._context.myfaces;return this.
[INFO] _AjaxRequest.js (11,420 bytes) ............................. compressed at 68%
[INFO] _ExtAjaxRequest.js (2,664 bytes) ........................... compressed at 77%
[INFO] _AjaxRequestQueue.js (1,944 bytes) ......................... compressed at 78%
[INFO] BaseRequest.js (5,550 bytes) ............................... compressed at 85%
[INFO] XhrConst.js (1,429 bytes) .................................. compressed at 83%
[INFO] Xhr1.js (6,399 bytes) ...................................... compressed at 59%
[INFO] FormData.js (2,518 bytes) .................................. compressed at 70%
[INFO] IFrame.js (11,077 bytes) ................................... compressed at 68%
[INFO] _EndImpl.js (1,514 bytes) .................................. compressed at 84%
[INFO] _ExtRuntime.js (7,452 bytes) ............................... compressed at 77%
[WARNING] [WARNING] Found an undeclared symbol: jsf
}catch(e){}if(jsf ---> . <--- getProjectStage()==="Development"){eventData.
[INFO] Impl.js (29,390 bytes) ..................................... compressed at 74%
[INFO] _StartImpl.js (1,690 bytes) ................................ compressed at 75%
[WARNING] [WARNING] The variable _T has already been declared in the same scope...
,tv=parseFloat(dav);var _T ---> = <--- myfaces._impl.core._Runtime;_T
[INFO] _RuntimeQuirks.js (5,044 bytes) ............................ compressed at 70%
[WARNING] [WARNING] Using 'eval' is not recommended...
[INFO] Using 'eval' reduces the level of compression!
function (){var _r=window.eval ---> . <--- call(window,code);if(
[WARNING] [WARNING] Using 'eval' is not recommended...
[INFO] Using 'eval' reduces the level of compression!
_T[_e]||((_w.eval ---> && <--- (!_b.isBlackBerry||_b.isBlackBerry
[WARNING] [WARNING] Using 'eval' is not recommended...
[INFO] Using 'eval' reduces the level of compression!
_T[_e]||((_w.eval ---> ) <--- ?"_evalHeadAppendix":null);}if(
[WARNING] [WARNING] Using 'eval' is not recommended...
[INFO] Using 'eval' reduces the level of compression!
[_e]](c);}eval ---> . <--- call(window,c);return null
[INFO] _EvalHandlers.js (6,652 bytes) ............................. compressed at 81%
[INFO] Object.js (3,459 bytes) .................................... compressed at 66%
[WARNING] [WARNING] The symbol assigned is declared but is apparently never used.
This code can probably be written in a more efficient way.
}:function (){};var assigned ---> = <--- true;}if("function"!=typeof newCls
[INFO] _Runtime.js (31,662 bytes) ................................. compressed at 80%
[INFO] Messages_zh_CN.js (5,630 bytes) ............................ compressed at 51%
[INFO] Messages_es.js (5,397 bytes) ............................... compressed at 38%
[INFO] Messages_zh_TW.js (6,371 bytes) ............................ compressed at 57%
[INFO] Messages_de.js (5,721 bytes) ............................... compressed at 44%
[INFO] Messages_nl.js (5,112 bytes) ............................... compressed at 39%
[INFO] Messages.js (5,525 bytes) .................................. compressed at 47%
[INFO] Messages_zh_HK.js (5,962 bytes) ............................ compressed at 54%
[INFO] Messages_fr.js (5,532 bytes) ............................... compressed at 40%
[INFO] Messages_ru.js (5,855 bytes) ............................... compressed at 33%
[INFO] Messages_it.js (5,101 bytes) ............................... compressed at 38%
[INFO] _ExtDom.js (12,692 bytes) .................................. compressed at 73%
[INFO] _Logging.js (4,613 bytes) .................................. compressed at 65%
[WARNING] [WARNING] The variable tagNameStart has already been declared in the same scope...
,_tokenPos=0,_tokenForward=1,tagNameStart ---> = <--- (!tagNameStart)?BEGIN_TAG:tagNameStart;
[WARNING] [WARNING] The symbol _tokenPos is declared but is apparently never used.
This code can probably be written in a more efficient way.
=-1,_contentEnd=-1,_tokenPos ---> = <--- 0,_tokenForward=1,tagNameStart=(
[WARNING] [WARNING] The symbol _tokenForward is declared but is apparently never used.
This code can probably be written in a more efficient way.
_contentEnd=-1,_tokenPos=0,_tokenForward ---> = <--- 1,tagNameStart=(!tagNameStart)?
[INFO] _HtmlStripper.js (5,195 bytes) ............................. compressed at 84%
[WARNING] [WARNING] Found an undeclared symbol: jsf
.description);}else{if(jsf ---> . <--- ajax.getProjectStage()==="Development"){
[WARNING] [WARNING] The symbol jsf is declared but is apparently never used.
This code can probably be written in a more efficient way.
.description);}else{if(jsf ---> . <--- ajax.getProjectStage()==="Development"){
[INFO] _Dom.js (37,162 bytes) ..................................... compressed at 72%
[WARNING] [WARNING] The symbol found is declared but is apparently never used.
This code can probably be written in a more efficient way.
obj,finalAttr,value);}var found ---> = <--- false;var prefix=(value)?
[INFO] _Lang.js (27,069 bytes) .................................... compressed at 68%
[INFO] _DomQuirks.js (25,978 bytes) ............................... compressed at 76%
[INFO] _Queue.js (5,264 bytes) .................................... compressed at 82%
[INFO] _DomExperimental.js (5,991 bytes) .......................... compressed at 73%
[INFO] _ListenerQueue.js (2,814 bytes) ............................ compressed at 76%
[INFO] _LangQuirks.js (8,154 bytes) ............................... compressed at 77%
[WARNING] [WARNING] The variable i has already been declared in the same scope...
&¶ms!=null){for(var i ---> = <--- 0,param;(param=params[
[WARNING] [WARNING] The variable param has already been declared in the same scope...
){for(var i=0,param ---> ; <--- (param=params[i]);
[INFO] _OamSubmit.js (5,740 bytes) ................................ compressed at 67%
[INFO] _ExtLang.js (4,261 bytes) .................................. compressed at 73%
[INFO] jsf.js (8,317 bytes) ....................................... compressed at 83%
[WARNING] [WARNING] The variable _T has already been declared in the same scope...
,tv=parseFloat(dav);var _T ---> = <--- myfaces._impl.core._Runtime;_T
[INFO] jsf-legacy.js (42,385 bytes) ............................... compressed at 76%
[WARNING] [WARNING] Using 'eval' is not recommended...
[INFO] Using 'eval' reduces the level of compression!
function (){var _r=window.eval ---> . <--- call(window,code);if(
[WARNING] [WARNING] Using 'eval' is not recommended...
[INFO] Using 'eval' reduces the level of compression!
_T[_e]||((_w.eval ---> && <--- (!_b.isBlackBerry||_b.isBlackBerry
[WARNING] [WARNING] Using 'eval' is not recommended...
[INFO] Using 'eval' reduces the level of compression!
_T[_e]||((_w.eval ---> ) <--- ?"_evalHeadAppendix":null);}if(
[WARNING] [WARNING] Using 'eval' is not recommended...
[INFO] Using 'eval' reduces the level of compression!
[_e]](c);}eval ---> . <--- call(window,c);return null
[WARNING] [WARNING] The variable tagNameStart has already been declared in the same scope...
,_tokenPos=0,_tokenForward=1,tagNameStart ---> = <--- (!tagNameStart)?BEGIN_TAG:tagNameStart;
[WARNING] [WARNING] The variable i has already been declared in the same scope...
&¶ms!=null){for(var i ---> = <--- 0,param;(param=params[
[WARNING] [WARNING] The variable param has already been declared in the same scope...
){for(var i=0,param ---> ; <--- (param=params[i]);
[WARNING] [WARNING] The symbol assigned is declared but is apparently never used.
This code can probably be written in a more efficient way.
}:function (){};var assigned ---> = <--- true;}if("function"!=typeof newCls
[WARNING] [WARNING] The symbol found is declared but is apparently never used.
This code can probably be written in a more efficient way.
obj,finalAttr,value);}var found ---> = <--- false;var prefix=(value)?
[WARNING] [WARNING] The symbol _tokenPos is declared but is apparently never used.
This code can probably be written in a more efficient way.
=-1,_contentEnd=-1,_tokenPos ---> = <--- 0,_tokenForward=1,tagNameStart=(
[WARNING] [WARNING] The symbol _tokenForward is declared but is apparently never used.
This code can probably be written in a more efficient way.
_contentEnd=-1,_tokenPos=0,_tokenForward ---> = <--- 1,tagNameStart=(!tagNameStart)?
[WARNING] [WARNING] The symbol _RT is declared but is apparently never used.
This code can probably be written in a more efficient way.
{var _Lang=this._Lang;var _RT ---> = <--- this._RT;try{var scopeThis=
[WARNING] [WARNING] The symbol _AJAXUTIL is declared but is apparently never used.
This code can probably be written in a more efficient way.
},getFormData:function (){var _AJAXUTIL ---> = <--- this._AJAXUTIL,myfacesOptions=this._context
[WARNING] [WARNING] The symbol myfacesOptions is declared but is apparently never used.
This code can probably be written in a more efficient way.
){var _AJAXUTIL=this._AJAXUTIL,myfacesOptions ---> = <--- this._context.myfaces;return this.
[INFO] jsf-minimal-modern.js (246,000 bytes) ...................... compressed at 73%
[WARNING] [WARNING] Using 'eval' is not recommended...
[INFO] Using 'eval' reduces the level of compression!
function (){var _r=window.eval ---> . <--- call(window,code);if(
[WARNING] [WARNING] Using 'eval' is not recommended...
[INFO] Using 'eval' reduces the level of compression!
_T[_e]||((_w.eval ---> && <--- (!_b.isBlackBerry||_b.isBlackBerry
[WARNING] [WARNING] Using 'eval' is not recommended...
[INFO] Using 'eval' reduces the level of compression!
_T[_e]||((_w.eval ---> ) <--- ?"_evalHeadAppendix":null);}if(
[WARNING] [WARNING] Using 'eval' is not recommended...
[INFO] Using 'eval' reduces the level of compression!
[_e]](c);}eval ---> . <--- call(window,c);return null
[WARNING] [WARNING] The variable _T has already been declared in the same scope...
,tv=parseFloat(dav);var _T ---> = <--- myfaces._impl.core._Runtime;_T
[WARNING] [WARNING] The variable tagNameStart has already been declared in the same scope...
,_tokenPos=0,_tokenForward=1,tagNameStart ---> = <--- (!tagNameStart)?BEGIN_TAG:tagNameStart;
[WARNING] [WARNING] The variable i has already been declared in the same scope...
&¶ms!=null){for(var i ---> = <--- 0,param;(param=params[
[WARNING] [WARNING] The variable param has already been declared in the same scope...
){for(var i=0,param ---> ; <--- (param=params[i]);
[WARNING] [WARNING] The symbol assigned is declared but is apparently never used.
This code can probably be written in a more efficient way.
}:function (){};var assigned ---> = <--- true;}if("function"!=typeof newCls
[WARNING] [WARNING] The symbol found is declared but is apparently never used.
This code can probably be written in a more efficient way.
obj,finalAttr,value);}var found ---> = <--- false;var prefix=(value)?
[WARNING] [WARNING] The symbol _tokenPos is declared but is apparently never used.
This code can probably be written in a more efficient way.
=-1,_contentEnd=-1,_tokenPos ---> = <--- 0,_tokenForward=1,tagNameStart=(
[WARNING] [WARNING] The symbol _tokenForward is declared but is apparently never used.
This code can probably be written in a more efficient way.
_contentEnd=-1,_tokenPos=0,_tokenForward ---> = <--- 1,tagNameStart=(!tagNameStart)?
[WARNING] [WARNING] The symbol _RT is declared but is apparently never used.
This code can probably be written in a more efficient way.
{var _Lang=this._Lang;var _RT ---> = <--- this._RT;try{var scopeThis=
[WARNING] [WARNING] The symbol _AJAXUTIL is declared but is apparently never used.
This code can probably be written in a more efficient way.
},getFormData:function (){var _AJAXUTIL ---> = <--- this._AJAXUTIL,myfacesOptions=this._context
[WARNING] [WARNING] The symbol myfacesOptions is declared but is apparently never used.
This code can probably be written in a more efficient way.
){var _AJAXUTIL=this._AJAXUTIL,myfacesOptions ---> = <--- this._context.myfaces;return this.
[INFO] jsf-minimal.js (285,179 bytes) ............................. compressed at 74%
[INFO] jsf-i18n.js (53,896 bytes) ................................. compressed at 46%
[INFO] ------------------------------------------------------------------------------
[INFO] compression saved 25,148 bytes
[INFO] [compiler:compile {execution: default-compile}]
[INFO] Compiling 385 source files to <https://builds.apache.org/job/myfaces-current-2.0/ws/current20/core/api/target/classes>
[INFO] [bundle:manifest {execution: bundle-manifest}]
[debug] execute contextualize
[INFO] [resources:testResources {execution: default-testResources}]
[INFO] Using 'UTF-8' encoding to copy filtered resources.
[INFO] Copying 0 resource
[INFO] Copying 3 resources
[INFO] [compiler:testCompile {execution: default-testCompile}]
[INFO] Compiling 66 source files to <https://builds.apache.org/job/myfaces-current-2.0/ws/current20/core/api/target/test-classes>
[INFO] [surefire:test {execution: default-test}]
[INFO] Surefire report directory: <https://builds.apache.org/job/myfaces-current-2.0/ws/current20/core/api/target/surefire-reports>
-------------------------------------------------------
T E S T S
-------------------------------------------------------
Results :
Tests run: 0, Failures: 0, Errors: 0, Skipped: 0
[JENKINS] Recording test results
[JENKINS] Archiving <https://builds.apache.org/job/myfaces-current-2.0/ws/current20/core/api/pom.xml> to /home/hudson/hudson/jobs/myfaces-current-2.0/modules/org.apache.myfaces.core$myfaces-api/builds/2012-09-14_03-30-10/archive/org.apache.myfaces.core/myfaces-api/2.0.16-SNAPSHOT/myfaces-api-2.0.16-SNAPSHOT.pom
[INFO] ------------------------------------------------------------------------
[ERROR] BUILD ERROR
[INFO] ------------------------------------------------------------------------
[INFO] Error while executing forked tests.; nested exception is java.io.IOException: Cannot run program "/bin/sh" (in directory "<https://builds.apache.org/job/myfaces-current-2.0/ws/current20/core/api")>: error=12, Not enough space
[INFO] ------------------------------------------------------------------------
[INFO] For more information, run Maven with the -e switch
[INFO] ------------------------------------------------------------------------
[INFO] Total time: 3 minutes 35 seconds
[INFO] Finished at: Fri Sep 14 03:36:57 GMT+00:00 2012
[INFO] Final Memory: 86M/446M
[INFO] ------------------------------------------------------------------------
channel stopped