You are viewing a plain text version of this content. The canonical link for it is here.
Posted to builds@beam.apache.org by Apache Jenkins Server <je...@builds.apache.org> on 2023/04/15 12:31:22 UTC
Build failed in Jenkins: beam_Publish_Beam_SDK_Snapshots #5186
See <https://ci-beam.apache.org/job/beam_Publish_Beam_SDK_Snapshots/5186/display/redirect>
Changes:
------------------------------------------
[...truncated 2.46 MB...]
#16 1.948 overrides==6.5.0
#16 1.948 packaging==23.0
#16 1.948 pandas==1.5.3
#16 1.948 parameterized==0.8.1
#16 1.948 pip==23.1
#16 1.948 pluggy==1.0.0
#16 1.948 proto-plus==1.22.2
#16 1.948 protobuf==4.22.1
#16 1.948 psycopg2-binary==2.9.6
#16 1.948 pyarrow==11.0.0
#16 1.948 pyasn1==0.4.8
#16 1.948 pyasn1-modules==0.2.8
#16 1.948 pycparser==2.21
#16 1.948 pydot==1.4.2
#16 1.948 PyHamcrest==1.10.1
#16 1.948 pymongo==4.3.3
#16 1.948 PyMySQL==1.0.3
#16 1.948 pyparsing==3.0.9
#16 1.948 pytest==7.2.2
#16 1.948 pytest-timeout==2.1.0
#16 1.948 pytest-xdist==3.2.1
#16 1.948 python-dateutil==2.8.2
#16 1.948 pytz==2023.3
#16 1.948 PyYAML==6.0
#16 1.948 regex==2023.3.23
#16 1.948 requests==2.28.2
#16 1.948 requests-mock==1.10.0
#16 1.948 requests-oauthlib==1.3.1
#16 1.948 rsa==4.9
#16 1.948 scikit-learn==1.2.2
#16 1.948 scipy==1.10.1
#16 1.948 setuptools==67.6.1
#16 1.948 six==1.16.0
#16 1.948 sortedcontainers==2.4.0
#16 1.948 soupsieve==2.4
#16 1.948 SQLAlchemy==1.4.47
#16 1.948 sqlparse==0.4.3
#16 1.948 tenacity==8.2.2
#16 1.948 tensorboard==2.12.1
#16 1.948 tensorboard-data-server==0.7.0
#16 1.948 tensorboard-plugin-wit==1.8.1
#16 1.948 tensorflow==2.12.0
#16 1.948 tensorflow-estimator==2.12.0
#16 1.948 tensorflow-io-gcs-filesystem==0.32.0
#16 1.948 termcolor==2.2.0
#16 1.948 testcontainers==3.7.1
#16 1.948 threadpoolctl==3.1.0
#16 1.948 tqdm==4.65.0
#16 1.948 typing_extensions==4.5.0
#16 1.948 urllib3==1.26.15
#16 1.948 websocket-client==1.5.1
#16 1.948 Werkzeug==2.2.3
#16 1.948 wheel==0.40.0
#16 1.948 wrapt==1.14.1
#16 1.948 zstandard==0.20.0
#16 DONE 8.7s
#17 [beam 13/16] COPY target/LICENSE /opt/apache/beam/
#17 DONE 0.1s
#18 [beam 14/16] COPY target/LICENSE.python /opt/apache/beam/
#18 DONE 0.1s
#19 [beam 15/16] COPY target/NOTICE /opt/apache/beam/
#19 DONE 0.1s
#20 [beam 16/16] COPY target/launcher/linux_amd64/boot /opt/apache/beam/
#20 DONE 0.2s
#21 [third_party_licenses 1/4] COPY target/license_scripts /tmp/license_scripts/
#21 DONE 0.1s
#22 [third_party_licenses 2/4] COPY target/go-licenses/* /opt/apache/beam/third_party_licenses/golang/
#22 DONE 0.1s
#23 [third_party_licenses 3/4] COPY target/license_scripts /tmp/license_scripts/
#23 DONE 0.1s
#24 [third_party_licenses 4/4] RUN if [ "true" = "true" ] ; then pip install 'pip-licenses<5' pyyaml tenacity && python /tmp/license_scripts/pull_licenses_py.py ; fi
#24 1.204 Collecting pip-licenses<5
#24 1.276 Downloading pip_licenses-4.2.0-py3-none-any.whl (19 kB)
#24 1.392 Requirement already satisfied: pyyaml in /usr/local/lib/python3.11/site-packages (6.0)
#24 1.393 Requirement already satisfied: tenacity in /usr/local/lib/python3.11/site-packages (8.2.2)
#24 1.672 Collecting prettytable>=2.3.0 (from pip-licenses<5)
#24 1.689 Downloading prettytable-3.7.0-py3-none-any.whl (27 kB)
#24 1.913 Collecting wcwidth (from prettytable>=2.3.0->pip-licenses<5)
#24 1.929 Downloading wcwidth-0.2.6-py2.py3-none-any.whl (29 kB)
#24 3.081 Installing collected packages: wcwidth, prettytable, pip-licenses
#24 4.571 Successfully installed pip-licenses-4.2.0 prettytable-3.7.0 wcwidth-0.2.6
#24 4.571 WARNING: Running pip as the 'root' user can result in broken permissions and conflicting behaviour with the system package manager. It is recommended to use a virtual environment instead: https://pip.pypa.io/warnings/venv
#24 11.69 Skip pulling license for bs4
#24 11.69 INFO:root:Successfully pulled licenses for 127 dependencies
#24 DONE 11.8s
#25 [stage-2 1/2] COPY --from=third_party_licenses /opt/apache/beam/third_party_licenses /opt/apache/beam/third_party_licenses
#25 DONE 0.1s
#26 [stage-2 2/2] RUN if [ "true" != "true" ] ; then rm -rf /opt/apache/beam/third_party_licenses ; fi
#26 DONE 7.2s
#27 exporting to image
#27 exporting layers
#27 exporting layers 19.6s done
#27 writing image sha256:1e4cc18a46ecc17f2b5986d47a25f3620ebc3304cb1956fb6fbe9dd7df60d61f done
#27 naming to gcr.io/apache-beam-testing/beam-sdk/beam_python3.11_sdk:2.48.0.dev done
#27 DONE 19.6s
> Task :sdks:python:container:py311:dockerTag2.48.0-SNAPSHOT
> Task :sdks:python:container:py38:docker
#24 14.16 Skip pulling license for bs4
#24 14.17 INFO:root:Successfully pulled licenses for 133 dependencies
#24 DONE 14.2s
#25 [stage-2 1/2] COPY --from=third_party_licenses /opt/apache/beam/third_party_licenses /opt/apache/beam/third_party_licenses
#25 DONE 0.1s
#26 [stage-2 2/2] RUN if [ "true" != "true" ] ; then rm -rf /opt/apache/beam/third_party_licenses ; fi
#26 DONE 0.5s
#27 exporting to image
#27 exporting layers
> Task :sdks:python:container:py310:docker
#24 13.18 INFO:root:Successfully pulled licenses for 131 dependencies
#24 13.18 Skip pulling license for bs4
#24 DONE 13.4s
#25 [stage-2 1/2] COPY --from=third_party_licenses /opt/apache/beam/third_party_licenses /opt/apache/beam/third_party_licenses
#25 DONE 0.2s
#26 [stage-2 2/2] RUN if [ "true" != "true" ] ; then rm -rf /opt/apache/beam/third_party_licenses ; fi
#26 DONE 0.4s
#27 exporting to image
#27 exporting layers
#27 exporting layers 18.9s done
#27 writing image sha256:3748ad22d20b2da90d469c0d71282adba58d46edc4bf795682db5dcca7bb73cb done
#27 naming to gcr.io/apache-beam-testing/beam-sdk/beam_python3.10_sdk:2.48.0.dev done
#27 DONE 19.0s
> Task :sdks:python:container:py39:docker
#20 DONE 3.2s
#21 [third_party_licenses 1/4] COPY target/license_scripts /tmp/license_scripts/
#21 DONE 0.1s
#22 [third_party_licenses 2/4] COPY target/go-licenses/* /opt/apache/beam/third_party_licenses/golang/
#22 DONE 0.1s
#23 [third_party_licenses 3/4] COPY target/license_scripts /tmp/license_scripts/
#23 DONE 0.1s
#24 [third_party_licenses 4/4] RUN if [ "true" = "true" ] ; then pip install 'pip-licenses<5' pyyaml tenacity && python /tmp/license_scripts/pull_licenses_py.py ; fi
#24 1.133 Collecting pip-licenses<5
#24 1.193 Downloading pip_licenses-4.2.0-py3-none-any.whl (19 kB)
#24 1.205 Requirement already satisfied: pyyaml in /usr/local/lib/python3.9/site-packages (6.0)
#24 1.206 Requirement already satisfied: tenacity in /usr/local/lib/python3.9/site-packages (8.2.2)
#24 1.268 Collecting prettytable>=2.3.0 (from pip-licenses<5)
#24 1.284 Downloading prettytable-3.7.0-py3-none-any.whl (27 kB)
#24 1.348 Collecting wcwidth (from prettytable>=2.3.0->pip-licenses<5)
#24 1.362 Downloading wcwidth-0.2.6-py2.py3-none-any.whl (29 kB)
#24 2.637 Installing collected packages: wcwidth, prettytable, pip-licenses
#24 2.859 Successfully installed pip-licenses-4.2.0 prettytable-3.7.0 wcwidth-0.2.6
#24 2.859 WARNING: Running pip as the 'root' user can result in broken permissions and conflicting behaviour with the system package manager. It is recommended to use a virtual environment instead: https://pip.pypa.io/warnings/venv
#24 9.813 Skip pulling license for bs4
#24 9.820 INFO:root:Successfully pulled licenses for 133 dependencies
#24 DONE 10.3s
#25 [stage-2 1/2] COPY --from=third_party_licenses /opt/apache/beam/third_party_licenses /opt/apache/beam/third_party_licenses
#25 DONE 0.2s
#26 [stage-2 2/2] RUN if [ "true" != "true" ] ; then rm -rf /opt/apache/beam/third_party_licenses ; fi
#26 DONE 0.5s
#27 exporting to image
#27 exporting layers
> Task :sdks:python:container:py310:dockerTag2.48.0-SNAPSHOT
> Task :sdks:python:container:py38:docker
#27 exporting layers 18.9s done
#27 writing image sha256:4f5a73ef8c366b2f672169d3a134c68de26abd153823a403345f43c002e8901d done
#27 naming to gcr.io/apache-beam-testing/beam-sdk/beam_python3.8_sdk:2.48.0.dev done
#27 DONE 19.0s
> Task :sdks:python:container:py38:dockerTag2.48.0-SNAPSHOT
> Task :sdks:python:container:py39:docker
#27 exporting layers 19.1s done
#27 writing image sha256:27d2db76e05de0579ebdb28f6a209f46981a80cc02740a73b7d10383ba658976 done
#27 naming to gcr.io/apache-beam-testing/beam-sdk/beam_python3.9_sdk:2.48.0.dev done
#27 DONE 19.2s
> Task :sdks:python:container:py39:dockerTag2.48.0-SNAPSHOT
> Task :sdks:python:container:py311:dockerPush2.48.0-SNAPSHOT
> Task :sdks:python:container:py310:dockerPush2.48.0-SNAPSHOT
> Task :sdks:python:container:py38:dockerPush2.48.0-SNAPSHOT
> Task :sdks:python:container:py39:dockerPush2.48.0-SNAPSHOT
> Task :sdks:python:container:py311:dockerTagF5f7a471321c903174b452a1982c5183a79ac6bc
> Task :sdks:python:container:py311:dockerPushF5f7a471321c903174b452a1982c5183a79ac6bc
> Task :sdks:python:container:py311:dockerTagLatest
> Task :sdks:python:container:py311:dockerPushLatest
> Task :sdks:python:container:py311:dockerTagsPush
> Task :sdks:python:container:py310:dockerTagF5f7a471321c903174b452a1982c5183a79ac6bc
> Task :sdks:python:container:py310:dockerPushF5f7a471321c903174b452a1982c5183a79ac6bc
> Task :sdks:python:container:py310:dockerTagLatest
> Task :sdks:python:container:py310:dockerPushLatest
> Task :sdks:python:container:py310:dockerTagsPush
> Task :sdks:python:container:py38:dockerTagF5f7a471321c903174b452a1982c5183a79ac6bc
> Task :sdks:python:container:py38:dockerPushF5f7a471321c903174b452a1982c5183a79ac6bc
> Task :sdks:python:container:py38:dockerTagLatest
> Task :sdks:python:container:py38:dockerPushLatest
> Task :sdks:python:container:py38:dockerTagsPush
> Task :sdks:python:container:py39:dockerTagF5f7a471321c903174b452a1982c5183a79ac6bc
> Task :sdks:python:container:py39:dockerPushF5f7a471321c903174b452a1982c5183a79ac6bc
> Task :sdks:python:container:py39:dockerTagLatest
> Task :sdks:python:container:py39:dockerPushLatest
> Task :sdks:python:container:py39:dockerTagsPush
FAILURE: Build failed with an exception.
* What went wrong:
Execution failed for task ':sdks:java:container:java8:docker'.
> Process 'command 'docker'' finished with non-zero exit value 1
* Try:
> Run with --stacktrace option to get the stack trace.
> Run with --info or --debug option to get more log output.
* Get more help at https://help.gradle.org
Deprecated Gradle features were used in this build, making it incompatible with Gradle 8.0.
You can use '--warning-mode all' to show the individual deprecation warnings and determine if they come from your own scripts or plugins.
See https://docs.gradle.org/7.5.1/userguide/command_line_interface.html#sec:command_line_warnings
Execution optimizations have been disabled for 3 invalid unit(s) of work during this build to ensure correctness.
Please consult deprecation warnings for more details.
BUILD FAILED in 17m 56s
200 actionable tasks: 164 executed, 22 from cache, 14 up-to-date
Publishing build scan...
https://gradle.com/s/wussmv3sjjv42
Build step 'Invoke Gradle script' changed build result to FAILURE
Build step 'Invoke Gradle script' marked build as failure
---------------------------------------------------------------------
To unsubscribe, e-mail: builds-unsubscribe@beam.apache.org
For additional commands, e-mail: builds-help@beam.apache.org
Jenkins build is back to normal : beam_Publish_Beam_SDK_Snapshots #5187
Posted by Apache Jenkins Server <je...@builds.apache.org>.
See <https://ci-beam.apache.org/job/beam_Publish_Beam_SDK_Snapshots/5187/display/redirect>
---------------------------------------------------------------------
To unsubscribe, e-mail: builds-unsubscribe@beam.apache.org
For additional commands, e-mail: builds-help@beam.apache.org