You are viewing a plain text version of this content. The canonical link for it is here.
Posted to yarn-dev@hadoop.apache.org by Apache Jenkins Server <je...@builds.apache.org> on 2014/01/10 18:16:58 UTC

Failed: YARN-1106 PreCommit Build #2858

Jira: https://issues.apache.org/jira/browse/YARN-1106
Build: https://builds.apache.org/job/PreCommit-YARN-Build/2858/

###################################################################################
########################## LAST 60 LINES OF THE CONSOLE ###########################
[...truncated 107 lines...]
Going to apply patch with: /usr/bin/patch -p0
patching file hadoop-yarn-project/hadoop-yarn/hadoop-yarn-server/hadoop-yarn-server-resourcemanager/src/test/java/org/apache/hadoop/yarn/server/resourcemanager/rmapp/attempt/TestRMAppAttemptTransitions.java
Hunk #1 succeeded at 780 (offset 96 lines).
Hunk #2 succeeded at 1207 with fuzz 2 (offset 327 lines).
patching file hadoop-yarn-project/hadoop-yarn/hadoop-yarn-server/hadoop-yarn-server-resourcemanager/src/main/java/org/apache/hadoop/yarn/server/resourcemanager/rmapp/attempt/RMAppAttemptImpl.java
Hunk #1 succeeded at 1042 with fuzz 2 (offset 159 lines).


======================================================================
======================================================================
    Determining number of patched javac warnings.
======================================================================
======================================================================


/home/jenkins/tools/maven/latest/bin/mvn clean test -DskipTests -DHadoopPatchProcess -Pnative -Ptest-patch > /home/jenkins/jenkins-slave/workspace/PreCommit-YARN-Build/patchprocess/patchJavacWarnings.txt 2>&1




{color:red}-1 overall{color}.  Here are the results of testing the latest attachment 
  http://issues.apache.org/jira/secure/attachment/12601390/YARN-1106.patch
  against trunk revision .

    {color:green}+1 @author{color}.  The patch does not contain any @author tags.

    {color:green}+1 tests included{color}.  The patch appears to include 1 new or modified test files.

    {color:red}-1 javac{color:red}.  The patch appears to cause the build to fail.

Console output: https://builds.apache.org/job/PreCommit-YARN-Build/2858//console

This message is automatically generated.


======================================================================
======================================================================
    Adding comment to Jira.
======================================================================
======================================================================


Comment added.
5fef31af676b72df20ce8451f8d4ac650518377e logged out


======================================================================
======================================================================
    Finished build.
======================================================================
======================================================================


Build step 'Execute shell' marked build as failure
Archiving artifacts
[description-setter] Could not determine description.
Recording test results
Email was triggered for: Failure
Sending email for trigger: Failure



###################################################################################
############################## FAILED TESTS (if any) ##############################
No tests ran.

Failed: YARN-1587 PreCommit Build #2861

Posted by Apache Jenkins Server <je...@builds.apache.org>.
Jira: https://issues.apache.org/jira/browse/YARN-1587
Build: https://builds.apache.org/job/PreCommit-YARN-Build/2861/

###################################################################################
########################## LAST 60 LINES OF THE CONSOLE ###########################
[...truncated 8465 lines...]
    {color:green}+1 @author{color}.  The patch does not contain any @author tags.

    {color:green}+1 tests included{color}.  The patch appears to include 42 new or modified test files.

    {color:green}+1 javac{color}.  The applied patch does not increase the total number of javac compiler warnings.

    {color:red}-1 javadoc{color}.  The javadoc tool appears to have generated 56 warning messages.

    {color:green}+1 eclipse:eclipse{color}.  The patch built with eclipse:eclipse.

    {color:red}-1 findbugs{color}.  The patch appears to introduce 9 new Findbugs (version 1.3.9) warnings.

    {color:green}+1 release audit{color}.  The applied patch does not increase the total number of release audit warnings.

    {color:red}-1 core tests{color}.  The patch failed these unit tests in hadoop-assemblies hadoop-common-project/hadoop-common hadoop-hdfs-project/hadoop-hdfs hadoop-mapreduce-project/hadoop-mapreduce-client/hadoop-mapreduce-client-common hadoop-mapreduce-project/hadoop-mapreduce-client/hadoop-mapreduce-client-jobclient hadoop-tools/hadoop-sls hadoop-yarn-project/hadoop-yarn/hadoop-yarn-api hadoop-yarn-project/hadoop-yarn/hadoop-yarn-client hadoop-yarn-project/hadoop-yarn/hadoop-yarn-common hadoop-yarn-project/hadoop-yarn/hadoop-yarn-server/hadoop-yarn-server-applicationhistoryservice hadoop-yarn-project/hadoop-yarn/hadoop-yarn-server/hadoop-yarn-server-common hadoop-yarn-project/hadoop-yarn/hadoop-yarn-server/hadoop-yarn-server-resourcemanager hadoop-yarn-project/hadoop-yarn/hadoop-yarn-site:

                  org.apache.hadoop.mapred.TestYARNRunner
                  org.apache.hadoop.mapreduce.v2.TestNonExistentJob
                  org.apache.hadoop.yarn.client.api.impl.TestNMClient
                  org.apache.hadoop.yarn.server.applicationhistoryservice.TestApplicationHistoryClientService
                  org.apache.hadoop.yarn.server.applicationhistoryservice.TestMemoryApplicationHistoryStore
                  org.apache.hadoop.yarn.server.applicationhistoryservice.TestApplicationHistoryServer
                  org.apache.hadoop.yarn.server.resourcemanager.rmcontainer.TestRMContainerImpl

    {color:green}+1 contrib tests{color}.  The patch passed contrib unit tests.

Test results: https://builds.apache.org/job/PreCommit-YARN-Build/2861//testReport/
Findbugs warnings: https://builds.apache.org/job/PreCommit-YARN-Build/2861//artifact/trunk/patchprocess/newPatchFindbugsWarningshadoop-common.html
Findbugs warnings: https://builds.apache.org/job/PreCommit-YARN-Build/2861//artifact/trunk/patchprocess/newPatchFindbugsWarningshadoop-yarn-server-applicationhistoryservice.html
Findbugs warnings: https://builds.apache.org/job/PreCommit-YARN-Build/2861//artifact/trunk/patchprocess/newPatchFindbugsWarningshadoop-yarn-server-resourcemanager.html
Console output: https://builds.apache.org/job/PreCommit-YARN-Build/2861//console

This message is automatically generated.


======================================================================
======================================================================
    Adding comment to Jira.
======================================================================
======================================================================


Comment added.
48920278047ab38c390efd579e6b7ca71b57b040 logged out


======================================================================
======================================================================
    Finished build.
======================================================================
======================================================================


Build step 'Execute shell' marked build as failure
Archiving artifacts
[description-setter] Could not determine description.
Recording test results
Email was triggered for: Failure
Sending email for trigger: Failure



###################################################################################
############################## FAILED TESTS (if any) ##############################
15 tests failed.
FAILED:  org.apache.hadoop.mapred.TestYARNRunner.testResourceMgrDelegate

Error Message:
null

Stack Trace:
java.lang.NullPointerException: null
	at org.apache.hadoop.yarn.client.api.impl.AHSClientImpl.getApplicationReport(AHSClientImpl.java:102)
	at org.apache.hadoop.yarn.client.api.impl.YarnClientImpl.getApplicationReport(YarnClientImpl.java:233)
	at org.apache.hadoop.mapred.ResourceMgrDelegate.getApplicationReport(ResourceMgrDelegate.java:294)
	at org.apache.hadoop.mapred.TestYARNRunner.testResourceMgrDelegate(TestYARNRunner.java:225)


FAILED:  org.apache.hadoop.mapreduce.v2.TestNonExistentJob.testGetInvalidJob

Error Message:
null

Stack Trace:
junit.framework.AssertionFailedError: null
	at junit.framework.Assert.fail(Assert.java:48)
	at junit.framework.Assert.assertTrue(Assert.java:20)
	at junit.framework.Assert.assertTrue(Assert.java:27)
	at org.apache.hadoop.mapreduce.v2.TestNonExistentJob.testGetInvalidJob(TestNonExistentJob.java:97)


FAILED:  org.apache.hadoop.yarn.client.api.impl.TestNMClient.testNMClientNoCleanupOnStop

Error Message:
Application doesn't exist in cache appattempt_1389391120370_0001_000001
 at org.apache.hadoop.yarn.server.resourcemanager.ApplicationMasterService.throwApplicationDoesNotExistInCacheException(ApplicationMasterService.java:328)
 at org.apache.hadoop.yarn.server.resourcemanager.ApplicationMasterService.finishApplicationMaster(ApplicationMasterService.java:287)
 at org.apache.hadoop.yarn.api.impl.pb.service.ApplicationMasterProtocolPBServiceImpl.finishApplicationMaster(ApplicationMasterProtocolPBServiceImpl.java:75)
 at org.apache.hadoop.yarn.proto.ApplicationMasterProtocol$ApplicationMasterProtocolService$2.callBlockingMethod(ApplicationMasterProtocol.java:97)
 at org.apache.hadoop.ipc.ProtobufRpcEngine$Server$ProtoBufRpcInvoker.call(ProtobufRpcEngine.java:605)
 at org.apache.hadoop.ipc.RPC$Server.call(RPC.java:932)
 at org.apache.hadoop.ipc.Server$Handler$1.run(Server.java:2044)
 at org.apache.hadoop.ipc.Server$Handler$1.run(Server.java:2040)
 at java.security.AccessController.doPrivileged(Native Method)
 at javax.security.auth.Subject.doAs(Subject.java:396)
 at org.apache.hadoop.security.UserGroupInformation.doAs(UserGroupInformation.java:1560)
 at org.apache.hadoop.ipc.Server$Handler.run(Server.java:2038)


Stack Trace:
org.apache.hadoop.yarn.exceptions.InvalidApplicationMasterRequestException: Application doesn't exist in cache appattempt_1389391120370_0001_000001
	at org.apache.hadoop.yarn.server.resourcemanager.ApplicationMasterService.throwApplicationDoesNotExistInCacheException(ApplicationMasterService.java:328)
	at org.apache.hadoop.yarn.server.resourcemanager.ApplicationMasterService.finishApplicationMaster(ApplicationMasterService.java:287)
	at org.apache.hadoop.yarn.api.impl.pb.service.ApplicationMasterProtocolPBServiceImpl.finishApplicationMaster(ApplicationMasterProtocolPBServiceImpl.java:75)
	at org.apache.hadoop.yarn.proto.ApplicationMasterProtocol$ApplicationMasterProtocolService$2.callBlockingMethod(ApplicationMasterProtocol.java:97)
	at org.apache.hadoop.ipc.ProtobufRpcEngine$Server$ProtoBufRpcInvoker.call(ProtobufRpcEngine.java:605)
	at org.apache.hadoop.ipc.RPC$Server.call(RPC.java:932)
	at org.apache.hadoop.ipc.Server$Handler$1.run(Server.java:2044)
	at org.apache.hadoop.ipc.Server$Handler$1.run(Server.java:2040)
	at java.security.AccessController.doPrivileged(Native Method)
	at javax.security.auth.Subject.doAs(Subject.java:396)
	at org.apache.hadoop.security.UserGroupInformation.doAs(UserGroupInformation.java:1560)
	at org.apache.hadoop.ipc.Server$Handler.run(Server.java:2038)

	at org.apache.hadoop.ipc.Client.call(Client.java:1406)
	at org.apache.hadoop.ipc.Client.call(Client.java:1359)
	at org.apache.hadoop.ipc.ProtobufRpcEngine$Invoker.invoke(ProtobufRpcEngine.java:206)
	at $Proxy73.finishApplicationMaster(Unknown Source)
	at org.apache.hadoop.yarn.api.impl.pb.client.ApplicationMasterProtocolPBClientImpl.finishApplicationMaster(ApplicationMasterProtocolPBClientImpl.java:91)
	at sun.reflect.NativeMethodAccessorImpl.invoke0(Native Method)
	at sun.reflect.NativeMethodAccessorImpl.invoke(NativeMethodAccessorImpl.java:39)
	at sun.reflect.DelegatingMethodAccessorImpl.invoke(DelegatingMethodAccessorImpl.java:25)
	at java.lang.reflect.Method.invoke(Method.java:597)
	at org.apache.hadoop.io.retry.RetryInvocationHandler.invokeMethod(RetryInvocationHandler.java:185)
	at org.apache.hadoop.io.retry.RetryInvocationHandler.invoke(RetryInvocationHandler.java:101)
	at $Proxy74.finishApplicationMaster(Unknown Source)
	at org.apache.hadoop.yarn.client.api.impl.AMRMClientImpl.unregisterApplicationMaster(AMRMClientImpl.java:310)
	at org.apache.hadoop.yarn.client.api.impl.TestNMClient.testNMClientNoCleanupOnStop(TestNMClient.java:211)


FAILED:  org.apache.hadoop.yarn.client.api.impl.TestNMClient.testNMClient

Error Message:
Application doesn't exist in cache appattempt_1389391160835_0001_000001
 at org.apache.hadoop.yarn.server.resourcemanager.ApplicationMasterService.throwApplicationDoesNotExistInCacheException(ApplicationMasterService.java:328)
 at org.apache.hadoop.yarn.server.resourcemanager.ApplicationMasterService.finishApplicationMaster(ApplicationMasterService.java:287)
 at org.apache.hadoop.yarn.api.impl.pb.service.ApplicationMasterProtocolPBServiceImpl.finishApplicationMaster(ApplicationMasterProtocolPBServiceImpl.java:75)
 at org.apache.hadoop.yarn.proto.ApplicationMasterProtocol$ApplicationMasterProtocolService$2.callBlockingMethod(ApplicationMasterProtocol.java:97)
 at org.apache.hadoop.ipc.ProtobufRpcEngine$Server$ProtoBufRpcInvoker.call(ProtobufRpcEngine.java:605)
 at org.apache.hadoop.ipc.RPC$Server.call(RPC.java:932)
 at org.apache.hadoop.ipc.Server$Handler$1.run(Server.java:2044)
 at org.apache.hadoop.ipc.Server$Handler$1.run(Server.java:2040)
 at java.security.AccessController.doPrivileged(Native Method)
 at javax.security.auth.Subject.doAs(Subject.java:396)
 at org.apache.hadoop.security.UserGroupInformation.doAs(UserGroupInformation.java:1560)
 at org.apache.hadoop.ipc.Server$Handler.run(Server.java:2038)


Stack Trace:
org.apache.hadoop.yarn.exceptions.InvalidApplicationMasterRequestException: Application doesn't exist in cache appattempt_1389391160835_0001_000001
	at org.apache.hadoop.yarn.server.resourcemanager.ApplicationMasterService.throwApplicationDoesNotExistInCacheException(ApplicationMasterService.java:328)
	at org.apache.hadoop.yarn.server.resourcemanager.ApplicationMasterService.finishApplicationMaster(ApplicationMasterService.java:287)
	at org.apache.hadoop.yarn.api.impl.pb.service.ApplicationMasterProtocolPBServiceImpl.finishApplicationMaster(ApplicationMasterProtocolPBServiceImpl.java:75)
	at org.apache.hadoop.yarn.proto.ApplicationMasterProtocol$ApplicationMasterProtocolService$2.callBlockingMethod(ApplicationMasterProtocol.java:97)
	at org.apache.hadoop.ipc.ProtobufRpcEngine$Server$ProtoBufRpcInvoker.call(ProtobufRpcEngine.java:605)
	at org.apache.hadoop.ipc.RPC$Server.call(RPC.java:932)
	at org.apache.hadoop.ipc.Server$Handler$1.run(Server.java:2044)
	at org.apache.hadoop.ipc.Server$Handler$1.run(Server.java:2040)
	at java.security.AccessController.doPrivileged(Native Method)
	at javax.security.auth.Subject.doAs(Subject.java:396)
	at org.apache.hadoop.security.UserGroupInformation.doAs(UserGroupInformation.java:1560)
	at org.apache.hadoop.ipc.Server$Handler.run(Server.java:2038)

	at org.apache.hadoop.ipc.Client.call(Client.java:1406)
	at org.apache.hadoop.ipc.Client.call(Client.java:1359)
	at org.apache.hadoop.ipc.ProtobufRpcEngine$Invoker.invoke(ProtobufRpcEngine.java:206)
	at $Proxy73.finishApplicationMaster(Unknown Source)
	at org.apache.hadoop.yarn.api.impl.pb.client.ApplicationMasterProtocolPBClientImpl.finishApplicationMaster(ApplicationMasterProtocolPBClientImpl.java:91)
	at sun.reflect.NativeMethodAccessorImpl.invoke0(Native Method)
	at sun.reflect.NativeMethodAccessorImpl.invoke(NativeMethodAccessorImpl.java:39)
	at sun.reflect.DelegatingMethodAccessorImpl.invoke(DelegatingMethodAccessorImpl.java:25)
	at java.lang.reflect.Method.invoke(Method.java:597)
	at org.apache.hadoop.io.retry.RetryInvocationHandler.invokeMethod(RetryInvocationHandler.java:185)
	at org.apache.hadoop.io.retry.RetryInvocationHandler.invoke(RetryInvocationHandler.java:101)
	at $Proxy74.finishApplicationMaster(Unknown Source)
	at org.apache.hadoop.yarn.client.api.impl.AMRMClientImpl.unregisterApplicationMaster(AMRMClientImpl.java:310)
	at org.apache.hadoop.yarn.client.api.impl.TestNMClient.testNMClient(TestNMClient.java:228)


FAILED:  org.apache.hadoop.yarn.server.applicationhistoryservice.TestApplicationHistoryClientService.testApplicationReport

Error Message:
AHSWebApp failed to start.

Stack Trace:
org.apache.hadoop.yarn.exceptions.YarnRuntimeException: AHSWebApp failed to start.
	at org.apache.hadoop.http.HttpServer.getWebAppsPath(HttpServer.java:846)
	at org.apache.hadoop.http.HttpServer.<init>(HttpServer.java:465)
	at org.apache.hadoop.http.HttpServer.<init>(HttpServer.java:101)
	at org.apache.hadoop.http.HttpServer$Builder.build(HttpServer.java:321)
	at org.apache.hadoop.yarn.webapp.WebApps$Builder.start(WebApps.java:232)
	at org.apache.hadoop.yarn.server.applicationhistoryservice.ApplicationHistoryServer.startWebApp(ApplicationHistoryServer.java:141)
	at org.apache.hadoop.yarn.server.applicationhistoryservice.ApplicationHistoryServer.serviceStart(ApplicationHistoryServer.java:74)
	at org.apache.hadoop.service.AbstractService.start(AbstractService.java:193)
	at org.apache.hadoop.yarn.server.applicationhistoryservice.TestApplicationHistoryClientService.setup(TestApplicationHistoryClientService.java:63)


FAILED:  org.apache.hadoop.yarn.server.applicationhistoryservice.TestApplicationHistoryClientService.testApplications

Error Message:
AHSWebApp failed to start.

Stack Trace:
org.apache.hadoop.yarn.exceptions.YarnRuntimeException: AHSWebApp failed to start.
	at org.apache.hadoop.http.HttpServer.getWebAppsPath(HttpServer.java:846)
	at org.apache.hadoop.http.HttpServer.<init>(HttpServer.java:465)
	at org.apache.hadoop.http.HttpServer.<init>(HttpServer.java:101)
	at org.apache.hadoop.http.HttpServer$Builder.build(HttpServer.java:321)
	at org.apache.hadoop.yarn.webapp.WebApps$Builder.start(WebApps.java:232)
	at org.apache.hadoop.yarn.server.applicationhistoryservice.ApplicationHistoryServer.startWebApp(ApplicationHistoryServer.java:141)
	at org.apache.hadoop.yarn.server.applicationhistoryservice.ApplicationHistoryServer.serviceStart(ApplicationHistoryServer.java:74)
	at org.apache.hadoop.service.AbstractService.start(AbstractService.java:193)
	at org.apache.hadoop.yarn.server.applicationhistoryservice.TestApplicationHistoryClientService.setup(TestApplicationHistoryClientService.java:63)


FAILED:  org.apache.hadoop.yarn.server.applicationhistoryservice.TestApplicationHistoryClientService.testApplicationAttemptReport

Error Message:
AHSWebApp failed to start.

Stack Trace:
org.apache.hadoop.yarn.exceptions.YarnRuntimeException: AHSWebApp failed to start.
	at org.apache.hadoop.http.HttpServer.getWebAppsPath(HttpServer.java:846)
	at org.apache.hadoop.http.HttpServer.<init>(HttpServer.java:465)
	at org.apache.hadoop.http.HttpServer.<init>(HttpServer.java:101)
	at org.apache.hadoop.http.HttpServer$Builder.build(HttpServer.java:321)
	at org.apache.hadoop.yarn.webapp.WebApps$Builder.start(WebApps.java:232)
	at org.apache.hadoop.yarn.server.applicationhistoryservice.ApplicationHistoryServer.startWebApp(ApplicationHistoryServer.java:141)
	at org.apache.hadoop.yarn.server.applicationhistoryservice.ApplicationHistoryServer.serviceStart(ApplicationHistoryServer.java:74)
	at org.apache.hadoop.service.AbstractService.start(AbstractService.java:193)
	at org.apache.hadoop.yarn.server.applicationhistoryservice.TestApplicationHistoryClientService.setup(TestApplicationHistoryClientService.java:63)


FAILED:  org.apache.hadoop.yarn.server.applicationhistoryservice.TestApplicationHistoryClientService.testApplicationAttempts

Error Message:
AHSWebApp failed to start.

Stack Trace:
org.apache.hadoop.yarn.exceptions.YarnRuntimeException: AHSWebApp failed to start.
	at org.apache.hadoop.http.HttpServer.getWebAppsPath(HttpServer.java:846)
	at org.apache.hadoop.http.HttpServer.<init>(HttpServer.java:465)
	at org.apache.hadoop.http.HttpServer.<init>(HttpServer.java:101)
	at org.apache.hadoop.http.HttpServer$Builder.build(HttpServer.java:321)
	at org.apache.hadoop.yarn.webapp.WebApps$Builder.start(WebApps.java:232)
	at org.apache.hadoop.yarn.server.applicationhistoryservice.ApplicationHistoryServer.startWebApp(ApplicationHistoryServer.java:141)
	at org.apache.hadoop.yarn.server.applicationhistoryservice.ApplicationHistoryServer.serviceStart(ApplicationHistoryServer.java:74)
	at org.apache.hadoop.service.AbstractService.start(AbstractService.java:193)
	at org.apache.hadoop.yarn.server.applicationhistoryservice.TestApplicationHistoryClientService.setup(TestApplicationHistoryClientService.java:63)


FAILED:  org.apache.hadoop.yarn.server.applicationhistoryservice.TestApplicationHistoryClientService.testContainerReport

Error Message:
AHSWebApp failed to start.

Stack Trace:
org.apache.hadoop.yarn.exceptions.YarnRuntimeException: AHSWebApp failed to start.
	at org.apache.hadoop.http.HttpServer.getWebAppsPath(HttpServer.java:846)
	at org.apache.hadoop.http.HttpServer.<init>(HttpServer.java:465)
	at org.apache.hadoop.http.HttpServer.<init>(HttpServer.java:101)
	at org.apache.hadoop.http.HttpServer$Builder.build(HttpServer.java:321)
	at org.apache.hadoop.yarn.webapp.WebApps$Builder.start(WebApps.java:232)
	at org.apache.hadoop.yarn.server.applicationhistoryservice.ApplicationHistoryServer.startWebApp(ApplicationHistoryServer.java:141)
	at org.apache.hadoop.yarn.server.applicationhistoryservice.ApplicationHistoryServer.serviceStart(ApplicationHistoryServer.java:74)
	at org.apache.hadoop.service.AbstractService.start(AbstractService.java:193)
	at org.apache.hadoop.yarn.server.applicationhistoryservice.TestApplicationHistoryClientService.setup(TestApplicationHistoryClientService.java:63)


FAILED:  org.apache.hadoop.yarn.server.applicationhistoryservice.TestApplicationHistoryClientService.testContainers

Error Message:
AHSWebApp failed to start.

Stack Trace:
org.apache.hadoop.yarn.exceptions.YarnRuntimeException: AHSWebApp failed to start.
	at org.apache.hadoop.http.HttpServer.getWebAppsPath(HttpServer.java:846)
	at org.apache.hadoop.http.HttpServer.<init>(HttpServer.java:465)
	at org.apache.hadoop.http.HttpServer.<init>(HttpServer.java:101)
	at org.apache.hadoop.http.HttpServer$Builder.build(HttpServer.java:321)
	at org.apache.hadoop.yarn.webapp.WebApps$Builder.start(WebApps.java:232)
	at org.apache.hadoop.yarn.server.applicationhistoryservice.ApplicationHistoryServer.startWebApp(ApplicationHistoryServer.java:141)
	at org.apache.hadoop.yarn.server.applicationhistoryservice.ApplicationHistoryServer.serviceStart(ApplicationHistoryServer.java:74)
	at org.apache.hadoop.service.AbstractService.start(AbstractService.java:193)
	at org.apache.hadoop.yarn.server.applicationhistoryservice.TestApplicationHistoryClientService.setup(TestApplicationHistoryClientService.java:63)


FAILED:  org.apache.hadoop.yarn.server.applicationhistoryservice.TestApplicationHistoryServer.testStartStopServer

Error Message:
AHSWebApp failed to start.

Stack Trace:
org.apache.hadoop.yarn.exceptions.YarnRuntimeException: AHSWebApp failed to start.
	at org.apache.hadoop.http.HttpServer.getWebAppsPath(HttpServer.java:846)
	at org.apache.hadoop.http.HttpServer.<init>(HttpServer.java:465)
	at org.apache.hadoop.http.HttpServer.<init>(HttpServer.java:101)
	at org.apache.hadoop.http.HttpServer$Builder.build(HttpServer.java:321)
	at org.apache.hadoop.yarn.webapp.WebApps$Builder.start(WebApps.java:232)
	at org.apache.hadoop.yarn.server.applicationhistoryservice.ApplicationHistoryServer.startWebApp(ApplicationHistoryServer.java:141)
	at org.apache.hadoop.yarn.server.applicationhistoryservice.ApplicationHistoryServer.serviceStart(ApplicationHistoryServer.java:74)
	at org.apache.hadoop.service.AbstractService.start(AbstractService.java:193)
	at org.apache.hadoop.yarn.server.applicationhistoryservice.TestApplicationHistoryServer.testStartStopServer(TestApplicationHistoryServer.java:49)


FAILED:  org.apache.hadoop.yarn.server.applicationhistoryservice.TestApplicationHistoryServer.testLaunch

Error Message:
expected:<0> but was:<-1>

Stack Trace:
java.lang.AssertionError: expected:<0> but was:<-1>
	at org.junit.Assert.fail(Assert.java:93)
	at org.junit.Assert.failNotEquals(Assert.java:647)
	at org.junit.Assert.assertEquals(Assert.java:128)
	at org.junit.Assert.assertEquals(Assert.java:472)
	at org.junit.Assert.assertEquals(Assert.java:456)
	at org.apache.hadoop.yarn.server.applicationhistoryservice.TestApplicationHistoryServer.testLaunch(TestApplicationHistoryServer.java:65)


FAILED:  org.apache.hadoop.yarn.server.applicationhistoryservice.TestMemoryApplicationHistoryStore.testMassiveWriteContainerHistory

Error Message:
null

Stack Trace:
junit.framework.AssertionFailedError: null
	at junit.framework.Assert.fail(Assert.java:48)
	at junit.framework.Assert.assertTrue(Assert.java:20)
	at junit.framework.Assert.assertTrue(Assert.java:27)
	at org.apache.hadoop.yarn.server.applicationhistoryservice.TestMemoryApplicationHistoryStore.testMassiveWriteContainerHistory(TestMemoryApplicationHistoryStore.java:204)


REGRESSION:  org.apache.hadoop.yarn.server.resourcemanager.rmcontainer.TestRMContainerImpl.testReleaseWhileRunning

Error Message:
expected:<http://host:3465/[node/containerlogs]/container_1_0001_01...> but was:<http://host:3465/[logs/host:3425/container_1_0001_01_000001]/container_1_0001_01...>

Stack Trace:
org.junit.ComparisonFailure: expected:<http://host:3465/[node/containerlogs]/container_1_0001_01...> but was:<http://host:3465/[logs/host:3425/container_1_0001_01_000001]/container_1_0001_01...>
	at org.junit.Assert.assertEquals(Assert.java:125)
	at org.junit.Assert.assertEquals(Assert.java:147)
	at org.apache.hadoop.yarn.server.resourcemanager.rmcontainer.TestRMContainerImpl.testReleaseWhileRunning(TestRMContainerImpl.java:107)


REGRESSION:  org.apache.hadoop.yarn.server.resourcemanager.rmcontainer.TestRMContainerImpl.testExpireWhileRunning

Error Message:
expected:<http://host:3465/[node/containerlogs]/container_1_0001_01...> but was:<http://host:3465/[logs/host:3425/container_1_0001_01_000001]/container_1_0001_01...>

Stack Trace:
org.junit.ComparisonFailure: expected:<http://host:3465/[node/containerlogs]/container_1_0001_01...> but was:<http://host:3465/[logs/host:3425/container_1_0001_01_000001]/container_1_0001_01...>
	at org.junit.Assert.assertEquals(Assert.java:125)
	at org.junit.Assert.assertEquals(Assert.java:147)
	at org.apache.hadoop.yarn.server.resourcemanager.rmcontainer.TestRMContainerImpl.testExpireWhileRunning(TestRMContainerImpl.java:194)



Failed: YARN-1574 PreCommit Build #2860

Posted by Apache Jenkins Server <je...@builds.apache.org>.
Jira: https://issues.apache.org/jira/browse/YARN-1574
Build: https://builds.apache.org/job/PreCommit-YARN-Build/2860/

###################################################################################
########################## LAST 60 LINES OF THE CONSOLE ###########################
[...truncated 4191 lines...]
NOP




{color:red}-1 overall{color}.  Here are the results of testing the latest attachment 
  http://issues.apache.org/jira/secure/attachment/12622417/YARN-1574.6.patch
  against trunk revision .

    {color:green}+1 @author{color}.  The patch does not contain any @author tags.

    {color:green}+1 tests included{color}.  The patch appears to include 2 new or modified test files.

    {color:green}+1 javac{color}.  The applied patch does not increase the total number of javac compiler warnings.

    {color:green}+1 javadoc{color}.  The javadoc tool did not generate any warning messages.

    {color:green}+1 eclipse:eclipse{color}.  The patch built with eclipse:eclipse.

    {color:green}+1 findbugs{color}.  The patch does not introduce any new Findbugs (version 1.3.9) warnings.

    {color:green}+1 release audit{color}.  The applied patch does not increase the total number of release audit warnings.

    {color:red}-1 core tests{color}.  The following test timeouts occurred in hadoop-common-project/hadoop-common hadoop-yarn-project/hadoop-yarn/hadoop-yarn-common hadoop-yarn-project/hadoop-yarn/hadoop-yarn-server/hadoop-yarn-server-resourcemanager:

org.apache.hadoop.yarn.server.resourcemanager.TestResourceTrackerService

    {color:green}+1 contrib tests{color}.  The patch passed contrib unit tests.

Test results: https://builds.apache.org/job/PreCommit-YARN-Build/2860//testReport/
Console output: https://builds.apache.org/job/PreCommit-YARN-Build/2860//console

This message is automatically generated.


======================================================================
======================================================================
    Adding comment to Jira.
======================================================================
======================================================================


Comment added.
922e51654260faf59244259d743d01d004f72ed9 logged out


======================================================================
======================================================================
    Finished build.
======================================================================
======================================================================


Build step 'Execute shell' marked build as failure
Archiving artifacts
[description-setter] Could not determine description.
Recording test results
Email was triggered for: Failure
Sending email for trigger: Failure



###################################################################################
############################## FAILED TESTS (if any) ##############################
All tests passed

Failed: YARN-1106 PreCommit Build #2859

Posted by Apache Jenkins Server <je...@builds.apache.org>.
Jira: https://issues.apache.org/jira/browse/YARN-1106
Build: https://builds.apache.org/job/PreCommit-YARN-Build/2859/

###################################################################################
########################## LAST 60 LINES OF THE CONSOLE ###########################
[...truncated 109 lines...]
Going to apply patch with: /usr/bin/patch -p0
patching file hadoop-yarn-project/hadoop-yarn/hadoop-yarn-server/hadoop-yarn-server-resourcemanager/src/test/java/org/apache/hadoop/yarn/server/resourcemanager/rmapp/attempt/TestRMAppAttemptTransitions.java
Hunk #1 succeeded at 780 (offset 96 lines).
Hunk #2 succeeded at 1207 with fuzz 2 (offset 327 lines).
patching file hadoop-yarn-project/hadoop-yarn/hadoop-yarn-server/hadoop-yarn-server-resourcemanager/src/main/java/org/apache/hadoop/yarn/server/resourcemanager/rmapp/attempt/RMAppAttemptImpl.java
Hunk #1 succeeded at 1042 with fuzz 2 (offset 159 lines).


======================================================================
======================================================================
    Determining number of patched javac warnings.
======================================================================
======================================================================


/home/jenkins/tools/maven/latest/bin/mvn clean test -DskipTests -DHadoopPatchProcess -Pnative -Ptest-patch > /home/jenkins/jenkins-slave/workspace/PreCommit-YARN-Build/patchprocess/patchJavacWarnings.txt 2>&1




{color:red}-1 overall{color}.  Here are the results of testing the latest attachment 
  http://issues.apache.org/jira/secure/attachment/12601390/YARN-1106.patch
  against trunk revision .

    {color:green}+1 @author{color}.  The patch does not contain any @author tags.

    {color:green}+1 tests included{color}.  The patch appears to include 1 new or modified test files.

    {color:red}-1 javac{color:red}.  The patch appears to cause the build to fail.

Console output: https://builds.apache.org/job/PreCommit-YARN-Build/2859//console

This message is automatically generated.


======================================================================
======================================================================
    Adding comment to Jira.
======================================================================
======================================================================


Comment added.
cdc3cbb8df074f3b57c3808c0c515736145a4aaf logged out


======================================================================
======================================================================
    Finished build.
======================================================================
======================================================================


Build step 'Execute shell' marked build as failure
Archiving artifacts
[description-setter] Could not determine description.
Recording test results
Email was triggered for: Failure
Sending email for trigger: Failure



###################################################################################
############################## FAILED TESTS (if any) ##############################
No tests ran.