You are viewing a plain text version of this content. The canonical link for it is here.
Posted to notifications@qpid.apache.org by Apache Jenkins Server <je...@builds.apache.org> on 2012/11/20 12:35:33 UTC
Build failed in Jenkins: Qpid-Java-Java-MMS-TestMatrix » JDK 1.6 (latest),Ubuntu,java-mms.0-9-1 #718
See <https://builds.apache.org/job/Qpid-Java-Java-MMS-TestMatrix/./jdk=JDK%201.6%20(latest),label=Ubuntu,profile=java-mms.0-9-1/718/changes>
Changes:
[robbie] NO-JIRA: remove version from backup script, the referenced jar is now in the qpid-all.jar manifest already
------------------------------------------
[...truncated 3769 lines...]
copy-store-to-upgrade:
postbuild:
module.build:
build:
test:
[echo] Using profile:java-mms.0-9-1
[junit] Running org.apache.qpid.server.store.berkeleydb.AMQShortStringEncodingTest
[junit] Tests run: 3, Failures: 0, Errors: 0, Time elapsed: 0.074 sec
[junit] Running org.apache.qpid.server.store.berkeleydb.BDBBackupTest
[junit] Tests run: 0, Failures: 0, Errors: 0, Time elapsed: 0.012 sec
[junit] Running org.apache.qpid.server.store.berkeleydb.BDBHAMessageStoreTest
[junit] Tests run: 0, Failures: 0, Errors: 0, Time elapsed: 0.008 sec
[junit] Running org.apache.qpid.server.store.berkeleydb.BDBMessageStoreConfigurationTest
[junit] Tests run: 0, Failures: 0, Errors: 0, Time elapsed: 0.009 sec
[junit] Running org.apache.qpid.server.store.berkeleydb.BDBMessageStoreQuotaEventsTest
[junit] Tests run: 0, Failures: 0, Errors: 0, Time elapsed: 0.008 sec
[junit] Running org.apache.qpid.server.store.berkeleydb.BDBMessageStoreTest
[junit] Tests run: 0, Failures: 0, Errors: 0, Time elapsed: 0.009 sec
[junit] Running org.apache.qpid.server.store.berkeleydb.BDBUpgradeTest
[junit] Tests run: 0, Failures: 0, Errors: 0, Time elapsed: 0.007 sec
[junit] Running org.apache.qpid.server.store.berkeleydb.HAClusterBlackboxTest
[junit] Tests run: 0, Failures: 0, Errors: 0, Time elapsed: 0.006 sec
[junit] Running org.apache.qpid.server.store.berkeleydb.HAClusterWhiteboxTest
[junit] Tests run: 0, Failures: 0, Errors: 0, Time elapsed: 0.007 sec
[junit] Running org.apache.qpid.server.store.berkeleydb.HAMessageStoreSmokeTest
[junit] Tests run: 0, Failures: 0, Errors: 0, Time elapsed: 0.007 sec
[junit] Running org.apache.qpid.server.store.berkeleydb.tuple.ConfiguredObjectBindingTest
[junit] Tests run: 1, Failures: 0, Errors: 0, Time elapsed: 0.017 sec
[junit] Running org.apache.qpid.server.store.berkeleydb.upgrade.DatabaseTemplateTest
[junit] Tests run: 2, Failures: 0, Errors: 0, Time elapsed: 0.132 sec
[junit] Running org.apache.qpid.server.store.berkeleydb.upgrade.UpgradeFrom4to5Test
[junit] Tests run: 2, Failures: 0, Errors: 0, Time elapsed: 3.923 sec
[junit] Running org.apache.qpid.server.store.berkeleydb.upgrade.UpgradeFrom5To6Test
[junit] Tests run: 4, Failures: 0, Errors: 0, Time elapsed: 2 sec
[junit] Running org.apache.qpid.server.store.berkeleydb.upgrade.UpgraderTest
[junit] Tests run: 2, Failures: 0, Errors: 0, Time elapsed: 1.688 sec
[echo] Running ant for module : bdbstore
[delete] Deleting: <https://builds.apache.org/job/Qpid-Java-Java-MMS-TestMatrix/./jdk=JDK%201.6%20(latest),label=Ubuntu,profile=java-mms.0-9-1/ws/trunk/qpid/java/build/scratch/test-java-mms.0-9-1.properties>
touch-failed:
[echo] Running ant for module : bdbstore/jmx
[delete] Deleting: <https://builds.apache.org/job/Qpid-Java-Java-MMS-TestMatrix/./jdk=JDK%201.6%20(latest),label=Ubuntu,profile=java-mms.0-9-1/ws/trunk/qpid/java/build/scratch/test-java-mms.0-9-1.properties>
prepare:
precompile:
compile:
[echo] Targeting : 1.5
copy-metainf-resources:
[copy] Warning: <https://builds.apache.org/job/Qpid-Java-Java-MMS-TestMatrix/./jdk=JDK%201.6%20(latest),label=Ubuntu,profile=java-mms.0-9-1/ws/trunk/qpid/java/bdbstore/jmx/resources> does not exist.
copy-module-metainf:
jar.manifest:
jar.nomanifest:
jar:
precompile-tests:
compile-tests:
jar-tests:
jar-sources:
libs:
copy-bin:
copy-etc:
postbuild:
build:
test:
[echo] Using profile:java-mms.0-9-1
[junit] Running org.apache.qpid.server.store.berkeleydb.HAClusterManagementTest
[junit] Tests run: 0, Failures: 0, Errors: 0, Time elapsed: 0.04 sec
[junit] Running org.apache.qpid.server.store.berkeleydb.HAClusterTwoNodeTest
[junit] Tests run: 0, Failures: 0, Errors: 0, Time elapsed: 0.01 sec
[junit] Running org.apache.qpid.server.store.berkeleydb.jmx.BDBHAMessageStoreManagerMBeanTest
[junit] Tests run: 15, Failures: 0, Errors: 0, Time elapsed: 0.3 sec
[echo] Running ant for module : bdbstore/jmx
[delete] Deleting: <https://builds.apache.org/job/Qpid-Java-Java-MMS-TestMatrix/./jdk=JDK%201.6%20(latest),label=Ubuntu,profile=java-mms.0-9-1/ws/trunk/qpid/java/build/scratch/test-java-mms.0-9-1.properties>
touch-failed:
[echo] Running ant for module : perftests/visualisation-jfc
[delete] Deleting: <https://builds.apache.org/job/Qpid-Java-Java-MMS-TestMatrix/./jdk=JDK%201.6%20(latest),label=Ubuntu,profile=java-mms.0-9-1/ws/trunk/qpid/java/build/scratch/test-java-mms.0-9-1.properties>
checkjfree-request-props:
[echo] Running ant for module : perftests/visualisation-jfc
[delete] Deleting: <https://builds.apache.org/job/Qpid-Java-Java-MMS-TestMatrix/./jdk=JDK%201.6%20(latest),label=Ubuntu,profile=java-mms.0-9-1/ws/trunk/qpid/java/build/scratch/test-java-mms.0-9-1.properties>
jfree-licence-note:
[echo] *NOTE* The JFreeChart and JFreeCommon libraries required by this optional module are licensed under the LGPL Licence, which is not compatible with the Apache Licence v2.0.
[echo]
[echo] For a copy of the LGPL Licence, please see:
[echo] http://www.gnu.org/licenses/lgpl.html
[echo]
download-ivy:
load-ivy:
configure-ivy:
[ivy:configure] :: Ivy 2.2.0 - 20100923230623 :: http://ant.apache.org/ivy/ ::
[ivy:configure] :: loading settings :: file = <https://builds.apache.org/job/Qpid-Java-Java-MMS-TestMatrix/./jdk=JDK%201.6%20(latest),label=Ubuntu,profile=java-mms.0-9-1/ws/trunk/qpid/java/ivysettings.retrieve.xml>
download-jfree:
[echo] Resolving and retrieving dependencies...
[ivy:resolve] :: resolving dependencies :: org/apache#qpid;0.21
[ivy:resolve] confs: [jfree]
[ivy:resolve] found jfree#jfreechart;1.0.13 in m2repo
[ivy:resolve] found jfree#jcommon;1.0.16 in m2repo
[ivy:resolve] :: resolution report :: resolve 72ms :: artifacts dl 2ms
---------------------------------------------------------------------
| | modules || artifacts |
| conf | number| search|dwnlded|evicted|| number|dwnlded|
---------------------------------------------------------------------
| jfree | 2 | 0 | 0 | 0 || 2 | 0 |
---------------------------------------------------------------------
[ivy:retrieve] :: retrieving :: org/apache#qpid [sync]
[ivy:retrieve] confs: [jfree]
[ivy:retrieve] 0 artifacts copied, 2 already retrieved (0kB/20ms)
check-jfree-jars:
jfree-licence-note-optional:
jfree-jar-required:
checkcsvjdbc-request-props:
[echo] Running ant for module : perftests/visualisation-jfc
[delete] Deleting: <https://builds.apache.org/job/Qpid-Java-Java-MMS-TestMatrix/./jdk=JDK%201.6%20(latest),label=Ubuntu,profile=java-mms.0-9-1/ws/trunk/qpid/java/build/scratch/test-java-mms.0-9-1.properties>
csvjdbc-licence-note:
[echo] *NOTE* The CSVJDBC library required by this optional module is licensed under the LGPL Licence, which is not compatible with the Apache Licence v2.0.
[echo]
[echo] For a copy of the LGPL Licence, please see:
[echo] http://www.gnu.org/licenses/lgpl.html
[echo]
download-ivy:
load-ivy:
configure-ivy:
[ivy:configure] :: Ivy 2.2.0 - 20100923230623 :: http://ant.apache.org/ivy/ ::
[ivy:configure] :: loading settings :: file = <https://builds.apache.org/job/Qpid-Java-Java-MMS-TestMatrix/./jdk=JDK%201.6%20(latest),label=Ubuntu,profile=java-mms.0-9-1/ws/trunk/qpid/java/ivysettings.retrieve.xml>
download-csvjdbc:
[echo] Resolving and retrieving dependencies...
[ivy:resolve] :: resolving dependencies :: org/apache#qpid;0.21
[ivy:resolve] confs: [csvjdbc]
[ivy:resolve] found net.sourceforge.csvjdbc#csvjdbc;1.0.8 in csvjdbc
[ivy:resolve] :: resolution report :: resolve 60ms :: artifacts dl 1ms
---------------------------------------------------------------------
| | modules || artifacts |
| conf | number| search|dwnlded|evicted|| number|dwnlded|
---------------------------------------------------------------------
| csvjdbc | 1 | 0 | 0 | 0 || 1 | 0 |
---------------------------------------------------------------------
[ivy:retrieve] :: retrieving :: org/apache#qpid [sync]
[ivy:retrieve] confs: [csvjdbc]
[ivy:retrieve] 0 artifacts copied, 1 already retrieved (0kB/3ms)
check-csvjdbc-jars:
csvjdbc-licence-note-optional:
csvjdbc-jar-required:
prepare:
precompile:
compile:
[echo] Targeting : 1.5
jar.manifest:
[jar] Building jar: <https://builds.apache.org/job/Qpid-Java-Java-MMS-TestMatrix/./jdk=JDK%201.6%20(latest),label=Ubuntu,profile=java-mms.0-9-1/ws/trunk/qpid/java/build/lib/qpid-perftests-visualisation-jfc-0.21.jar>
copy-metainf-resources:
[copy] Warning: <https://builds.apache.org/job/Qpid-Java-Java-MMS-TestMatrix/./jdk=JDK%201.6%20(latest),label=Ubuntu,profile=java-mms.0-9-1/ws/trunk/qpid/java/perftests/visualisation-jfc/resources> does not exist.
copy-module-metainf:
jar.nomanifest:
jar:
precompile-tests:
compile-tests:
jar-tests:
jar-sources:
libs:
copy-bin:
copy-etc:
postbuild:
module.build:
build:
test:
[echo] Using profile:java-mms.0-9-1
[junit] Running org.apache.qpid.disttest.charting.chartbuilder.ChartBuilderFactoryTest
[junit] Tests run: 5, Failures: 0, Errors: 0, Time elapsed: 0.093 sec
[junit] Running org.apache.qpid.disttest.charting.chartbuilder.ChartProductionTest
[junit] Tests run: 7, Failures: 0, Errors: 0, Time elapsed: 1.588 sec
[junit] Running org.apache.qpid.disttest.charting.chartbuilder.ColorFactoryTest
[junit] Tests run: 2, Failures: 0, Errors: 0, Time elapsed: 0.009 sec
[junit] Running org.apache.qpid.disttest.charting.definition.ChartingDefinitionCreatorTest
[junit] Tests run: 4, Failures: 0, Errors: 0, Time elapsed: 0.026 sec
[junit] Running org.apache.qpid.disttest.charting.definition.SeriesDefinitionCreatorTest
[junit] Tests run: 4, Failures: 0, Errors: 0, Time elapsed: 0.017 sec
[junit] Running org.apache.qpid.disttest.charting.seriesbuilder.JdbcCsvSeriesBuilderTest
[junit] Tests run: 1, Failures: 0, Errors: 0, Time elapsed: 0.062 sec
[junit] Running org.apache.qpid.disttest.charting.writer.ChartWriterTest
[junit] Tests run: 3, Failures: 0, Errors: 0, Time elapsed: 0.326 sec
[echo] Running ant for module : perftests/visualisation-jfc
[delete] Deleting: <https://builds.apache.org/job/Qpid-Java-Java-MMS-TestMatrix/./jdk=JDK%201.6%20(latest),label=Ubuntu,profile=java-mms.0-9-1/ws/trunk/qpid/java/build/scratch/test-java-mms.0-9-1.properties>
touch-failed:
BUILD FAILED
<https://builds.apache.org/job/Qpid-Java-Java-MMS-TestMatrix/./jdk=JDK%201.6%20(latest),label=Ubuntu,profile=java-mms.0-9-1/ws/trunk/qpid/java/build.xml>:104: TEST SUITE FAILED
Total time: 15 minutes 41 seconds
Build step 'Invoke Ant' marked build as failure
[locks-and-latches] Releasing all the locks
[locks-and-latches] All the locks released
Recording test results
Jenkins build is back to normal : Qpid-Java-Java-MMS-TestMatrix » JDK 1.6 (latest),Ubuntu,java-mms.0-9-1 #721
Posted by Apache Jenkins Server <je...@builds.apache.org>.
See <https://builds.apache.org/job/Qpid-Java-Java-MMS-TestMatrix/./jdk=JDK%201.6%20(latest),label=Ubuntu,profile=java-mms.0-9-1/721/changes>
Build failed in Jenkins: Qpid-Java-Java-MMS-TestMatrix » JDK 1.6 (latest),Ubuntu,java-mms.0-9-1 #720
Posted by Apache Jenkins Server <je...@builds.apache.org>.
See <https://builds.apache.org/job/Qpid-Java-Java-MMS-TestMatrix/./jdk=JDK%201.6%20(latest),label=Ubuntu,profile=java-mms.0-9-1/720/changes>
Changes:
[orudyy] QPID-4441: Improve BDB store upgrade tests to cover the upgrade of configuration for queues having creation arguments
------------------------------------------
Started by upstream project "Qpid-Java-Java-MMS-TestMatrix" build number 720
Building remotely on ubuntu2 in workspace <https://builds.apache.org/job/Qpid-Java-Java-MMS-TestMatrix/./jdk=JDK%201.6%20(latest),label=Ubuntu,profile=java-mms.0-9-1/ws/>
Updating http://svn.apache.org/repos/asf/qpid/trunk
U qpid/QPID_VERSION.txt
U qpid/java/broker/src/main/java/broker.bnd
U qpid/java/common.xml
U qpid/java/bdbstore/src/test/java/org/apache/qpid/server/store/berkeleydb/BDBUpgradeTest.java
U qpid/java/bdbstore/src/test/java/org/apache/qpid/server/store/berkeleydb/upgrade/AbstractUpgradeTestCase.java
U qpid/java/bdbstore/src/test/java/org/apache/qpid/server/store/berkeleydb/upgrade/UpgradeFrom4to5Test.java
U qpid/java/bdbstore/src/test/java/org/apache/qpid/server/store/berkeleydb/upgrade/UpgradeFrom5To6Test.java
U qpid/java/bdbstore/src/test/java/org/apache/qpid/server/store/berkeleydb/BDBStoreUpgradeTestPreparer.java
U qpid/java/bdbstore/src/test/resources/upgrade/bdbstore-v4/test-store/00000000.jdb
U qpid/java/bdbstore/src/test/resources/upgrade/bdbstore-v5/test-store/00000000.jdb
U qpid/java/bdbstore/src/test/resources/upgrade/bdbstore-v5/test-store/00000001.jdb
U qpid/java/bdbstore/bin/backup.sh
U qpid/java/common/src/main/java/common.bnd
U qpid/java/management/common/src/main/java/management-common.bnd
U qpid/java/management/example/src/main/java/org/apache/qpid/example/jmxexample/AddQueue.java
U qpid/java/client/src/main/java/client.bnd
U qpid/python/setup.py
U qpid/cpp/src/qpid/broker/Exchange.cpp
U qpid/cpp/src/qpid/broker/Queue.cpp
U qpid/cpp/src/qpid/broker/SessionState.cpp
U qpid/cpp/src/qpid/broker/Exchange.h
U qpid/cpp/src/qpid/broker/Broker.h
U qpid/cpp/src/qpid/broker/System.h
U qpid/cpp/src/qpid/broker/Bridge.h
U qpid/cpp/src/qpid/broker/SemanticState.h
U qpid/cpp/src/qpid/broker/amqp/ManagedSession.cpp
U qpid/cpp/src/qpid/broker/amqp/ManagedSession.h
U qpid/cpp/src/qpid/broker/amqp/ManagedConnection.cpp
U qpid/cpp/src/qpid/broker/amqp/ManagedConnection.h
U qpid/cpp/src/qpid/broker/amqp/ManagedOutgoingLink.cpp
U qpid/cpp/src/qpid/broker/amqp/ManagedOutgoingLink.h
U qpid/cpp/src/qpid/broker/Link.cpp
U qpid/cpp/src/qpid/broker/Vhost.h
U qpid/cpp/src/qpid/broker/Broker.cpp
U qpid/cpp/src/qpid/broker/Bridge.cpp
U qpid/cpp/src/qpid/broker/Connection.h
U qpid/cpp/src/qpid/broker/SemanticState.cpp
U qpid/cpp/src/qpid/broker/QueueFlowLimit.cpp
U qpid/cpp/src/qpid/broker/Queue.h
U qpid/cpp/src/qpid/broker/SessionState.h
U qpid/cpp/src/qpid/broker/Connection.cpp
U qpid/cpp/src/qpid/broker/Link.h
U qpid/cpp/src/qpid/ha/HaBroker.h
U qpid/cpp/src/qpid/acl/Acl.cpp
U qpid/cpp/src/qpid/acl/Acl.h
U qpid/cpp/src/qpid/management/ManagementAgent.h
U qpid/cpp/src/qpid/management/ManagementAgent.cpp
U qpid/cpp/src/qpid/management/Manageable.cpp
U qpid/cpp/src/qpid/client/TCPConnector.h
U qpid/cpp/src/qpid/client/TCPConnector.cpp
U qpid/cpp/src/qpid/sys/windows/AsynchIO.cpp
U qpid/cpp/src/qpid/sys/posix/AsynchIO.cpp
U qpid/cpp/src/qpid/sys/AsynchIO.h
U qpid/cpp/src/tests/testagent.cpp
U qpid/cpp/src/tests/BrokerMgmtAgent.cpp
U qpid/cpp/src/posix/QpiddBroker.cpp
U qpid/cpp/bindings/qpid/ruby/README.rdoc
U qpid/cpp/include/qpid/management/Manageable.h
U qpid/cpp/managementgen/qmf-gen
U qpid/cpp/managementgen/qmfgen/generate.py
U qpid/cpp/managementgen/qmfgen/schema.py
U qpid/cpp/managementgen/qmfgen/templates/Package.h
U qpid/cpp/managementgen/qmfgen/templates/Event.h
U qpid/cpp/managementgen/qmfgen/templates/Class.h
U qpid/cpp/examples/messaging/spout.cpp
U qpid/packaging/windows/INSTALL_NOTES.html
U qpid/packaging/windows/installer.proj
U qpid/tools/setup.py
U qpid/tests/setup.py
U qpid/extras/qmf/setup.py
At revision 1412203
[locks-and-latches] Checking to see if we really have the locks
[locks-and-latches] Have all the locks, build can start
[java] $ /home/hudson/tools/ant/latest/bin/ant -file build.xml -Dlabel=Ubuntu "-Djdk=JDK 1.6 (latest)" -Dprofile=java-mms.0-9-1 "-Dtest.excludelist=org.apache.qpid.test.unit.transacted.TransactionTimeoutTest#* org.apache.qpid.test.unit.transacted.TransactionTimeoutDisabledTest#* org.apache.qpid.systest.management.jmx.LoggingManagementTest#testViewEffectiveRuntimeLoggerLevels org.apache.qpid.test.client.message.SelectorTest#testRuntimeSelectorError" -Doptional=true clean build test
Buildfile: <https://builds.apache.org/job/Qpid-Java-Java-MMS-TestMatrix/./jdk=JDK%201.6%20(latest),label=Ubuntu,profile=java-mms.0-9-1/ws/trunk/qpid/java/build.xml>
clean:
[typedef] Could not load definitions from resource org/apache/maven/artifact/ant/antlib.xml. It could not be found.
[echo] Running ant for module : common
[delete] Deleting: <https://builds.apache.org/job/Qpid-Java-Java-MMS-TestMatrix/./jdk=JDK%201.6%20(latest),label=Ubuntu,profile=java-mms.0-9-1/ws/trunk/qpid/java/build/scratch/test-java-mms.0-9-1.properties>
clean:
[typedef] Could not load definitions from resource org/apache/maven/artifact/ant/antlib.xml. It could not be found.
[echo] Running ant for module : management/common
[delete] Deleting: <https://builds.apache.org/job/Qpid-Java-Java-MMS-TestMatrix/./jdk=JDK%201.6%20(latest),label=Ubuntu,profile=java-mms.0-9-1/ws/trunk/qpid/java/build/scratch/test-java-mms.0-9-1.properties>
clean:
[typedef] Could not load definitions from resource org/apache/maven/artifact/ant/antlib.xml. It could not be found.
[echo] Running ant for module : amqp-1-0-common
[delete] Deleting: <https://builds.apache.org/job/Qpid-Java-Java-MMS-TestMatrix/./jdk=JDK%201.6%20(latest),label=Ubuntu,profile=java-mms.0-9-1/ws/trunk/qpid/java/build/scratch/test-java-mms.0-9-1.properties>
clean:
[typedef] Could not load definitions from resource org/apache/maven/artifact/ant/antlib.xml. It could not be found.
[echo] Running ant for module : broker
[delete] Deleting: <https://builds.apache.org/job/Qpid-Java-Java-MMS-TestMatrix/./jdk=JDK%201.6%20(latest),label=Ubuntu,profile=java-mms.0-9-1/ws/trunk/qpid/java/build/scratch/test-java-mms.0-9-1.properties>
clean:
[typedef] Could not load definitions from resource org/apache/maven/artifact/ant/antlib.xml. It could not be found.
[echo] Running ant for module : client
[delete] Deleting: <https://builds.apache.org/job/Qpid-Java-Java-MMS-TestMatrix/./jdk=JDK%201.6%20(latest),label=Ubuntu,profile=java-mms.0-9-1/ws/trunk/qpid/java/build/scratch/test-java-mms.0-9-1.properties>
clean:
[typedef] Could not load definitions from resource org/apache/maven/artifact/ant/antlib.xml. It could not be found.
[echo] Running ant for module : amqp-1-0-client
[delete] Deleting: <https://builds.apache.org/job/Qpid-Java-Java-MMS-TestMatrix/./jdk=JDK%201.6%20(latest),label=Ubuntu,profile=java-mms.0-9-1/ws/trunk/qpid/java/build/scratch/test-java-mms.0-9-1.properties>
clean:
[typedef] Could not load definitions from resource org/apache/maven/artifact/ant/antlib.xml. It could not be found.
[echo] Running ant for module : amqp-1-0-client-jms
[delete] Deleting: <https://builds.apache.org/job/Qpid-Java-Java-MMS-TestMatrix/./jdk=JDK%201.6%20(latest),label=Ubuntu,profile=java-mms.0-9-1/ws/trunk/qpid/java/build/scratch/test-java-mms.0-9-1.properties>
clean:
[typedef] Could not load definitions from resource org/apache/maven/artifact/ant/antlib.xml. It could not be found.
[echo] Running ant for module : tools
[delete] Deleting: <https://builds.apache.org/job/Qpid-Java-Java-MMS-TestMatrix/./jdk=JDK%201.6%20(latest),label=Ubuntu,profile=java-mms.0-9-1/ws/trunk/qpid/java/build/scratch/test-java-mms.0-9-1.properties>
clean:
[typedef] Could not load definitions from resource org/apache/maven/artifact/ant/antlib.xml. It could not be found.
[echo] Running ant for module : client/example
[delete] Deleting: <https://builds.apache.org/job/Qpid-Java-Java-MMS-TestMatrix/./jdk=JDK%201.6%20(latest),label=Ubuntu,profile=java-mms.0-9-1/ws/trunk/qpid/java/build/scratch/test-java-mms.0-9-1.properties>
clean:
[typedef] Could not load definitions from resource org/apache/maven/artifact/ant/antlib.xml. It could not be found.
[echo] Running ant for module : management/example
[delete] Deleting: <https://builds.apache.org/job/Qpid-Java-Java-MMS-TestMatrix/./jdk=JDK%201.6%20(latest),label=Ubuntu,profile=java-mms.0-9-1/ws/trunk/qpid/java/build/scratch/test-java-mms.0-9-1.properties>
clean:
[typedef] Could not load definitions from resource org/apache/maven/artifact/ant/antlib.xml. It could not be found.
[echo] Running ant for module : amqp-1-0-client/example
[delete] Deleting: <https://builds.apache.org/job/Qpid-Java-Java-MMS-TestMatrix/./jdk=JDK%201.6%20(latest),label=Ubuntu,profile=java-mms.0-9-1/ws/trunk/qpid/java/build/scratch/test-java-mms.0-9-1.properties>
clean:
[typedef] Could not load definitions from resource org/apache/maven/artifact/ant/antlib.xml. It could not be found.
[echo] Running ant for module : amqp-1-0-client-jms/example
[delete] Deleting: <https://builds.apache.org/job/Qpid-Java-Java-MMS-TestMatrix/./jdk=JDK%201.6%20(latest),label=Ubuntu,profile=java-mms.0-9-1/ws/trunk/qpid/java/build/scratch/test-java-mms.0-9-1.properties>
clean:
[typedef] Could not load definitions from resource org/apache/maven/artifact/ant/antlib.xml. It could not be found.
[echo] Running ant for module : jca
[delete] Deleting: <https://builds.apache.org/job/Qpid-Java-Java-MMS-TestMatrix/./jdk=JDK%201.6%20(latest),label=Ubuntu,profile=java-mms.0-9-1/ws/trunk/qpid/java/build/scratch/test-java-mms.0-9-1.properties>
clean:
[typedef] Could not load definitions from resource org/apache/maven/artifact/ant/antlib.xml. It could not be found.
[echo] Running ant for module : systests
[delete] Deleting: <https://builds.apache.org/job/Qpid-Java-Java-MMS-TestMatrix/./jdk=JDK%201.6%20(latest),label=Ubuntu,profile=java-mms.0-9-1/ws/trunk/qpid/java/build/scratch/test-java-mms.0-9-1.properties>
clean:
[typedef] Could not load definitions from resource org/apache/maven/artifact/ant/antlib.xml. It could not be found.
[echo] Running ant for module : perftests
[delete] Deleting: <https://builds.apache.org/job/Qpid-Java-Java-MMS-TestMatrix/./jdk=JDK%201.6%20(latest),label=Ubuntu,profile=java-mms.0-9-1/ws/trunk/qpid/java/build/scratch/test-java-mms.0-9-1.properties>
clean:
[typedef] Could not load definitions from resource org/apache/maven/artifact/ant/antlib.xml. It could not be found.
[echo] Running ant for module : broker-plugins/access-control
[delete] Deleting: <https://builds.apache.org/job/Qpid-Java-Java-MMS-TestMatrix/./jdk=JDK%201.6%20(latest),label=Ubuntu,profile=java-mms.0-9-1/ws/trunk/qpid/java/build/scratch/test-java-mms.0-9-1.properties>
clean:
[typedef] Could not load definitions from resource org/apache/maven/artifact/ant/antlib.xml. It could not be found.
[echo] Running ant for module : broker-plugins/management-http
[delete] Deleting: <https://builds.apache.org/job/Qpid-Java-Java-MMS-TestMatrix/./jdk=JDK%201.6%20(latest),label=Ubuntu,profile=java-mms.0-9-1/ws/trunk/qpid/java/build/scratch/test-java-mms.0-9-1.properties>
BUILD FAILED
<https://builds.apache.org/job/Qpid-Java-Java-MMS-TestMatrix/./jdk=JDK%201.6%20(latest),label=Ubuntu,profile=java-mms.0-9-1/ws/trunk/qpid/java/build.xml>:218: The following error occurred while executing this line:
<https://builds.apache.org/job/Qpid-Java-Java-MMS-TestMatrix/./jdk=JDK%201.6%20(latest),label=Ubuntu,profile=java-mms.0-9-1/ws/trunk/qpid/java/build.xml>:65: The following error occurred while executing this line:
<https://builds.apache.org/job/Qpid-Java-Java-MMS-TestMatrix/./jdk=JDK%201.6%20(latest),label=Ubuntu,profile=java-mms.0-9-1/ws/trunk/qpid/java/broker-plugins/management-http/build.xml>:34: <https://builds.apache.org/job/Qpid-Java-Java-MMS-TestMatrix/./jdk=JDK%201.6%20(latest),label=Ubuntu,profile=java-mms.0-9-1/ws/trunk/qpid/java/lib/required/dojo-war-1.7.2.war> not found.
Total time: 2 seconds
Build step 'Invoke Ant' marked build as failure
[locks-and-latches] Releasing all the locks
[locks-and-latches] All the locks released
Recording test results
Build failed in Jenkins: Qpid-Java-Java-MMS-TestMatrix » JDK 1.6 (latest),Ubuntu,java-mms.0-9-1 #719
Posted by Apache Jenkins Server <je...@builds.apache.org>.
See <https://builds.apache.org/job/Qpid-Java-Java-MMS-TestMatrix/./jdk=JDK%201.6%20(latest),label=Ubuntu,profile=java-mms.0-9-1/719/changes>
Changes:
[tross] QPID-4450 - Don't generate QPID_BROKER_[CLASS_]EXTERN when the generated code is for
a standalone (not in-broker) agent.
[tross] QPID-4449 - Fixed the API in qpid::management::Manageable to remain backward compatible.
[astitcher] QPID-4447: C++ Client can hang during connect if heartbeat disconnect fires
------------------------------------------
[...truncated 3499 lines...]
copy-store-to-upgrade:
postbuild:
module.build:
build:
test:
[echo] Using profile:java-mms.0-9-1
[junit] Running org.apache.qpid.server.store.berkeleydb.AMQShortStringEncodingTest
[junit] Tests run: 3, Failures: 0, Errors: 0, Time elapsed: 0.074 sec
[junit] Running org.apache.qpid.server.store.berkeleydb.BDBBackupTest
[junit] Tests run: 0, Failures: 0, Errors: 0, Time elapsed: 0.011 sec
[junit] Running org.apache.qpid.server.store.berkeleydb.BDBHAMessageStoreTest
[junit] Tests run: 0, Failures: 0, Errors: 0, Time elapsed: 0.008 sec
[junit] Running org.apache.qpid.server.store.berkeleydb.BDBMessageStoreConfigurationTest
[junit] Tests run: 0, Failures: 0, Errors: 0, Time elapsed: 0.009 sec
[junit] Running org.apache.qpid.server.store.berkeleydb.BDBMessageStoreQuotaEventsTest
[junit] Tests run: 0, Failures: 0, Errors: 0, Time elapsed: 0.008 sec
[junit] Running org.apache.qpid.server.store.berkeleydb.BDBMessageStoreTest
[junit] Tests run: 0, Failures: 0, Errors: 0, Time elapsed: 0.01 sec
[junit] Running org.apache.qpid.server.store.berkeleydb.BDBUpgradeTest
[junit] Tests run: 0, Failures: 0, Errors: 0, Time elapsed: 0.007 sec
[junit] Running org.apache.qpid.server.store.berkeleydb.HAClusterBlackboxTest
[junit] Tests run: 0, Failures: 0, Errors: 0, Time elapsed: 0.007 sec
[junit] Running org.apache.qpid.server.store.berkeleydb.HAClusterWhiteboxTest
[junit] Tests run: 0, Failures: 0, Errors: 0, Time elapsed: 0.007 sec
[junit] Running org.apache.qpid.server.store.berkeleydb.HAMessageStoreSmokeTest
[junit] Tests run: 0, Failures: 0, Errors: 0, Time elapsed: 0.006 sec
[junit] Running org.apache.qpid.server.store.berkeleydb.tuple.ConfiguredObjectBindingTest
[junit] Tests run: 1, Failures: 0, Errors: 0, Time elapsed: 0.017 sec
[junit] Running org.apache.qpid.server.store.berkeleydb.upgrade.DatabaseTemplateTest
[junit] Tests run: 2, Failures: 0, Errors: 0, Time elapsed: 0.107 sec
[junit] Running org.apache.qpid.server.store.berkeleydb.upgrade.UpgradeFrom4to5Test
[junit] Tests run: 2, Failures: 0, Errors: 0, Time elapsed: 2.847 sec
[junit] Running org.apache.qpid.server.store.berkeleydb.upgrade.UpgradeFrom5To6Test
[junit] Tests run: 4, Failures: 0, Errors: 0, Time elapsed: 1.73 sec
[junit] Running org.apache.qpid.server.store.berkeleydb.upgrade.UpgraderTest
[junit] Tests run: 2, Failures: 0, Errors: 0, Time elapsed: 1.413 sec
[echo] Running ant for module : bdbstore
[delete] Deleting: <https://builds.apache.org/job/Qpid-Java-Java-MMS-TestMatrix/./jdk=JDK%201.6%20(latest),label=Ubuntu,profile=java-mms.0-9-1/ws/trunk/qpid/java/build/scratch/test-java-mms.0-9-1.properties>
touch-failed:
[echo] Running ant for module : bdbstore/jmx
[delete] Deleting: <https://builds.apache.org/job/Qpid-Java-Java-MMS-TestMatrix/./jdk=JDK%201.6%20(latest),label=Ubuntu,profile=java-mms.0-9-1/ws/trunk/qpid/java/build/scratch/test-java-mms.0-9-1.properties>
prepare:
precompile:
compile:
[echo] Targeting : 1.5
copy-metainf-resources:
[copy] Warning: <https://builds.apache.org/job/Qpid-Java-Java-MMS-TestMatrix/./jdk=JDK%201.6%20(latest),label=Ubuntu,profile=java-mms.0-9-1/ws/trunk/qpid/java/bdbstore/jmx/resources> does not exist.
copy-module-metainf:
jar.manifest:
jar.nomanifest:
jar:
precompile-tests:
compile-tests:
jar-tests:
jar-sources:
libs:
copy-bin:
copy-etc:
postbuild:
build:
test:
[echo] Using profile:java-mms.0-9-1
[junit] Running org.apache.qpid.server.store.berkeleydb.HAClusterManagementTest
[junit] Tests run: 0, Failures: 0, Errors: 0, Time elapsed: 0.039 sec
[junit] Running org.apache.qpid.server.store.berkeleydb.HAClusterTwoNodeTest
[junit] Tests run: 0, Failures: 0, Errors: 0, Time elapsed: 0.01 sec
[junit] Running org.apache.qpid.server.store.berkeleydb.jmx.BDBHAMessageStoreManagerMBeanTest
[junit] Tests run: 15, Failures: 0, Errors: 0, Time elapsed: 0.307 sec
[echo] Running ant for module : bdbstore/jmx
[delete] Deleting: <https://builds.apache.org/job/Qpid-Java-Java-MMS-TestMatrix/./jdk=JDK%201.6%20(latest),label=Ubuntu,profile=java-mms.0-9-1/ws/trunk/qpid/java/build/scratch/test-java-mms.0-9-1.properties>
touch-failed:
[echo] Running ant for module : perftests/visualisation-jfc
[delete] Deleting: <https://builds.apache.org/job/Qpid-Java-Java-MMS-TestMatrix/./jdk=JDK%201.6%20(latest),label=Ubuntu,profile=java-mms.0-9-1/ws/trunk/qpid/java/build/scratch/test-java-mms.0-9-1.properties>
checkjfree-request-props:
[echo] Running ant for module : perftests/visualisation-jfc
[delete] Deleting: <https://builds.apache.org/job/Qpid-Java-Java-MMS-TestMatrix/./jdk=JDK%201.6%20(latest),label=Ubuntu,profile=java-mms.0-9-1/ws/trunk/qpid/java/build/scratch/test-java-mms.0-9-1.properties>
jfree-licence-note:
[echo] *NOTE* The JFreeChart and JFreeCommon libraries required by this optional module are licensed under the LGPL Licence, which is not compatible with the Apache Licence v2.0.
[echo]
[echo] For a copy of the LGPL Licence, please see:
[echo] http://www.gnu.org/licenses/lgpl.html
[echo]
download-ivy:
load-ivy:
configure-ivy:
[ivy:configure] :: Ivy 2.2.0 - 20100923230623 :: http://ant.apache.org/ivy/ ::
[ivy:configure] :: loading settings :: file = <https://builds.apache.org/job/Qpid-Java-Java-MMS-TestMatrix/./jdk=JDK%201.6%20(latest),label=Ubuntu,profile=java-mms.0-9-1/ws/trunk/qpid/java/ivysettings.retrieve.xml>
download-jfree:
[echo] Resolving and retrieving dependencies...
[ivy:resolve] :: resolving dependencies :: org/apache#qpid;0.21
[ivy:resolve] confs: [jfree]
[ivy:resolve] found jfree#jfreechart;1.0.13 in m2repo
[ivy:resolve] found jfree#jcommon;1.0.16 in m2repo
[ivy:resolve] :: resolution report :: resolve 67ms :: artifacts dl 2ms
---------------------------------------------------------------------
| | modules || artifacts |
| conf | number| search|dwnlded|evicted|| number|dwnlded|
---------------------------------------------------------------------
| jfree | 2 | 0 | 0 | 0 || 2 | 0 |
---------------------------------------------------------------------
[ivy:retrieve] :: retrieving :: org/apache#qpid [sync]
[ivy:retrieve] confs: [jfree]
[ivy:retrieve] 0 artifacts copied, 2 already retrieved (0kB/3ms)
check-jfree-jars:
jfree-licence-note-optional:
jfree-jar-required:
checkcsvjdbc-request-props:
[echo] Running ant for module : perftests/visualisation-jfc
[delete] Deleting: <https://builds.apache.org/job/Qpid-Java-Java-MMS-TestMatrix/./jdk=JDK%201.6%20(latest),label=Ubuntu,profile=java-mms.0-9-1/ws/trunk/qpid/java/build/scratch/test-java-mms.0-9-1.properties>
csvjdbc-licence-note:
[echo] *NOTE* The CSVJDBC library required by this optional module is licensed under the LGPL Licence, which is not compatible with the Apache Licence v2.0.
[echo]
[echo] For a copy of the LGPL Licence, please see:
[echo] http://www.gnu.org/licenses/lgpl.html
[echo]
download-ivy:
load-ivy:
configure-ivy:
[ivy:configure] :: Ivy 2.2.0 - 20100923230623 :: http://ant.apache.org/ivy/ ::
[ivy:configure] :: loading settings :: file = <https://builds.apache.org/job/Qpid-Java-Java-MMS-TestMatrix/./jdk=JDK%201.6%20(latest),label=Ubuntu,profile=java-mms.0-9-1/ws/trunk/qpid/java/ivysettings.retrieve.xml>
download-csvjdbc:
[echo] Resolving and retrieving dependencies...
[ivy:resolve] :: resolving dependencies :: org/apache#qpid;0.21
[ivy:resolve] confs: [csvjdbc]
[ivy:resolve] found net.sourceforge.csvjdbc#csvjdbc;1.0.8 in csvjdbc
[ivy:resolve] :: resolution report :: resolve 57ms :: artifacts dl 2ms
---------------------------------------------------------------------
| | modules || artifacts |
| conf | number| search|dwnlded|evicted|| number|dwnlded|
---------------------------------------------------------------------
| csvjdbc | 1 | 0 | 0 | 0 || 1 | 0 |
---------------------------------------------------------------------
[ivy:retrieve] :: retrieving :: org/apache#qpid [sync]
[ivy:retrieve] confs: [csvjdbc]
[ivy:retrieve] 0 artifacts copied, 1 already retrieved (0kB/3ms)
check-csvjdbc-jars:
csvjdbc-licence-note-optional:
csvjdbc-jar-required:
prepare:
precompile:
compile:
[echo] Targeting : 1.5
jar.manifest:
[jar] Building jar: <https://builds.apache.org/job/Qpid-Java-Java-MMS-TestMatrix/./jdk=JDK%201.6%20(latest),label=Ubuntu,profile=java-mms.0-9-1/ws/trunk/qpid/java/build/lib/qpid-perftests-visualisation-jfc-0.21.jar>
copy-metainf-resources:
[copy] Warning: <https://builds.apache.org/job/Qpid-Java-Java-MMS-TestMatrix/./jdk=JDK%201.6%20(latest),label=Ubuntu,profile=java-mms.0-9-1/ws/trunk/qpid/java/perftests/visualisation-jfc/resources> does not exist.
copy-module-metainf:
jar.nomanifest:
jar:
precompile-tests:
compile-tests:
jar-tests:
jar-sources:
libs:
copy-bin:
copy-etc:
postbuild:
module.build:
build:
test:
[echo] Using profile:java-mms.0-9-1
[junit] Running org.apache.qpid.disttest.charting.chartbuilder.ChartBuilderFactoryTest
[junit] Tests run: 5, Failures: 0, Errors: 0, Time elapsed: 0.057 sec
[junit] Running org.apache.qpid.disttest.charting.chartbuilder.ChartProductionTest
[junit] Tests run: 7, Failures: 0, Errors: 0, Time elapsed: 1.143 sec
[junit] Running org.apache.qpid.disttest.charting.chartbuilder.ColorFactoryTest
[junit] Tests run: 2, Failures: 0, Errors: 0, Time elapsed: 0.009 sec
[junit] Running org.apache.qpid.disttest.charting.definition.ChartingDefinitionCreatorTest
[junit] Tests run: 4, Failures: 0, Errors: 0, Time elapsed: 0.059 sec
[junit] Running org.apache.qpid.disttest.charting.definition.SeriesDefinitionCreatorTest
[junit] Tests run: 4, Failures: 0, Errors: 0, Time elapsed: 0.017 sec
[junit] Running org.apache.qpid.disttest.charting.seriesbuilder.JdbcCsvSeriesBuilderTest
[junit] Tests run: 1, Failures: 0, Errors: 0, Time elapsed: 0.073 sec
[junit] Running org.apache.qpid.disttest.charting.writer.ChartWriterTest
[junit] Tests run: 3, Failures: 0, Errors: 0, Time elapsed: 0.359 sec
[echo] Running ant for module : perftests/visualisation-jfc
[delete] Deleting: <https://builds.apache.org/job/Qpid-Java-Java-MMS-TestMatrix/./jdk=JDK%201.6%20(latest),label=Ubuntu,profile=java-mms.0-9-1/ws/trunk/qpid/java/build/scratch/test-java-mms.0-9-1.properties>
touch-failed:
BUILD FAILED
<https://builds.apache.org/job/Qpid-Java-Java-MMS-TestMatrix/./jdk=JDK%201.6%20(latest),label=Ubuntu,profile=java-mms.0-9-1/ws/trunk/qpid/java/build.xml>:104: TEST SUITE FAILED
Total time: 14 minutes 30 seconds
Build step 'Invoke Ant' marked build as failure
[locks-and-latches] Releasing all the locks
[locks-and-latches] All the locks released
Recording test results