You are viewing a plain text version of this content. The canonical link for it is here.
Posted to commits@sling.apache.org by Apache Jenkins Server <je...@builds.apache.org> on 2018/06/24 10:13:19 UTC

Build failed in Jenkins: sling-org-apache-sling-feature-launcher-1.8 #14

See <https://builds.apache.org/job/sling-org-apache-sling-feature-launcher-1.8/14/display/redirect>

------------------------------------------
Started by upstream project "sling-org-apache-sling-feature-resolver-1.8" build number 12
originally caused by:
 Started by upstream project "sling-org-apache-sling-feature-analyser-1.8" build number 17
 originally caused by:
  Started by upstream project "sling-org-apache-sling-feature-io-1.8" build number 13
  originally caused by:
   Started by timer
[EnvInject] - Loading node environment variables.
Building remotely on H20 (ubuntu xenial) in workspace <https://builds.apache.org/job/sling-org-apache-sling-feature-launcher-1.8/ws/>
 > git rev-parse --is-inside-work-tree # timeout=10
Fetching changes from the remote Git repository
 > git config remote.origin.url https://github.com/apache/sling-org-apache-sling-feature-launcher.git # timeout=10
Fetching upstream changes from https://github.com/apache/sling-org-apache-sling-feature-launcher.git
 > git --version # timeout=10
 > git fetch --tags --progress https://github.com/apache/sling-org-apache-sling-feature-launcher.git +refs/heads/*:refs/remotes/origin/*
 > git rev-parse origin/master^{commit} # timeout=10
Checking out Revision 5f69191aab02d9a59241fa2d84990dda2c43d815 (origin/master)
 > git config core.sparsecheckout # timeout=10
 > git checkout -f 5f69191aab02d9a59241fa2d84990dda2c43d815
Commit message: "Don't block framework event thread while waiting for startup."
 > git rev-list --no-walk 5f69191aab02d9a59241fa2d84990dda2c43d815 # timeout=10
Parsing POMs
Established TCP socket on 39580
maven33-agent.jar already up to date
maven33-interceptor.jar already up to date
maven3-interceptor-commons.jar already up to date
[sling-org-apache-sling-feature-launcher-1.8] $ /home/jenkins/tools/java/latest1.8/bin/java -Xmx2g -Xms256m -cp /home/jenkins/jenkins-slave/maven33-agent.jar:/home/jenkins/tools/maven/apache-maven-3.3.9/boot/plexus-classworlds-2.5.2.jar:/home/jenkins/tools/maven/apache-maven-3.3.9/conf/logging jenkins.maven3.agent.Maven33Main /home/jenkins/tools/maven/apache-maven-3.3.9 /home/jenkins/jenkins-slave/slave.jar /home/jenkins/jenkins-slave/maven33-interceptor.jar /home/jenkins/jenkins-slave/maven3-interceptor-commons.jar 39580
<===[JENKINS REMOTING CAPACITY]===>   channel started
Executing Maven:  -B -f <https://builds.apache.org/job/sling-org-apache-sling-feature-launcher-1.8/ws/pom.xml> -Dmaven.repo.local=/home/jenkins/jenkins-slave/maven-repositories/0 -U clean deploy
[INFO] Scanning for projects...
[INFO]                                                                         
[INFO] ------------------------------------------------------------------------
[INFO] Building Apache Sling Feature Launcher 0.1.0-SNAPSHOT
[INFO] ------------------------------------------------------------------------
[INFO] Downloading: http://repository.apache.org/snapshots/org/apache/sling/org.apache.sling.feature/0.1.0-SNAPSHOT/maven-metadata.xml
[INFO] Downloading: http://repository.apache.org/snapshots/org/apache/sling/org.apache.sling.feature/0.1.0-SNAPSHOT/org.apache.sling.feature-0.1.0-SNAPSHOT.pom
[WARNING] The POM for org.apache.sling:org.apache.sling.feature:jar:0.1.0-SNAPSHOT is missing, no dependency information available
[INFO] Downloading: http://repository.apache.org/snapshots/org/apache/sling/org.apache.sling.feature.io/0.1.0-SNAPSHOT/maven-metadata.xml
[INFO] Downloading: http://repository.apache.org/snapshots/org/apache/sling/org.apache.sling.feature.io/0.1.0-SNAPSHOT/org.apache.sling.feature.io-0.1.0-SNAPSHOT.pom
[WARNING] The POM for org.apache.sling:org.apache.sling.feature.io:jar:0.1.0-SNAPSHOT is missing, no dependency information available
[INFO] Downloading: http://repository.apache.org/snapshots/org/apache/sling/org.apache.sling.feature.resolver/0.1.0-SNAPSHOT/maven-metadata.xml
[INFO] Downloaded: http://repository.apache.org/snapshots/org/apache/sling/org.apache.sling.feature.resolver/0.1.0-SNAPSHOT/maven-metadata.xml (1013 B at 3.1 KB/sec)
[INFO] Downloading: http://repository.apache.org/snapshots/org/apache/sling/org.apache.sling.feature.resolver/0.1.0-SNAPSHOT/org.apache.sling.feature.resolver-0.1.0-20180624.101223-6.pom
[INFO] Downloaded: http://repository.apache.org/snapshots/org/apache/sling/org.apache.sling.feature.resolver/0.1.0-SNAPSHOT/org.apache.sling.feature.resolver-0.1.0-20180624.101223-6.pom (6 KB at 17.3 KB/sec)
[INFO] Downloading: http://repository.apache.org/snapshots/org/apache/sling/org.apache.sling.feature.analyser/0.1.0-SNAPSHOT/maven-metadata.xml
[INFO] Downloading: http://repository.apache.org/snapshots/org/apache/sling/org.apache.sling.feature.analyser/0.1.0-SNAPSHOT/org.apache.sling.feature.analyser-0.1.0-SNAPSHOT.pom
[WARNING] The POM for org.apache.sling:org.apache.sling.feature.analyser:jar:0.1.0-SNAPSHOT is missing, no dependency information available
[INFO] Downloading: http://repository.apache.org/snapshots/org/apache/sling/org.apache.sling.feature/0.1.0-SNAPSHOT/org.apache.sling.feature-0.1.0-SNAPSHOT.jar
[INFO] Downloading: http://repository.apache.org/snapshots/org/apache/sling/org.apache.sling.feature.io/0.1.0-SNAPSHOT/org.apache.sling.feature.io-0.1.0-SNAPSHOT.jar
[INFO] Downloading: http://repository.apache.org/snapshots/org/apache/sling/org.apache.sling.feature.resolver/0.1.0-SNAPSHOT/org.apache.sling.feature.resolver-0.1.0-20180624.101223-6.jar
[INFO] Downloading: http://repository.apache.org/snapshots/org/apache/sling/org.apache.sling.feature.analyser/0.1.0-SNAPSHOT/org.apache.sling.feature.analyser-0.1.0-SNAPSHOT.jar
[INFO] Downloaded: http://repository.apache.org/snapshots/org/apache/sling/org.apache.sling.feature.resolver/0.1.0-SNAPSHOT/org.apache.sling.feature.resolver-0.1.0-20180624.101223-6.jar (29 KB at 79.1 KB/sec)
[JENKINS] Archiving disabled
[JENKINS] Archiving disabled
[INFO] ------------------------------------------------------------------------
[INFO] BUILD FAILURE
[INFO] ------------------------------------------------------------------------
[INFO] Total time: 11.363 s
[INFO] Finished at: 2018-06-24T10:13:18+00:00
[INFO] Final Memory: 13M/245M
[INFO] ------------------------------------------------------------------------
Waiting for Jenkins to finish collecting data
[ERROR] Failed to execute goal on project org.apache.sling.feature.launcher: Could not resolve dependencies for project org.apache.sling:org.apache.sling.feature.launcher:jar:0.1.0-SNAPSHOT: The following artifacts could not be resolved: org.apache.sling:org.apache.sling.feature:jar:0.1.0-SNAPSHOT, org.apache.sling:org.apache.sling.feature.io:jar:0.1.0-SNAPSHOT, org.apache.sling:org.apache.sling.feature.analyser:jar:0.1.0-SNAPSHOT: Could not find artifact org.apache.sling:org.apache.sling.feature:jar:0.1.0-SNAPSHOT in Nexus (http://repository.apache.org/snapshots) -> [Help 1]
[ERROR] 
[ERROR] To see the full stack trace of the errors, re-run Maven with the -e switch.
[ERROR] Re-run Maven using the -X switch to enable full debug logging.
[ERROR] 
[ERROR] For more information about the errors and possible solutions, please read the following articles:
[ERROR] [Help 1] http://cwiki.apache.org/confluence/display/MAVEN/DependencyResolutionException
channel stopped
Recording test results
Not sending mail to unregistered user karlpauls@gmail.com

Jenkins build is back to normal : sling-org-apache-sling-feature-launcher-1.8 #17

Posted by Apache Jenkins Server <je...@builds.apache.org>.
See <https://builds.apache.org/job/sling-org-apache-sling-feature-launcher-1.8/17/display/redirect?page=changes>


Build failed in Jenkins: sling-org-apache-sling-feature-launcher-1.8 #16

Posted by Apache Jenkins Server <je...@builds.apache.org>.
See <https://builds.apache.org/job/sling-org-apache-sling-feature-launcher-1.8/16/display/redirect?page=changes>

Changes:

[karlpauls] Add a cache config option

------------------------------------------
Started by an SCM change
[EnvInject] - Loading node environment variables.
Building remotely on H20 (ubuntu xenial) in workspace <https://builds.apache.org/job/sling-org-apache-sling-feature-launcher-1.8/ws/>
 > git rev-parse --is-inside-work-tree # timeout=10
Fetching changes from the remote Git repository
 > git config remote.origin.url https://github.com/apache/sling-org-apache-sling-feature-launcher.git # timeout=10
Fetching upstream changes from https://github.com/apache/sling-org-apache-sling-feature-launcher.git
 > git --version # timeout=10
 > git fetch --tags --progress https://github.com/apache/sling-org-apache-sling-feature-launcher.git +refs/heads/*:refs/remotes/origin/*
 > git rev-parse origin/master^{commit} # timeout=10
Checking out Revision 1b7262a4c112a4d5465aa1afd29f5fff0ec30140 (origin/master)
 > git config core.sparsecheckout # timeout=10
 > git checkout -f 1b7262a4c112a4d5465aa1afd29f5fff0ec30140
Commit message: "Add a cache config option"
 > git rev-list --no-walk 87028d9952f5d69a1bc4242ad862f5bf140d4c0e # timeout=10
Parsing POMs
Established TCP socket on 43582
maven33-agent.jar already up to date
maven33-interceptor.jar already up to date
maven3-interceptor-commons.jar already up to date
[sling-org-apache-sling-feature-launcher-1.8] $ /home/jenkins/tools/java/latest1.8/bin/java -Xmx2g -Xms256m -cp /home/jenkins/jenkins-slave/maven33-agent.jar:/home/jenkins/tools/maven/apache-maven-3.3.9/boot/plexus-classworlds-2.5.2.jar:/home/jenkins/tools/maven/apache-maven-3.3.9/conf/logging jenkins.maven3.agent.Maven33Main /home/jenkins/tools/maven/apache-maven-3.3.9 /home/jenkins/jenkins-slave/slave.jar /home/jenkins/jenkins-slave/maven33-interceptor.jar /home/jenkins/jenkins-slave/maven3-interceptor-commons.jar 43582
<===[JENKINS REMOTING CAPACITY]===>   channel started
Executing Maven:  -B -f <https://builds.apache.org/job/sling-org-apache-sling-feature-launcher-1.8/ws/pom.xml> -Dmaven.repo.local=/home/jenkins/jenkins-slave/maven-repositories/1 -U clean deploy
[INFO] Scanning for projects...
[INFO]                                                                         
[INFO] ------------------------------------------------------------------------
[INFO] Building Apache Sling Feature Launcher 0.1.0-SNAPSHOT
[INFO] ------------------------------------------------------------------------
[INFO] Downloading: http://repository.apache.org/snapshots/org/apache/sling/org.apache.sling.feature/0.1.0-SNAPSHOT/maven-metadata.xml
[INFO] Downloading: http://repository.apache.org/snapshots/org/apache/sling/org.apache.sling.feature/0.1.0-SNAPSHOT/org.apache.sling.feature-0.1.0-SNAPSHOT.pom
[WARNING] The POM for org.apache.sling:org.apache.sling.feature:jar:0.1.0-SNAPSHOT is missing, no dependency information available
[INFO] Downloading: http://repository.apache.org/snapshots/org/apache/sling/org.apache.sling.feature.io/0.1.0-SNAPSHOT/maven-metadata.xml
[INFO] Downloading: http://repository.apache.org/snapshots/org/apache/sling/org.apache.sling.feature.io/0.1.0-SNAPSHOT/org.apache.sling.feature.io-0.1.0-SNAPSHOT.pom
[WARNING] The POM for org.apache.sling:org.apache.sling.feature.io:jar:0.1.0-SNAPSHOT is missing, no dependency information available
[INFO] Downloading: http://repository.apache.org/snapshots/org/apache/sling/org.apache.sling.feature.resolver/0.1.0-SNAPSHOT/maven-metadata.xml
[INFO] Downloaded: http://repository.apache.org/snapshots/org/apache/sling/org.apache.sling.feature.resolver/0.1.0-SNAPSHOT/maven-metadata.xml (1013 B at 3.2 KB/sec)
[INFO] Downloading: http://repository.apache.org/snapshots/org/apache/sling/org.apache.sling.feature.analyser/0.1.0-SNAPSHOT/maven-metadata.xml
[INFO] Downloading: http://repository.apache.org/snapshots/org/apache/sling/org.apache.sling.feature.analyser/0.1.0-SNAPSHOT/org.apache.sling.feature.analyser-0.1.0-SNAPSHOT.pom
[WARNING] The POM for org.apache.sling:org.apache.sling.feature.analyser:jar:0.1.0-SNAPSHOT is missing, no dependency information available
[INFO] Downloading: http://repository.apache.org/snapshots/org/apache/sling/org.apache.sling.feature/0.1.0-SNAPSHOT/org.apache.sling.feature-0.1.0-SNAPSHOT.jar
[INFO] Downloading: http://repository.apache.org/snapshots/org/apache/sling/org.apache.sling.feature.io/0.1.0-SNAPSHOT/org.apache.sling.feature.io-0.1.0-SNAPSHOT.jar
[INFO] Downloading: http://repository.apache.org/snapshots/org/apache/sling/org.apache.sling.feature.analyser/0.1.0-SNAPSHOT/org.apache.sling.feature.analyser-0.1.0-SNAPSHOT.jar
[JENKINS] Archiving disabled
[JENKINS] Archiving disabled
[INFO] ------------------------------------------------------------------------
[INFO] BUILD FAILURE
[INFO] ------------------------------------------------------------------------
[INFO] Total time: 12.307 s
[INFO] Finished at: 2018-06-27T12:24:55+00:00
[INFO] Final Memory: 14M/245M
[INFO] ------------------------------------------------------------------------
Waiting for Jenkins to finish collecting data[ERROR] Failed to execute goal on project org.apache.sling.feature.launcher: Could not resolve dependencies for project org.apache.sling:org.apache.sling.feature.launcher:jar:0.1.0-SNAPSHOT: The following artifacts could not be resolved: org.apache.sling:org.apache.sling.feature:jar:0.1.0-SNAPSHOT, org.apache.sling:org.apache.sling.feature.io:jar:0.1.0-SNAPSHOT, org.apache.sling:org.apache.sling.feature.analyser:jar:0.1.0-SNAPSHOT: Could not find artifact org.apache.sling:org.apache.sling.feature:jar:0.1.0-SNAPSHOT in Nexus (http://repository.apache.org/snapshots) -> [Help 1]
[ERROR] 
[ERROR] To see the full stack trace of the errors, re-run Maven with the -e switch.
[ERROR] Re-run Maven using the -X switch to enable full debug logging.
[ERROR] 
[ERROR] For more information about the errors and possible solutions, please read the following articles:
[ERROR] [Help 1] http://cwiki.apache.org/confluence/display/MAVEN/DependencyResolutionException

channel stopped
Recording test results
Not sending mail to unregistered user karlpauls@gmail.com

Build failed in Jenkins: sling-org-apache-sling-feature-launcher-1.8 #15

Posted by Apache Jenkins Server <je...@builds.apache.org>.
See <https://builds.apache.org/job/sling-org-apache-sling-feature-launcher-1.8/15/display/redirect?page=changes>

Changes:

[karlpauls] Add Launchpad content provider and fix install vs restart mode.

------------------------------------------
Started by an SCM change
[EnvInject] - Loading node environment variables.
Building remotely on H20 (ubuntu xenial) in workspace <https://builds.apache.org/job/sling-org-apache-sling-feature-launcher-1.8/ws/>
 > git rev-parse --is-inside-work-tree # timeout=10
Fetching changes from the remote Git repository
 > git config remote.origin.url https://github.com/apache/sling-org-apache-sling-feature-launcher.git # timeout=10
Fetching upstream changes from https://github.com/apache/sling-org-apache-sling-feature-launcher.git
 > git --version # timeout=10
 > git fetch --tags --progress https://github.com/apache/sling-org-apache-sling-feature-launcher.git +refs/heads/*:refs/remotes/origin/*
 > git rev-parse origin/master^{commit} # timeout=10
Checking out Revision 87028d9952f5d69a1bc4242ad862f5bf140d4c0e (origin/master)
 > git config core.sparsecheckout # timeout=10
 > git checkout -f 87028d9952f5d69a1bc4242ad862f5bf140d4c0e
Commit message: "Add Launchpad content provider and fix install vs restart mode."
 > git rev-list --no-walk 5f69191aab02d9a59241fa2d84990dda2c43d815 # timeout=10
Parsing POMs
Established TCP socket on 39245
maven33-agent.jar already up to date
maven33-interceptor.jar already up to date
maven3-interceptor-commons.jar already up to date
[sling-org-apache-sling-feature-launcher-1.8] $ /home/jenkins/tools/java/latest1.8/bin/java -Xmx2g -Xms256m -cp /home/jenkins/jenkins-slave/maven33-agent.jar:/home/jenkins/tools/maven/apache-maven-3.3.9/boot/plexus-classworlds-2.5.2.jar:/home/jenkins/tools/maven/apache-maven-3.3.9/conf/logging jenkins.maven3.agent.Maven33Main /home/jenkins/tools/maven/apache-maven-3.3.9 /home/jenkins/jenkins-slave/slave.jar /home/jenkins/jenkins-slave/maven33-interceptor.jar /home/jenkins/jenkins-slave/maven3-interceptor-commons.jar 39245
<===[JENKINS REMOTING CAPACITY]===>   channel started
Executing Maven:  -B -f <https://builds.apache.org/job/sling-org-apache-sling-feature-launcher-1.8/ws/pom.xml> -Dmaven.repo.local=/home/jenkins/jenkins-slave/maven-repositories/1 -U clean deploy
[INFO] Scanning for projects...
[INFO]                                                                         
[INFO] ------------------------------------------------------------------------
[INFO] Building Apache Sling Feature Launcher 0.1.0-SNAPSHOT
[INFO] ------------------------------------------------------------------------
[INFO] Downloading: https://repo.maven.apache.org/maven2/org/osgi/osgi.core/7.0.0/osgi.core-7.0.0.pom
[INFO] Downloaded: https://repo.maven.apache.org/maven2/org/osgi/osgi.core/7.0.0/osgi.core-7.0.0.pom (2 KB at 4.0 KB/sec)
[INFO] Downloading: http://repository.apache.org/snapshots/org/apache/sling/org.apache.sling.feature/0.1.0-SNAPSHOT/maven-metadata.xml
[INFO] Downloading: http://repository.apache.org/snapshots/org/apache/sling/org.apache.sling.feature/0.1.0-SNAPSHOT/org.apache.sling.feature-0.1.0-SNAPSHOT.pom
[WARNING] The POM for org.apache.sling:org.apache.sling.feature:jar:0.1.0-SNAPSHOT is missing, no dependency information available
[INFO] Downloading: http://repository.apache.org/snapshots/org/apache/sling/org.apache.sling.feature.io/0.1.0-SNAPSHOT/maven-metadata.xml
[INFO] Downloading: http://repository.apache.org/snapshots/org/apache/sling/org.apache.sling.feature.io/0.1.0-SNAPSHOT/org.apache.sling.feature.io-0.1.0-SNAPSHOT.pom
[WARNING] The POM for org.apache.sling:org.apache.sling.feature.io:jar:0.1.0-SNAPSHOT is missing, no dependency information available
[INFO] Downloading: http://repository.apache.org/snapshots/org/apache/sling/org.apache.sling.feature.resolver/0.1.0-SNAPSHOT/maven-metadata.xml
[INFO] Downloaded: http://repository.apache.org/snapshots/org/apache/sling/org.apache.sling.feature.resolver/0.1.0-SNAPSHOT/maven-metadata.xml (1013 B at 3.1 KB/sec)
[INFO] Downloading: http://repository.apache.org/snapshots/org/apache/sling/org.apache.sling.feature.resolver/0.1.0-SNAPSHOT/org.apache.sling.feature.resolver-0.1.0-20180624.101223-6.pom
[INFO] Downloaded: http://repository.apache.org/snapshots/org/apache/sling/org.apache.sling.feature.resolver/0.1.0-SNAPSHOT/org.apache.sling.feature.resolver-0.1.0-20180624.101223-6.pom (6 KB at 16.4 KB/sec)
[INFO] Downloading: http://repository.apache.org/snapshots/org/apache/sling/org.apache.sling.feature.analyser/0.1.0-SNAPSHOT/maven-metadata.xml
[INFO] Downloading: http://repository.apache.org/snapshots/org/apache/sling/org.apache.sling.feature.analyser/0.1.0-SNAPSHOT/org.apache.sling.feature.analyser-0.1.0-SNAPSHOT.pom
[WARNING] The POM for org.apache.sling:org.apache.sling.feature.analyser:jar:0.1.0-SNAPSHOT is missing, no dependency information available
[INFO] Downloading: https://repo.maven.apache.org/maven2/org/osgi/osgi.core/7.0.0/osgi.core-7.0.0.jar
[INFO] Downloaded: https://repo.maven.apache.org/maven2/org/osgi/osgi.core/7.0.0/osgi.core-7.0.0.jar (481 KB at 4372.6 KB/sec)
[INFO] Downloading: http://repository.apache.org/snapshots/org/apache/sling/org.apache.sling.feature/0.1.0-SNAPSHOT/org.apache.sling.feature-0.1.0-SNAPSHOT.jar
[INFO] Downloading: http://repository.apache.org/snapshots/org/apache/sling/org.apache.sling.feature.io/0.1.0-SNAPSHOT/org.apache.sling.feature.io-0.1.0-SNAPSHOT.jar
[INFO] Downloading: http://repository.apache.org/snapshots/org/apache/sling/org.apache.sling.feature.resolver/0.1.0-SNAPSHOT/org.apache.sling.feature.resolver-0.1.0-20180624.101223-6.jar
[INFO] Downloading: http://repository.apache.org/snapshots/org/apache/sling/org.apache.sling.feature.analyser/0.1.0-SNAPSHOT/org.apache.sling.feature.analyser-0.1.0-SNAPSHOT.jar
[INFO] Downloaded: http://repository.apache.org/snapshots/org/apache/sling/org.apache.sling.feature.resolver/0.1.0-SNAPSHOT/org.apache.sling.feature.resolver-0.1.0-20180624.101223-6.jar (29 KB at 79.3 KB/sec)
[JENKINS] Archiving disabled
[JENKINS] Archiving disabled
[INFO] ------------------------------------------------------------------------
[INFO] BUILD FAILURE
[INFO] ------------------------------------------------------------------------
[INFO] Total time: 12.148 s
[INFO] Finished at: 2018-06-27T11:54:42+00:00
[INFO] Final Memory: 14M/245M
[INFO] ------------------------------------------------------------------------
Waiting for Jenkins to finish collecting data
[ERROR] Failed to execute goal on project org.apache.sling.feature.launcher: Could not resolve dependencies for project org.apache.sling:org.apache.sling.feature.launcher:jar:0.1.0-SNAPSHOT: The following artifacts could not be resolved: org.apache.sling:org.apache.sling.feature:jar:0.1.0-SNAPSHOT, org.apache.sling:org.apache.sling.feature.io:jar:0.1.0-SNAPSHOT, org.apache.sling:org.apache.sling.feature.analyser:jar:0.1.0-SNAPSHOT: Could not find artifact org.apache.sling:org.apache.sling.feature:jar:0.1.0-SNAPSHOT in Nexus (http://repository.apache.org/snapshots) -> [Help 1]
[ERROR] 
[ERROR] To see the full stack trace of the errors, re-run Maven with the -e switch.
[ERROR] Re-run Maven using the -X switch to enable full debug logging.
[ERROR] 
[ERROR] For more information about the errors and possible solutions, please read the following articles:
[ERROR] [Help 1] http://cwiki.apache.org/confluence/display/MAVEN/DependencyResolutionException
channel stopped
Recording test results
Not sending mail to unregistered user karlpauls@gmail.com