You are viewing a plain text version of this content. The canonical link for it is here.
Posted to builds@hbase.apache.org by Apache Jenkins Server <je...@builds.apache.org> on 2016/02/25 02:17:31 UTC
Build failed in Jenkins: HBase-1.3 » latest1.8,yahoo-not-h2 #569
See <https://builds.apache.org/job/HBase-1.3/jdk=latest1.8,label=yahoo-not-h2/569/changes>
Changes:
[eclark] HBASE-12133 Add FastLongHistogram for metric computation (Yi Deng)
[eclark] HBASE-15222 Use less contended classes for metrics
------------------------------------------
[...truncated 46922 lines...]
Running org.apache.hadoop.hbase.mapreduce.TestGroupingTableMapper
Tests run: 1, Failures: 0, Errors: 0, Skipped: 0, Time elapsed: 0.8 sec - in org.apache.hadoop.hbase.mapreduce.TestGroupingTableMapper
Java HotSpot(TM) 64-Bit Server VM warning: ignoring option MaxPermSize=256m; support was removed in 8.0
Java HotSpot(TM) 64-Bit Server VM warning: ignoring option MaxPermSize=256m; support was removed in 8.0
Java HotSpot(TM) 64-Bit Server VM warning: ignoring option MaxPermSize=256m; support was removed in 8.0
Java HotSpot(TM) 64-Bit Server VM warning: ignoring option MaxPermSize=256m; support was removed in 8.0
Java HotSpot(TM) 64-Bit Server VM warning: ignoring option MaxPermSize=256m; support was removed in 8.0
Java HotSpot(TM) 64-Bit Server VM warning: ignoring option MaxPermSize=256m; support was removed in 8.0
Java HotSpot(TM) 64-Bit Server VM warning: ignoring option MaxPermSize=256m; support was removed in 8.0
Java HotSpot(TM) 64-Bit Server VM warning: ignoring option MaxPermSize=256m; support was removed in 8.0
Java HotSpot(TM) 64-Bit Server VM warning: ignoring option MaxPermSize=256m; support was removed in 8.0
Running org.apache.hadoop.hbase.mapreduce.TestSimpleTotalOrderPartitioner
Tests run: 1, Failures: 0, Errors: 0, Skipped: 0, Time elapsed: 0.214 sec - in org.apache.hadoop.hbase.mapreduce.TestSimpleTotalOrderPartitioner
Java HotSpot(TM) 64-Bit Server VM warning: ignoring option MaxPermSize=256m; support was removed in 8.0
Java HotSpot(TM) 64-Bit Server VM warning: ignoring option MaxPermSize=256m; support was removed in 8.0
Java HotSpot(TM) 64-Bit Server VM warning: ignoring option MaxPermSize=256m; support was removed in 8.0
Java HotSpot(TM) 64-Bit Server VM warning: ignoring option MaxPermSize=256m; support was removed in 8.0
Java HotSpot(TM) 64-Bit Server VM warning: ignoring option MaxPermSize=256m; support was removed in 8.0
Java HotSpot(TM) 64-Bit Server VM warning: ignoring option MaxPermSize=256m; support was removed in 8.0
Running org.apache.hadoop.hbase.mapreduce.TestMultiTableSnapshotInputFormatImpl
Tests run: 4, Failures: 0, Errors: 0, Skipped: 0, Time elapsed: 1.783 sec - in org.apache.hadoop.hbase.mapreduce.TestMultiTableSnapshotInputFormatImpl
Java HotSpot(TM) 64-Bit Server VM warning: ignoring option MaxPermSize=256m; support was removed in 8.0
Java HotSpot(TM) 64-Bit Server VM warning: ignoring option MaxPermSize=256m; support was removed in 8.0
Running org.apache.hadoop.hbase.mapreduce.TestTableSplit
Tests run: 4, Failures: 0, Errors: 0, Skipped: 0, Time elapsed: 0.757 sec - in org.apache.hadoop.hbase.mapreduce.TestTableSplit
Java HotSpot(TM) 64-Bit Server VM warning: ignoring option MaxPermSize=256m; support was removed in 8.0
Running org.apache.hadoop.hbase.filter.TestFilter
Tests run: 22, Failures: 0, Errors: 0, Skipped: 0, Time elapsed: 6.33 sec - in org.apache.hadoop.hbase.filter.TestFilter
Java HotSpot(TM) 64-Bit Server VM warning: ignoring option MaxPermSize=256m; support was removed in 8.0
Running org.apache.hadoop.hbase.filter.TestFilterSerialization
Tests run: 26, Failures: 0, Errors: 0, Skipped: 0, Time elapsed: 2.197 sec - in org.apache.hadoop.hbase.filter.TestFilterSerialization
Java HotSpot(TM) 64-Bit Server VM warning: ignoring option MaxPermSize=256m; support was removed in 8.0
Running org.apache.hadoop.hbase.filter.TestMultipleColumnPrefixFilter
Tests run: 3, Failures: 0, Errors: 0, Skipped: 0, Time elapsed: 6.271 sec - in org.apache.hadoop.hbase.filter.TestMultipleColumnPrefixFilter
Java HotSpot(TM) 64-Bit Server VM warning: ignoring option MaxPermSize=256m; support was removed in 8.0
Running org.apache.hadoop.hbase.filter.TestFuzzyRowFilter
Tests run: 6, Failures: 0, Errors: 0, Skipped: 0, Time elapsed: 0.745 sec - in org.apache.hadoop.hbase.filter.TestFuzzyRowFilter
Java HotSpot(TM) 64-Bit Server VM warning: ignoring option MaxPermSize=256m; support was removed in 8.0
Running org.apache.hadoop.hbase.filter.TestNullComparator
Tests run: 3, Failures: 0, Errors: 0, Skipped: 0, Time elapsed: 0.517 sec - in org.apache.hadoop.hbase.filter.TestNullComparator
Java HotSpot(TM) 64-Bit Server VM warning: ignoring option MaxPermSize=256m; support was removed in 8.0
Running org.apache.hadoop.hbase.filter.TestParseFilter
Tests run: 34, Failures: 0, Errors: 0, Skipped: 0, Time elapsed: 1.759 sec - in org.apache.hadoop.hbase.filter.TestParseFilter
Java HotSpot(TM) 64-Bit Server VM warning: ignoring option MaxPermSize=256m; support was removed in 8.0
Running org.apache.hadoop.hbase.filter.TestSingleColumnValueExcludeFilter
Tests run: 1, Failures: 0, Errors: 0, Skipped: 0, Time elapsed: 0.385 sec - in org.apache.hadoop.hbase.filter.TestSingleColumnValueExcludeFilter
Java HotSpot(TM) 64-Bit Server VM warning: ignoring option MaxPermSize=256m; support was removed in 8.0
Java HotSpot(TM) 64-Bit Server VM warning: ignoring option MaxPermSize=256m; support was removed in 8.0
Java HotSpot(TM) 64-Bit Server VM warning: ignoring option MaxPermSize=256m; support was removed in 8.0
Running org.apache.hadoop.hbase.filter.TestDependentColumnFilter
Tests run: 4, Failures: 0, Errors: 0, Skipped: 0, Time elapsed: 2.452 sec - in org.apache.hadoop.hbase.filter.TestDependentColumnFilter
Java HotSpot(TM) 64-Bit Server VM warning: ignoring option MaxPermSize=256m; support was removed in 8.0
Running org.apache.hadoop.hbase.filter.TestInclusiveStopFilter
Tests run: 2, Failures: 0, Errors: 0, Skipped: 0, Time elapsed: 0.398 sec - in org.apache.hadoop.hbase.filter.TestInclusiveStopFilter
Java HotSpot(TM) 64-Bit Server VM warning: ignoring option MaxPermSize=256m; support was removed in 8.0
Java HotSpot(TM) 64-Bit Server VM warning: ignoring option MaxPermSize=256m; support was removed in 8.0
Running org.apache.hadoop.hbase.filter.TestSingleColumnValueFilter
Tests run: 3, Failures: 0, Errors: 0, Skipped: 0, Time elapsed: 0.981 sec - in org.apache.hadoop.hbase.filter.TestSingleColumnValueFilter
Java HotSpot(TM) 64-Bit Server VM warning: ignoring option MaxPermSize=256m; support was removed in 8.0
Java HotSpot(TM) 64-Bit Server VM warning: ignoring option MaxPermSize=256m; support was removed in 8.0
Running org.apache.hadoop.hbase.filter.TestPrefixFilter
Tests run: 3, Failures: 0, Errors: 0, Skipped: 0, Time elapsed: 0.515 sec - in org.apache.hadoop.hbase.filter.TestPrefixFilter
Java HotSpot(TM) 64-Bit Server VM warning: ignoring option MaxPermSize=256m; support was removed in 8.0
Running org.apache.hadoop.hbase.filter.TestRegexComparator
Tests run: 3, Failures: 0, Errors: 0, Skipped: 0, Time elapsed: 0.852 sec - in org.apache.hadoop.hbase.filter.TestRegexComparator
Java HotSpot(TM) 64-Bit Server VM warning: ignoring option MaxPermSize=256m; support was removed in 8.0
Running org.apache.hadoop.hbase.filter.TestColumnPrefixFilter
Tests run: 2, Failures: 0, Errors: 0, Skipped: 0, Time elapsed: 4.463 sec - in org.apache.hadoop.hbase.filter.TestColumnPrefixFilter
Java HotSpot(TM) 64-Bit Server VM warning: ignoring option MaxPermSize=256m; support was removed in 8.0
Running org.apache.hadoop.hbase.filter.TestRandomRowFilter
Tests run: 2, Failures: 0, Errors: 0, Skipped: 0, Time elapsed: 1.012 sec - in org.apache.hadoop.hbase.filter.TestRandomRowFilter
Java HotSpot(TM) 64-Bit Server VM warning: ignoring option MaxPermSize=256m; support was removed in 8.0
Running org.apache.hadoop.hbase.filter.TestBitComparator
Tests run: 6, Failures: 0, Errors: 0, Skipped: 0, Time elapsed: 0.68 sec - in org.apache.hadoop.hbase.filter.TestBitComparator
Java HotSpot(TM) 64-Bit Server VM warning: ignoring option MaxPermSize=256m; support was removed in 8.0
Running org.apache.hadoop.hbase.filter.TestFilterList
Tests run: 7, Failures: 0, Errors: 0, Skipped: 0, Time elapsed: 1.227 sec - in org.apache.hadoop.hbase.filter.TestFilterList
Java HotSpot(TM) 64-Bit Server VM warning: ignoring option MaxPermSize=256m; support was removed in 8.0
Java HotSpot(TM) 64-Bit Server VM warning: ignoring option MaxPermSize=256m; support was removed in 8.0
Java HotSpot(TM) 64-Bit Server VM warning: ignoring option MaxPermSize=256m; support was removed in 8.0
Running org.apache.hadoop.hbase.filter.TestComparatorSerialization
Tests run: 6, Failures: 0, Errors: 0, Skipped: 0, Time elapsed: 1.226 sec - in org.apache.hadoop.hbase.filter.TestComparatorSerialization
Java HotSpot(TM) 64-Bit Server VM warning: ignoring option MaxPermSize=256m; support was removed in 8.0
Running org.apache.hadoop.hbase.filter.TestColumnPaginationFilter
Tests run: 1, Failures: 0, Errors: 0, Skipped: 0, Time elapsed: 0.993 sec - in org.apache.hadoop.hbase.filter.TestColumnPaginationFilter
Java HotSpot(TM) 64-Bit Server VM warning: ignoring option MaxPermSize=256m; support was removed in 8.0
Running org.apache.hadoop.hbase.filter.TestInvocationRecordFilter
Tests run: 1, Failures: 0, Errors: 0, Skipped: 0, Time elapsed: 1.866 sec - in org.apache.hadoop.hbase.filter.TestInvocationRecordFilter
Java HotSpot(TM) 64-Bit Server VM warning: ignoring option MaxPermSize=256m; support was removed in 8.0
Running org.apache.hadoop.hbase.filter.TestFirstKeyValueMatchingQualifiersFilter
Tests run: 1, Failures: 0, Errors: 0, Skipped: 0, Time elapsed: 0.345 sec - in org.apache.hadoop.hbase.filter.TestFirstKeyValueMatchingQualifiersFilter
Java HotSpot(TM) 64-Bit Server VM warning: ignoring option MaxPermSize=256m; support was removed in 8.0
Running org.apache.hadoop.hbase.filter.TestPageFilter
Tests run: 2, Failures: 0, Errors: 0, Skipped: 0, Time elapsed: 0.515 sec - in org.apache.hadoop.hbase.filter.TestPageFilter
Java HotSpot(TM) 64-Bit Server VM warning: ignoring option MaxPermSize=256m; support was removed in 8.0
Java HotSpot(TM) 64-Bit Server VM warning: ignoring option MaxPermSize=256m; support was removed in 8.0
Java HotSpot(TM) 64-Bit Server VM warning: ignoring option MaxPermSize=256m; support was removed in 8.0
Running org.apache.hadoop.hbase.TestIPv6NIOServerSocketChannel
Tests run: 2, Failures: 0, Errors: 0, Skipped: 0, Time elapsed: 0.698 sec - in org.apache.hadoop.hbase.TestIPv6NIOServerSocketChannel
Results :
Tests in error:
org.apache.hadoop.hbase.ipc.TestRpcMetrics.testSourceMethods(org.apache.hadoop.hbase.ipc.TestRpcMetrics)
Run 1: TestRpcMetrics.testSourceMethods:89 » NullPointer
Run 2: TestRpcMetrics.testSourceMethods:89 » NullPointer
Run 3: TestRpcMetrics.testSourceMethods:89 » NullPointer
org.apache.hadoop.hbase.ipc.TestRpcMetrics.testWrapperSource(org.apache.hadoop.hbase.ipc.TestRpcMetrics)
Run 1: TestRpcMetrics.testWrapperSource:67 » NullPointer
Run 2: TestRpcMetrics.testWrapperSource:67 » NullPointer
Run 3: TestRpcMetrics.testWrapperSource:67 » NullPointer
org.apache.hadoop.hbase.regionserver.TestMetricsRegion.testRegionWrapperMetrics(org.apache.hadoop.hbase.regionserver.TestMetricsRegion)
Run 1: TestMetricsRegion.testRegionWrapperMetrics:38 » NullPointer
Run 2: TestMetricsRegion.testRegionWrapperMetrics:38 » NullPointer
Run 3: TestMetricsRegion.testRegionWrapperMetrics:38 » NullPointer
org.apache.hadoop.hbase.regionserver.TestMetricsRegionServer.testSlowCount(org.apache.hadoop.hbase.regionserver.TestMetricsRegionServer)
Run 1: TestMetricsRegionServer.testSlowCount:126 » NullPointer
Run 2: TestMetricsRegionServer.testSlowCount:126 » NullPointer
Run 3: TestMetricsRegionServer.testSlowCount:126 » NullPointer
org.apache.hadoop.hbase.regionserver.TestMetricsRegionServer.testWrapperSource(org.apache.hadoop.hbase.regionserver.TestMetricsRegionServer)
Run 1: TestMetricsRegionServer.testWrapperSource:56 » NullPointer
Run 2: TestMetricsRegionServer.testWrapperSource:56 » NullPointer
Run 3: TestMetricsRegionServer.testWrapperSource:56 » NullPointer
Tests run: 1003, Failures: 0, Errors: 5, Skipped: 20
[INFO] ------------------------------------------------------------------------
[INFO] Reactor Summary:
[INFO]
[INFO] Apache HBase ...................................... SUCCESS [1:01.470s]
[INFO] Apache HBase - Checkstyle ......................... SUCCESS [5.580s]
[INFO] Apache HBase - Resource Bundle .................... SUCCESS [0.339s]
[INFO] Apache HBase - Annotations ........................ SUCCESS [1.910s]
[INFO] Apache HBase - Protocol ........................... SUCCESS [23.280s]
[INFO] Apache HBase - Common ............................. SUCCESS [2:34.804s]
[INFO] Apache HBase - Procedure .......................... SUCCESS [3:56.721s]
[INFO] Apache HBase - Client ............................. SUCCESS [1:33.514s]
[INFO] Apache HBase - Hadoop Compatibility ............... SUCCESS [10.104s]
[INFO] Apache HBase - Hadoop Two Compatibility ........... SUCCESS [10.273s]
[INFO] Apache HBase - Prefix Tree ........................ SUCCESS [9.855s]
[INFO] Apache HBase - Server ............................. FAILURE [18:41.523s]
[INFO] Apache HBase - Testing Util ....................... SKIPPED
[INFO] Apache HBase - Thrift ............................. SKIPPED
[INFO] Apache HBase - Rest ............................... SKIPPED
[INFO] Apache HBase - Shell .............................. SKIPPED
[INFO] Apache HBase - Integration Tests .................. SKIPPED
[INFO] Apache HBase - Examples ........................... SKIPPED
[INFO] Apache HBase - External Block Cache ............... SKIPPED
[INFO] Apache HBase - Assembly ........................... SKIPPED
[INFO] Apache HBase - Shaded ............................. SKIPPED
[INFO] Apache HBase - Shaded - Client .................... SKIPPED
[INFO] Apache HBase - Shaded - Server .................... SKIPPED
[INFO] ------------------------------------------------------------------------
[INFO] BUILD FAILURE
[INFO] ------------------------------------------------------------------------
[INFO] Total time: 29:09.818s
[INFO] Finished at: Thu Feb 25 01:16:51 UTC 2016
[INFO] Final Memory: 95M/1113M
[INFO] ------------------------------------------------------------------------
[ERROR] Failed to execute goal org.apache.maven.plugins:maven-surefire-plugin:2.18.1:test (default-test) on project hbase-server: There are test failures.
[ERROR]
[ERROR] Please refer to <https://builds.apache.org/job/HBase-1.3/jdk=latest1.8,label=yahoo-not-h2/ws/hbase-server/target/surefire-reports> for the individual test results.
[ERROR] -> [Help 1]
[ERROR]
[ERROR] To see the full stack trace of the errors, re-run Maven with the -e switch.
[ERROR] Re-run Maven using the -X switch to enable full debug logging.
[ERROR]
[ERROR] For more information about the errors and possible solutions, please read the following articles:
[ERROR] [Help 1] http://cwiki.apache.org/confluence/display/MAVEN/MojoFailureException
[ERROR]
[ERROR] After correcting the problems, you can resume the build with the command
[ERROR] mvn <goals> -rf :hbase-server
Build step 'Invoke top-level Maven targets' marked build as failure
Performing Post build task...
Match found for :.* : True
Logical operation result is TRUE
Running script : # Post-build task script. TODO: Check this in and have all builds reference check-in.
pwd && ls
# NOTE!!!! The below code has been copied and pasted from ./dev-tools/run-test.sh
# Do not change here without syncing there and vice-versa.
ZOMBIE_TESTS_COUNT=`jps -v | grep surefirebooter | grep -e '-Dhbase.test' | wc -l`
if [[ $ZOMBIE_TESTS_COUNT != 0 ]] ; then
echo "Suspicious java process found - waiting 30s to see if there are just slow to stop"
sleep 30
ZOMBIE_TESTS_COUNT=`jps -v | grep surefirebooter | grep -e '-Dhbase.test' | wc -l`
if [[ $ZOMBIE_TESTS_COUNT != 0 ]] ; then
echo " {color:red}There appear to be $ZOMBIE_TESTS_COUNT zombie tests{color}, they should have been killed by surefire but survived"
jps -v | grep surefirebooter | grep -e '-Dhbase.test'
jps -v | grep surefirebooter | grep -e '-Dhbase.test' | cut -d ' ' -f 1 | xargs -n 1 jstack
# Exit with error
exit 1
else
echo "We're ok: there is no zombie test, but some tests took some time to stop"
fi
else
echo "We're ok: there is no zombie test"
fi
[yahoo-not-h2] $ /bin/bash -xe /tmp/hudson497025694627272936.sh
+ pwd
<https://builds.apache.org/job/HBase-1.3/jdk=latest1.8,label=yahoo-not-h2/ws/>
+ ls
bin
CHANGES.txt
conf
dev-support
hbase-annotations
hbase-assembly
hbase-checkstyle
hbase-client
hbase-common
hbase-examples
hbase-external-blockcache
hbase-hadoop2-compat
hbase-hadoop-compat
hbase-it
hbase-native-client
hbase-prefix-tree
hbase-procedure
hbase-protocol
hbase-resource-bundle
hbase-rest
hbase-server
hbase-shaded
hbase-shell
hbase-testing-util
hbase-thrift
LICENSE.txt
NOTICE.txt
pom.xml
README.txt
src
target
++ jps -v
++ grep surefirebooter
++ grep -e -Dhbase.test
++ wc -l
+ ZOMBIE_TESTS_COUNT=0
+ [[ 0 != 0 ]]
+ echo 'We'\''re ok: there is no zombie test'
We're ok: there is no zombie test
POST BUILD TASK : SUCCESS
END OF POST BUILD TASK : 0
Archiving artifacts
Recording test results
Jenkins build is back to normal : HBase-1.3 » latest1.8,yahoo-not-h2 #575
Posted by Apache Jenkins Server <je...@builds.apache.org>.
See <https://builds.apache.org/job/HBase-1.3/jdk=latest1.8,label=yahoo-not-h2/575/changes>
Build failed in Jenkins: HBase-1.3 » latest1.8,yahoo-not-h2 #574
Posted by Apache Jenkins Server <je...@builds.apache.org>.
See <https://builds.apache.org/job/HBase-1.3/jdk=latest1.8,label=yahoo-not-h2/574/changes>
Changes:
[stack] HBASE-15311 Prevent NPE in BlockCacheViewTmpl.
------------------------------------------
[...truncated 47441 lines...]
Tests run: 4, Failures: 0, Errors: 0, Skipped: 0, Time elapsed: 90.009 sec - in org.apache.hadoop.hbase.io.hfile.TestForceCacheImportantBlocks
Java HotSpot(TM) 64-Bit Server VM warning: ignoring option MaxPermSize=256m; support was removed in 8.0
Running org.apache.hadoop.hbase.io.TestFileLink
Tests run: 20, Failures: 0, Errors: 0, Skipped: 0, Time elapsed: 331.984 sec - in org.apache.hadoop.hbase.io.encoding.TestEncodedSeekers
Java HotSpot(TM) 64-Bit Server VM warning: ignoring option MaxPermSize=256m; support was removed in 8.0
Java HotSpot(TM) 64-Bit Server VM warning: ignoring option MaxPermSize=256m; support was removed in 8.0
Java HotSpot(TM) 64-Bit Server VM warning: ignoring option MaxPermSize=256m; support was removed in 8.0
Tests run: 6, Failures: 0, Errors: 0, Skipped: 0, Time elapsed: 71.27 sec - in org.apache.hadoop.hbase.io.hfile.TestScannerSelectionUsingTTL
Java HotSpot(TM) 64-Bit Server VM warning: ignoring option MaxPermSize=256m; support was removed in 8.0
Tests run: 10, Failures: 0, Errors: 0, Skipped: 0, Time elapsed: 24.804 sec - in org.apache.hadoop.hbase.io.hfile.TestHFileBlockIndex
Java HotSpot(TM) 64-Bit Server VM warning: ignoring option MaxPermSize=256m; support was removed in 8.0
Tests run: 5, Failures: 0, Errors: 0, Skipped: 0, Time elapsed: 34.111 sec - in org.apache.hadoop.hbase.io.TestFileLink
Java HotSpot(TM) 64-Bit Server VM warning: ignoring option MaxPermSize=256m; support was removed in 8.0
Running org.apache.hadoop.hbase.security.access.TestTablePermissions
Running org.apache.hadoop.hbase.security.access.TestAccessController
Running org.apache.hadoop.hbase.security.access.TestAccessController3
Tests run: 1, Failures: 0, Errors: 0, Skipped: 0, Time elapsed: 5.545 sec - in org.apache.hadoop.hbase.security.access.TestAccessController3
Java HotSpot(TM) 64-Bit Server VM warning: ignoring option MaxPermSize=256m; support was removed in 8.0
Running org.apache.hadoop.hbase.security.access.TestCellACLs
Tests run: 7, Failures: 0, Errors: 0, Skipped: 0, Time elapsed: 26.951 sec - in org.apache.hadoop.hbase.security.access.TestTablePermissions
Java HotSpot(TM) 64-Bit Server VM warning: ignoring option MaxPermSize=256m; support was removed in 8.0
Tests run: 2, Failures: 0, Errors: 0, Skipped: 0, Time elapsed: 19.437 sec - in org.apache.hadoop.hbase.security.access.TestCellACLs
Java HotSpot(TM) 64-Bit Server VM warning: ignoring option MaxPermSize=256m; support was removed in 8.0
Running org.apache.hadoop.hbase.security.access.TestAccessControlFilter
Tests run: 1, Failures: 0, Errors: 0, Skipped: 0, Time elapsed: 5.753 sec - in org.apache.hadoop.hbase.security.access.TestAccessControlFilter
Java HotSpot(TM) 64-Bit Server VM warning: ignoring option MaxPermSize=256m; support was removed in 8.0
Running org.apache.hadoop.hbase.security.access.TestNamespaceCommands
Running org.apache.hadoop.hbase.security.access.TestCellACLWithMultipleVersions
Running org.apache.hadoop.hbase.security.access.TestAccessController2
Tests run: 7, Failures: 0, Errors: 0, Skipped: 0, Time elapsed: 15.655 sec - in org.apache.hadoop.hbase.security.access.TestNamespaceCommands
Java HotSpot(TM) 64-Bit Server VM warning: ignoring option MaxPermSize=256m; support was removed in 8.0
Running org.apache.hadoop.hbase.security.access.TestZKPermissionsWatcher
Tests run: 58, Failures: 0, Errors: 0, Skipped: 0, Time elapsed: 105.04 sec - in org.apache.hadoop.hbase.security.access.TestAccessController
Java HotSpot(TM) 64-Bit Server VM warning: ignoring option MaxPermSize=256m; support was removed in 8.0
Tests run: 1, Failures: 0, Errors: 0, Skipped: 0, Time elapsed: 4.423 sec - in org.apache.hadoop.hbase.security.access.TestZKPermissionsWatcher
Java HotSpot(TM) 64-Bit Server VM warning: ignoring option MaxPermSize=256m; support was removed in 8.0
Tests run: 72, Failures: 0, Errors: 0, Skipped: 0, Time elapsed: 351.996 sec - in org.apache.hadoop.hbase.io.hfile.TestCacheOnWrite
Java HotSpot(TM) 64-Bit Server VM warning: ignoring option MaxPermSize=256m; support was removed in 8.0
Tests run: 8, Failures: 0, Errors: 0, Skipped: 0, Time elapsed: 59.489 sec - in org.apache.hadoop.hbase.security.access.TestCellACLWithMultipleVersions
Java HotSpot(TM) 64-Bit Server VM warning: ignoring option MaxPermSize=256m; support was removed in 8.0
Running org.apache.hadoop.hbase.security.access.TestWithDisabledAuthorization
Running org.apache.hadoop.hbase.security.access.TestScanEarlyTermination
Running org.apache.hadoop.hbase.security.visibility.TestVisibilityLablesWithGroups
Tests run: 6, Failures: 0, Errors: 0, Skipped: 0, Time elapsed: 63.475 sec - in org.apache.hadoop.hbase.security.access.TestAccessController2
Java HotSpot(TM) 64-Bit Server VM warning: ignoring option MaxPermSize=256m; support was removed in 8.0
Tests run: 1, Failures: 0, Errors: 0, Skipped: 0, Time elapsed: 4.273 sec - in org.apache.hadoop.hbase.security.visibility.TestVisibilityLablesWithGroups
Java HotSpot(TM) 64-Bit Server VM warning: ignoring option MaxPermSize=256m; support was removed in 8.0
Tests run: 1, Failures: 0, Errors: 0, Skipped: 0, Time elapsed: 10.985 sec - in org.apache.hadoop.hbase.security.access.TestScanEarlyTermination
Java HotSpot(TM) 64-Bit Server VM warning: ignoring option MaxPermSize=256m; support was removed in 8.0
Java HotSpot(TM) 64-Bit Server VM warning: ignoring option MaxPermSize=256m; support was removed in 8.0
Running org.apache.hadoop.hbase.security.visibility.TestVisibilityLabelsWithDeletes
Running org.apache.hadoop.hbase.security.visibility.TestVisibilityLabelsWithDefaultVisLabelService
Running org.apache.hadoop.hbase.security.visibility.TestVisibilityLabelsWithCustomVisLabService
Tests run: 6, Failures: 0, Errors: 0, Skipped: 0, Time elapsed: 49.285 sec - in org.apache.hadoop.hbase.security.access.TestWithDisabledAuthorization
Java HotSpot(TM) 64-Bit Server VM warning: ignoring option MaxPermSize=256m; support was removed in 8.0
Running org.apache.hadoop.hbase.security.visibility.TestDefaultScanLabelGeneratorStack
Tests run: 1, Failures: 0, Errors: 0, Skipped: 0, Time elapsed: 4.598 sec - in org.apache.hadoop.hbase.security.visibility.TestDefaultScanLabelGeneratorStack
Java HotSpot(TM) 64-Bit Server VM warning: ignoring option MaxPermSize=256m; support was removed in 8.0
Running org.apache.hadoop.hbase.security.visibility.TestVisibilityWithCheckAuths
Running org.apache.hadoop.hbase.security.visibility.TestVisibilityLabelsOpWithDifferentUsersNoACL
Tests run: 2, Failures: 0, Errors: 0, Skipped: 0, Time elapsed: 10.465 sec - in org.apache.hadoop.hbase.security.visibility.TestVisibilityWithCheckAuths
Java HotSpot(TM) 64-Bit Server VM warning: ignoring option MaxPermSize=256m; support was removed in 8.0
Tests run: 1, Failures: 0, Errors: 0, Skipped: 0, Time elapsed: 4.108 sec - in org.apache.hadoop.hbase.security.visibility.TestVisibilityLabelsOpWithDifferentUsersNoACL
Java HotSpot(TM) 64-Bit Server VM warning: ignoring option MaxPermSize=256m; support was removed in 8.0
Tests run: 21, Failures: 0, Errors: 0, Skipped: 0, Time elapsed: 50.082 sec - in org.apache.hadoop.hbase.security.visibility.TestVisibilityLabelsWithCustomVisLabService
Java HotSpot(TM) 64-Bit Server VM warning: ignoring option MaxPermSize=256m; support was removed in 8.0
Running org.apache.hadoop.hbase.security.visibility.TestVisibilityLabelsReplication
Tests run: 26, Failures: 0, Errors: 0, Skipped: 0, Time elapsed: 60.073 sec - in org.apache.hadoop.hbase.security.visibility.TestVisibilityLabelsWithDefaultVisLabelService
Java HotSpot(TM) 64-Bit Server VM warning: ignoring option MaxPermSize=256m; support was removed in 8.0
Running org.apache.hadoop.hbase.security.visibility.TestVisibilityLabelReplicationWithExpAsString
Running org.apache.hadoop.hbase.security.visibility.TestEnforcingScanLabelGenerator
Running org.apache.hadoop.hbase.security.visibility.TestVisibilityLabelsWithSLGStack
Tests run: 1, Failures: 0, Errors: 0, Skipped: 0, Time elapsed: 3.99 sec - in org.apache.hadoop.hbase.security.visibility.TestEnforcingScanLabelGenerator
Java HotSpot(TM) 64-Bit Server VM warning: ignoring option MaxPermSize=256m; support was removed in 8.0
Tests run: 1, Failures: 0, Errors: 0, Skipped: 0, Time elapsed: 3.442 sec - in org.apache.hadoop.hbase.security.visibility.TestVisibilityLabelsWithSLGStack
Java HotSpot(TM) 64-Bit Server VM warning: ignoring option MaxPermSize=256m; support was removed in 8.0
Java HotSpot(TM) 64-Bit Server VM warning: ignoring option MaxPermSize=256m; support was removed in 8.0
Tests run: 44, Failures: 0, Errors: 0, Skipped: 0, Time elapsed: 124.036 sec - in org.apache.hadoop.hbase.security.visibility.TestVisibilityLabelsWithDeletes
Java HotSpot(TM) 64-Bit Server VM warning: ignoring option MaxPermSize=256m; support was removed in 8.0
Tests run: 1, Failures: 0, Errors: 0, Skipped: 0, Time elapsed: 54.104 sec - in org.apache.hadoop.hbase.security.visibility.TestVisibilityLabelsReplication
Java HotSpot(TM) 64-Bit Server VM warning: ignoring option MaxPermSize=256m; support was removed in 8.0
Tests run: 1, Failures: 0, Errors: 0, Skipped: 0, Time elapsed: 51.027 sec - in org.apache.hadoop.hbase.security.visibility.TestVisibilityLabelReplicationWithExpAsString
Running org.apache.hadoop.hbase.security.token.TestZKSecretWatcher
Java HotSpot(TM) 64-Bit Server VM warning: ignoring option MaxPermSize=256m; support was removed in 8.0
Running org.apache.hadoop.hbase.security.visibility.TestWithDisabledAuthorization
Running org.apache.hadoop.hbase.security.visibility.TestVisibilityLabelsWithACL
Running org.apache.hadoop.hbase.security.token.TestTokenAuthentication
Tests run: 3, Failures: 0, Errors: 0, Skipped: 0, Time elapsed: 1.388 sec - in org.apache.hadoop.hbase.security.token.TestTokenAuthentication
Java HotSpot(TM) 64-Bit Server VM warning: ignoring option MaxPermSize=256m; support was removed in 8.0
Java HotSpot(TM) 64-Bit Server VM warning: ignoring option MaxPermSize=256m; support was removed in 8.0
Tests run: 2, Failures: 0, Errors: 0, Skipped: 0, Time elapsed: 4.073 sec - in org.apache.hadoop.hbase.security.visibility.TestWithDisabledAuthorization
Java HotSpot(TM) 64-Bit Server VM warning: ignoring option MaxPermSize=256m; support was removed in 8.0
Java HotSpot(TM) 64-Bit Server VM warning: ignoring option MaxPermSize=256m; support was removed in 8.0
Java HotSpot(TM) 64-Bit Server VM warning: ignoring option MaxPermSize=256m; support was removed in 8.0
Java HotSpot(TM) 64-Bit Server VM warning: ignoring option MaxPermSize=256m; support was removed in 8.0
Tests run: 1, Failures: 0, Errors: 0, Skipped: 0, Time elapsed: 13.852 sec - in org.apache.hadoop.hbase.security.token.TestZKSecretWatcher
Running org.apache.hadoop.hbase.TestHBaseOnOtherDfsCluster
Tests run: 5, Failures: 0, Errors: 0, Skipped: 0, Time elapsed: 14.321 sec - in org.apache.hadoop.hbase.security.visibility.TestVisibilityLabelsWithACL
Tests run: 1, Failures: 0, Errors: 0, Skipped: 0, Time elapsed: 25.436 sec - in org.apache.hadoop.hbase.TestHBaseOnOtherDfsCluster
Running org.apache.hadoop.hbase.security.token.TestGenerateDelegationToken
Tests run: 1, Failures: 0, Errors: 0, Skipped: 0, Time elapsed: 2.36 sec - in org.apache.hadoop.hbase.security.token.TestGenerateDelegationToken
Results :
Failed tests:
org.apache.hadoop.hbase.regionserver.TestRegionServerMetrics.testRangeCountMetrics(org.apache.hadoop.hbase.regionserver.TestRegionServerMetrics)
Run 1: TestRegionServerMetrics.testRangeCountMetrics:526 expected:<true> but was:<false>
Run 2: TestRegionServerMetrics.testRangeCountMetrics:510 Should get counter mutatetimerangecount01 but did not
Run 3: TestRegionServerMetrics.testRangeCountMetrics:510 Should get counter mutatetimerangecount01 but did not
Tests in error:
org.apache.hadoop.hbase.TestStochasticBalancerJmxMetrics.testJmxMetrics_EnsembleMode(org.apache.hadoop.hbase.TestStochasticBalancerJmxMetrics)
Run 1: TestStochasticBalancerJmxMetrics.testJmxMetrics_EnsembleMode:143 NullPointer
Run 2: TestStochasticBalancerJmxMetrics.testJmxMetrics_EnsembleMode:143 NullPointer
Run 3: TestStochasticBalancerJmxMetrics.testJmxMetrics_EnsembleMode:143 NullPointer
org.apache.hadoop.hbase.TestStochasticBalancerJmxMetrics.testJmxMetrics_PerTableMode(org.apache.hadoop.hbase.TestStochasticBalancerJmxMetrics)
Run 1: TestStochasticBalancerJmxMetrics.testJmxMetrics_PerTableMode:188 NullPointer
Run 2: TestStochasticBalancerJmxMetrics.testJmxMetrics_PerTableMode:188 NullPointer
Run 3: TestStochasticBalancerJmxMetrics.testJmxMetrics_PerTableMode:188 NullPointer
TestExportSnapshot.testExportFailure:321->runExportAndInjectFailures:348 » TestTimedOut
Flaked tests:
org.apache.hadoop.hbase.TestAcidGuarantees.testScanAtomicity(org.apache.hadoop.hbase.TestAcidGuarantees)
Run 1: TestAcidGuarantees.testScanAtomicity:347->runTestAtomicity:254->runTestAtomicity:315 » Runtime
Run 2: PASS
org.apache.hadoop.hbase.regionserver.TestAtomicOperation.testMultiRowMutationMultiThreads(org.apache.hadoop.hbase.regionserver.TestAtomicOperation)
Run 1: TestAtomicOperation.testMultiRowMutationMultiThreads:570 expected:<0> but was:<1>
Run 2: PASS
Tests run: 2475, Failures: 1, Errors: 3, Skipped: 40, Flakes: 2
[INFO] ------------------------------------------------------------------------
[INFO] Reactor Summary:
[INFO]
[INFO] Apache HBase ...................................... SUCCESS [54.803s]
[INFO] Apache HBase - Checkstyle ......................... SUCCESS [5.088s]
[INFO] Apache HBase - Resource Bundle .................... SUCCESS [0.366s]
[INFO] Apache HBase - Annotations ........................ SUCCESS [2.039s]
[INFO] Apache HBase - Protocol ........................... SUCCESS [25.998s]
[INFO] Apache HBase - Common ............................. SUCCESS [2:55.498s]
[INFO] Apache HBase - Procedure .......................... SUCCESS [3:52.498s]
[INFO] Apache HBase - Client ............................. SUCCESS [1:46.455s]
[INFO] Apache HBase - Hadoop Compatibility ............... SUCCESS [10.839s]
[INFO] Apache HBase - Hadoop Two Compatibility ........... SUCCESS [16.180s]
[INFO] Apache HBase - Prefix Tree ........................ SUCCESS [15.095s]
[INFO] Apache HBase - Server ............................. FAILURE [2:26:09.100s]
[INFO] Apache HBase - Testing Util ....................... SKIPPED
[INFO] Apache HBase - Thrift ............................. SKIPPED
[INFO] Apache HBase - Rest ............................... SKIPPED
[INFO] Apache HBase - Shell .............................. SKIPPED
[INFO] Apache HBase - Integration Tests .................. SKIPPED
[INFO] Apache HBase - Examples ........................... SKIPPED
[INFO] Apache HBase - External Block Cache ............... SKIPPED
[INFO] Apache HBase - Assembly ........................... SKIPPED
[INFO] Apache HBase - Shaded ............................. SKIPPED
[INFO] Apache HBase - Shaded - Client .................... SKIPPED
[INFO] Apache HBase - Shaded - Server .................... SKIPPED
[INFO] ------------------------------------------------------------------------
[INFO] BUILD FAILURE
[INFO] ------------------------------------------------------------------------
[INFO] Total time: 2:37:12.704s
[INFO] Finished at: Fri Feb 26 02:53:18 UTC 2016
[INFO] Final Memory: 96M/1616M
[INFO] ------------------------------------------------------------------------
[ERROR] Failed to execute goal org.apache.maven.plugins:maven-surefire-plugin:2.18.1:test (secondPartTestsExecution) on project hbase-server: There was a timeout or other error in the fork -> [Help 1]
[ERROR]
[ERROR] To see the full stack trace of the errors, re-run Maven with the -e switch.
[ERROR] Re-run Maven using the -X switch to enable full debug logging.
[ERROR]
[ERROR] For more information about the errors and possible solutions, please read the following articles:
[ERROR] [Help 1] http://cwiki.apache.org/confluence/display/MAVEN/MojoFailureException
[ERROR]
[ERROR] After correcting the problems, you can resume the build with the command
[ERROR] mvn <goals> -rf :hbase-server
Build step 'Invoke top-level Maven targets' marked build as failure
Performing Post build task...
Match found for :.* : True
Logical operation result is TRUE
Running script : # Post-build task script. TODO: Check this in and have all builds reference check-in.
pwd && ls
# NOTE!!!! The below code has been copied and pasted from ./dev-tools/run-test.sh
# Do not change here without syncing there and vice-versa.
ZOMBIE_TESTS_COUNT=`jps -v | grep surefirebooter | grep -e '-Dhbase.test' | wc -l`
if [[ $ZOMBIE_TESTS_COUNT != 0 ]] ; then
echo "Suspicious java process found - waiting 30s to see if there are just slow to stop"
sleep 30
ZOMBIE_TESTS_COUNT=`jps -v | grep surefirebooter | grep -e '-Dhbase.test' | wc -l`
if [[ $ZOMBIE_TESTS_COUNT != 0 ]] ; then
echo " {color:red}There appear to be $ZOMBIE_TESTS_COUNT zombie tests{color}, they should have been killed by surefire but survived"
jps -v | grep surefirebooter | grep -e '-Dhbase.test'
jps -v | grep surefirebooter | grep -e '-Dhbase.test' | cut -d ' ' -f 1 | xargs -n 1 jstack
# Exit with error
exit 1
else
echo "We're ok: there is no zombie test, but some tests took some time to stop"
fi
else
echo "We're ok: there is no zombie test"
fi
[yahoo-not-h2] $ /bin/bash -xe /tmp/hudson8179211680582984316.sh
+ pwd
<https://builds.apache.org/job/HBase-1.3/jdk=latest1.8,label=yahoo-not-h2/ws/>
+ ls
bin
CHANGES.txt
conf
dev-support
hbase-annotations
hbase-assembly
hbase-checkstyle
hbase-client
hbase-common
hbase-examples
hbase-external-blockcache
hbase-hadoop2-compat
hbase-hadoop-compat
hbase-it
hbase-native-client
hbase-prefix-tree
hbase-procedure
hbase-protocol
hbase-resource-bundle
hbase-rest
hbase-server
hbase-shaded
hbase-shell
hbase-testing-util
hbase-thrift
LICENSE.txt
NOTICE.txt
pom.xml
README.txt
src
target
++ wc -l
++ grep -e -Dhbase.test
++ grep surefirebooter
++ jps -v
+ ZOMBIE_TESTS_COUNT=0
+ [[ 0 != 0 ]]
+ echo 'We'\''re ok: there is no zombie test'
We're ok: there is no zombie test
POST BUILD TASK : SUCCESS
END OF POST BUILD TASK : 0
Archiving artifacts
Recording test results
Build failed in Jenkins: HBase-1.3 » latest1.8,yahoo-not-h2 #573
Posted by Apache Jenkins Server <je...@builds.apache.org>.
See <https://builds.apache.org/job/HBase-1.3/jdk=latest1.8,label=yahoo-not-h2/573/>
------------------------------------------
[...truncated 46181 lines...]
Java HotSpot(TM) 64-Bit Server VM warning: ignoring option MaxPermSize=256m; support was removed in 8.0
Java HotSpot(TM) 64-Bit Server VM warning: ignoring option MaxPermSize=256m; support was removed in 8.0
Java HotSpot(TM) 64-Bit Server VM warning: ignoring option MaxPermSize=256m; support was removed in 8.0
Running org.apache.hadoop.hbase.master.normalizer.TestSimpleRegionNormalizer
Tests run: 7, Failures: 0, Errors: 0, Skipped: 0, Time elapsed: 2.1 sec - in org.apache.hadoop.hbase.master.normalizer.TestSimpleRegionNormalizer
Java HotSpot(TM) 64-Bit Server VM warning: ignoring option MaxPermSize=256m; support was removed in 8.0
Java HotSpot(TM) 64-Bit Server VM warning: ignoring option MaxPermSize=256m; support was removed in 8.0
Running org.apache.hadoop.hbase.master.cleaner.TestReplicationHFileCleaner
Tests run: 3, Failures: 0, Errors: 0, Skipped: 0, Time elapsed: 1.359 sec - in org.apache.hadoop.hbase.master.cleaner.TestReplicationHFileCleaner
Java HotSpot(TM) 64-Bit Server VM warning: ignoring option MaxPermSize=256m; support was removed in 8.0
Java HotSpot(TM) 64-Bit Server VM warning: ignoring option MaxPermSize=256m; support was removed in 8.0
Running org.apache.hadoop.hbase.master.cleaner.TestCleanerChore
Tests run: 6, Failures: 0, Errors: 0, Skipped: 0, Time elapsed: 2.682 sec - in org.apache.hadoop.hbase.master.cleaner.TestCleanerChore
Java HotSpot(TM) 64-Bit Server VM warning: ignoring option MaxPermSize=256m; support was removed in 8.0
Running org.apache.hadoop.hbase.master.cleaner.TestHFileLinkCleaner
Tests run: 1, Failures: 0, Errors: 0, Skipped: 0, Time elapsed: 11.741 sec - in org.apache.hadoop.hbase.master.cleaner.TestHFileLinkCleaner
Java HotSpot(TM) 64-Bit Server VM warning: ignoring option MaxPermSize=256m; support was removed in 8.0
Java HotSpot(TM) 64-Bit Server VM warning: ignoring option MaxPermSize=256m; support was removed in 8.0
Java HotSpot(TM) 64-Bit Server VM warning: ignoring option MaxPermSize=256m; support was removed in 8.0
Java HotSpot(TM) 64-Bit Server VM warning: ignoring option MaxPermSize=256m; support was removed in 8.0
Java HotSpot(TM) 64-Bit Server VM warning: ignoring option MaxPermSize=256m; support was removed in 8.0
Java HotSpot(TM) 64-Bit Server VM warning: ignoring option MaxPermSize=256m; support was removed in 8.0
Running org.apache.hadoop.hbase.master.procedure.TestMasterProcedureScheduler
Tests run: 7, Failures: 0, Errors: 0, Skipped: 0, Time elapsed: 29.98 sec - in org.apache.hadoop.hbase.master.procedure.TestMasterProcedureScheduler
Java HotSpot(TM) 64-Bit Server VM warning: ignoring option MaxPermSize=256m; support was removed in 8.0
Java HotSpot(TM) 64-Bit Server VM warning: ignoring option MaxPermSize=256m; support was removed in 8.0
Java HotSpot(TM) 64-Bit Server VM warning: ignoring option MaxPermSize=256m; support was removed in 8.0
Java HotSpot(TM) 64-Bit Server VM warning: ignoring option MaxPermSize=256m; support was removed in 8.0
Java HotSpot(TM) 64-Bit Server VM warning: ignoring option MaxPermSize=256m; support was removed in 8.0
Java HotSpot(TM) 64-Bit Server VM warning: ignoring option MaxPermSize=256m; support was removed in 8.0
Java HotSpot(TM) 64-Bit Server VM warning: ignoring option MaxPermSize=256m; support was removed in 8.0
Java HotSpot(TM) 64-Bit Server VM warning: ignoring option MaxPermSize=256m; support was removed in 8.0
Java HotSpot(TM) 64-Bit Server VM warning: ignoring option MaxPermSize=256m; support was removed in 8.0
Java HotSpot(TM) 64-Bit Server VM warning: ignoring option MaxPermSize=256m; support was removed in 8.0
Java HotSpot(TM) 64-Bit Server VM warning: ignoring option MaxPermSize=256m; support was removed in 8.0
Java HotSpot(TM) 64-Bit Server VM warning: ignoring option MaxPermSize=256m; support was removed in 8.0
Java HotSpot(TM) 64-Bit Server VM warning: ignoring option MaxPermSize=256m; support was removed in 8.0
Java HotSpot(TM) 64-Bit Server VM warning: ignoring option MaxPermSize=256m; support was removed in 8.0
Java HotSpot(TM) 64-Bit Server VM warning: ignoring option MaxPermSize=256m; support was removed in 8.0
Java HotSpot(TM) 64-Bit Server VM warning: ignoring option MaxPermSize=256m; support was removed in 8.0
Java HotSpot(TM) 64-Bit Server VM warning: ignoring option MaxPermSize=256m; support was removed in 8.0
Java HotSpot(TM) 64-Bit Server VM warning: ignoring option MaxPermSize=256m; support was removed in 8.0
Java HotSpot(TM) 64-Bit Server VM warning: ignoring option MaxPermSize=256m; support was removed in 8.0
Java HotSpot(TM) 64-Bit Server VM warning: ignoring option MaxPermSize=256m; support was removed in 8.0
Java HotSpot(TM) 64-Bit Server VM warning: ignoring option MaxPermSize=256m; support was removed in 8.0
Java HotSpot(TM) 64-Bit Server VM warning: ignoring option MaxPermSize=256m; support was removed in 8.0
Java HotSpot(TM) 64-Bit Server VM warning: ignoring option MaxPermSize=256m; support was removed in 8.0
Java HotSpot(TM) 64-Bit Server VM warning: ignoring option MaxPermSize=256m; support was removed in 8.0
Java HotSpot(TM) 64-Bit Server VM warning: ignoring option MaxPermSize=256m; support was removed in 8.0
Java HotSpot(TM) 64-Bit Server VM warning: ignoring option MaxPermSize=256m; support was removed in 8.0
Java HotSpot(TM) 64-Bit Server VM warning: ignoring option MaxPermSize=256m; support was removed in 8.0
Running org.apache.hadoop.hbase.master.TestClockSkewDetection
Tests run: 1, Failures: 0, Errors: 0, Skipped: 0, Time elapsed: 1.113 sec - in org.apache.hadoop.hbase.master.TestClockSkewDetection
Java HotSpot(TM) 64-Bit Server VM warning: ignoring option MaxPermSize=256m; support was removed in 8.0
Running org.apache.hadoop.hbase.master.TestHMasterCommandLine
Tests run: 1, Failures: 0, Errors: 0, Skipped: 0, Time elapsed: 0.577 sec - in org.apache.hadoop.hbase.master.TestHMasterCommandLine
Java HotSpot(TM) 64-Bit Server VM warning: ignoring option MaxPermSize=256m; support was removed in 8.0
Java HotSpot(TM) 64-Bit Server VM warning: ignoring option MaxPermSize=256m; support was removed in 8.0
Java HotSpot(TM) 64-Bit Server VM warning: ignoring option MaxPermSize=256m; support was removed in 8.0
Running org.apache.hadoop.hbase.master.balancer.TestRegionLocationFinder
Tests run: 3, Failures: 0, Errors: 0, Skipped: 0, Time elapsed: 6.846 sec - in org.apache.hadoop.hbase.master.balancer.TestRegionLocationFinder
Java HotSpot(TM) 64-Bit Server VM warning: ignoring option MaxPermSize=256m; support was removed in 8.0
Running org.apache.hadoop.hbase.master.balancer.TestServerAndLoad
Tests run: 1, Failures: 0, Errors: 0, Skipped: 0, Time elapsed: 0.836 sec - in org.apache.hadoop.hbase.master.balancer.TestServerAndLoad
Java HotSpot(TM) 64-Bit Server VM warning: ignoring option MaxPermSize=256m; support was removed in 8.0
Java HotSpot(TM) 64-Bit Server VM warning: ignoring option MaxPermSize=256m; support was removed in 8.0
Java HotSpot(TM) 64-Bit Server VM warning: ignoring option MaxPermSize=256m; support was removed in 8.0
Running org.apache.hadoop.hbase.master.balancer.TestFavoredNodeAssignmentHelper
Tests run: 8, Failures: 0, Errors: 0, Skipped: 8, Time elapsed: 0.003 sec - in org.apache.hadoop.hbase.master.balancer.TestFavoredNodeAssignmentHelper
Java HotSpot(TM) 64-Bit Server VM warning: ignoring option MaxPermSize=256m; support was removed in 8.0
Java HotSpot(TM) 64-Bit Server VM warning: ignoring option MaxPermSize=256m; support was removed in 8.0
Java HotSpot(TM) 64-Bit Server VM warning: ignoring option MaxPermSize=256m; support was removed in 8.0
Java HotSpot(TM) 64-Bit Server VM warning: ignoring option MaxPermSize=256m; support was removed in 8.0
Running org.apache.hadoop.hbase.master.TestRegionStates
Tests run: 1, Failures: 0, Errors: 0, Skipped: 0, Time elapsed: 1.8 sec - in org.apache.hadoop.hbase.master.TestRegionStates
Java HotSpot(TM) 64-Bit Server VM warning: ignoring option MaxPermSize=256m; support was removed in 8.0
Java HotSpot(TM) 64-Bit Server VM warning: ignoring option MaxPermSize=256m; support was removed in 8.0
Java HotSpot(TM) 64-Bit Server VM warning: ignoring option MaxPermSize=256m; support was removed in 8.0
Java HotSpot(TM) 64-Bit Server VM warning: ignoring option MaxPermSize=256m; support was removed in 8.0
Java HotSpot(TM) 64-Bit Server VM warning: ignoring option MaxPermSize=256m; support was removed in 8.0
Running org.apache.hadoop.hbase.master.TestCatalogJanitor
Tests run: 7, Failures: 0, Errors: 0, Skipped: 0, Time elapsed: 15.819 sec - in org.apache.hadoop.hbase.master.TestCatalogJanitor
Java HotSpot(TM) 64-Bit Server VM warning: ignoring option MaxPermSize=256m; support was removed in 8.0
Java HotSpot(TM) 64-Bit Server VM warning: ignoring option MaxPermSize=256m; support was removed in 8.0
Running org.apache.hadoop.hbase.master.TestRegionPlan
Tests run: 1, Failures: 0, Errors: 0, Skipped: 0, Time elapsed: 1.154 sec - in org.apache.hadoop.hbase.master.TestRegionPlan
Java HotSpot(TM) 64-Bit Server VM warning: ignoring option MaxPermSize=256m; support was removed in 8.0
Running org.apache.hadoop.hbase.master.TestRegionState
Tests run: 1, Failures: 0, Errors: 0, Skipped: 0, Time elapsed: 2.221 sec - in org.apache.hadoop.hbase.master.TestRegionState
Java HotSpot(TM) 64-Bit Server VM warning: ignoring option MaxPermSize=256m; support was removed in 8.0
Java HotSpot(TM) 64-Bit Server VM warning: ignoring option MaxPermSize=256m; support was removed in 8.0
Java HotSpot(TM) 64-Bit Server VM warning: ignoring option MaxPermSize=256m; support was removed in 8.0
Running org.apache.hadoop.hbase.master.snapshot.TestSnapshotManager
Tests run: 2, Failures: 0, Errors: 0, Skipped: 0, Time elapsed: 1.022 sec - in org.apache.hadoop.hbase.master.snapshot.TestSnapshotManager
Java HotSpot(TM) 64-Bit Server VM warning: ignoring option MaxPermSize=256m; support was removed in 8.0
Running org.apache.hadoop.hbase.master.snapshot.TestSnapshotHFileCleaner
Tests run: 1, Failures: 0, Errors: 0, Skipped: 0, Time elapsed: 1.424 sec - in org.apache.hadoop.hbase.master.snapshot.TestSnapshotHFileCleaner
Java HotSpot(TM) 64-Bit Server VM warning: ignoring option MaxPermSize=256m; support was removed in 8.0
Java HotSpot(TM) 64-Bit Server VM warning: ignoring option MaxPermSize=256m; support was removed in 8.0
Java HotSpot(TM) 64-Bit Server VM warning: ignoring option MaxPermSize=256m; support was removed in 8.0
Java HotSpot(TM) 64-Bit Server VM warning: ignoring option MaxPermSize=256m; support was removed in 8.0
Java HotSpot(TM) 64-Bit Server VM warning: ignoring option MaxPermSize=256m; support was removed in 8.0
Java HotSpot(TM) 64-Bit Server VM warning: ignoring option MaxPermSize=256m; support was removed in 8.0
Java HotSpot(TM) 64-Bit Server VM warning: ignoring option MaxPermSize=256m; support was removed in 8.0
Java HotSpot(TM) 64-Bit Server VM warning: ignoring option MaxPermSize=256m; support was removed in 8.0
Java HotSpot(TM) 64-Bit Server VM warning: ignoring option MaxPermSize=256m; support was removed in 8.0
Java HotSpot(TM) 64-Bit Server VM warning: ignoring option MaxPermSize=256m; support was removed in 8.0
Java HotSpot(TM) 64-Bit Server VM warning: ignoring option MaxPermSize=256m; support was removed in 8.0
Java HotSpot(TM) 64-Bit Server VM warning: ignoring option MaxPermSize=256m; support was removed in 8.0
Running org.apache.hadoop.hbase.master.TestMasterQosFunction
Tests run: 2, Failures: 0, Errors: 0, Skipped: 0, Time elapsed: 3.07 sec - in org.apache.hadoop.hbase.master.TestMasterQosFunction
Java HotSpot(TM) 64-Bit Server VM warning: ignoring option MaxPermSize=256m; support was removed in 8.0
Running org.apache.hadoop.hbase.TestTagRewriteCell
Tests run: 1, Failures: 0, Errors: 0, Skipped: 0, Time elapsed: 1.206 sec - in org.apache.hadoop.hbase.TestTagRewriteCell
Results :
Failed tests:
org.apache.hadoop.hbase.ipc.TestSimpleRpcScheduler.testSoftAndHardQueueLimits(org.apache.hadoop.hbase.ipc.TestSimpleRpcScheduler)
Run 1: TestSimpleRpcScheduler.testSoftAndHardQueueLimits:354 null
Run 2: TestSimpleRpcScheduler.testSoftAndHardQueueLimits:354 null
Run 3: TestSimpleRpcScheduler.testSoftAndHardQueueLimits:354 null
Flaked tests:
org.apache.hadoop.hbase.ipc.TestAsyncIPC.testRTEDuringAsyncConnectionSetup[0](org.apache.hadoop.hbase.ipc.TestAsyncIPC)
Run 1: TestAsyncIPC.testRTEDuringAsyncConnectionSetup:229 Waiting timed out after [1,000] msec
Run 2: PASS
Tests run: 1004, Failures: 1, Errors: 0, Skipped: 20, Flakes: 1
[INFO] ------------------------------------------------------------------------
[INFO] Reactor Summary:
[INFO]
[INFO] Apache HBase ...................................... SUCCESS [59.373s]
[INFO] Apache HBase - Checkstyle ......................... SUCCESS [5.543s]
[INFO] Apache HBase - Resource Bundle .................... SUCCESS [0.467s]
[INFO] Apache HBase - Annotations ........................ SUCCESS [2.302s]
[INFO] Apache HBase - Protocol ........................... SUCCESS [32.137s]
[INFO] Apache HBase - Common ............................. SUCCESS [3:18.192s]
[INFO] Apache HBase - Procedure .......................... SUCCESS [4:43.326s]
[INFO] Apache HBase - Client ............................. SUCCESS [2:16.389s]
[INFO] Apache HBase - Hadoop Compatibility ............... SUCCESS [15.043s]
[INFO] Apache HBase - Hadoop Two Compatibility ........... SUCCESS [21.519s]
[INFO] Apache HBase - Prefix Tree ........................ SUCCESS [18.307s]
[INFO] Apache HBase - Server ............................. FAILURE [31:16.267s]
[INFO] Apache HBase - Testing Util ....................... SKIPPED
[INFO] Apache HBase - Thrift ............................. SKIPPED
[INFO] Apache HBase - Rest ............................... SKIPPED
[INFO] Apache HBase - Shell .............................. SKIPPED
[INFO] Apache HBase - Integration Tests .................. SKIPPED
[INFO] Apache HBase - Examples ........................... SKIPPED
[INFO] Apache HBase - External Block Cache ............... SKIPPED
[INFO] Apache HBase - Assembly ........................... SKIPPED
[INFO] Apache HBase - Shaded ............................. SKIPPED
[INFO] Apache HBase - Shaded - Client .................... SKIPPED
[INFO] Apache HBase - Shaded - Server .................... SKIPPED
[INFO] ------------------------------------------------------------------------
[INFO] BUILD FAILURE
[INFO] ------------------------------------------------------------------------
[INFO] Total time: 44:30.737s
[INFO] Finished at: Thu Feb 25 21:53:05 UTC 2016
[INFO] Final Memory: 95M/2571M
[INFO] ------------------------------------------------------------------------
[ERROR] Failed to execute goal org.apache.maven.plugins:maven-surefire-plugin:2.18.1:test (default-test) on project hbase-server: There are test failures.
[ERROR]
[ERROR] Please refer to <https://builds.apache.org/job/HBase-1.3/jdk=latest1.8,label=yahoo-not-h2/ws/hbase-server/target/surefire-reports> for the individual test results.
[ERROR] -> [Help 1]
[ERROR]
[ERROR] To see the full stack trace of the errors, re-run Maven with the -e switch.
[ERROR] Re-run Maven using the -X switch to enable full debug logging.
[ERROR]
[ERROR] For more information about the errors and possible solutions, please read the following articles:
[ERROR] [Help 1] http://cwiki.apache.org/confluence/display/MAVEN/MojoFailureException
[ERROR]
[ERROR] After correcting the problems, you can resume the build with the command
[ERROR] mvn <goals> -rf :hbase-server
Build step 'Invoke top-level Maven targets' marked build as failure
Performing Post build task...
Match found for :.* : True
Logical operation result is TRUE
Running script : # Post-build task script. TODO: Check this in and have all builds reference check-in.
pwd && ls
# NOTE!!!! The below code has been copied and pasted from ./dev-tools/run-test.sh
# Do not change here without syncing there and vice-versa.
ZOMBIE_TESTS_COUNT=`jps -v | grep surefirebooter | grep -e '-Dhbase.test' | wc -l`
if [[ $ZOMBIE_TESTS_COUNT != 0 ]] ; then
echo "Suspicious java process found - waiting 30s to see if there are just slow to stop"
sleep 30
ZOMBIE_TESTS_COUNT=`jps -v | grep surefirebooter | grep -e '-Dhbase.test' | wc -l`
if [[ $ZOMBIE_TESTS_COUNT != 0 ]] ; then
echo " {color:red}There appear to be $ZOMBIE_TESTS_COUNT zombie tests{color}, they should have been killed by surefire but survived"
jps -v | grep surefirebooter | grep -e '-Dhbase.test'
jps -v | grep surefirebooter | grep -e '-Dhbase.test' | cut -d ' ' -f 1 | xargs -n 1 jstack
# Exit with error
exit 1
else
echo "We're ok: there is no zombie test, but some tests took some time to stop"
fi
else
echo "We're ok: there is no zombie test"
fi
[yahoo-not-h2] $ /bin/bash -xe /tmp/hudson2235555022801998501.sh
+ pwd
<https://builds.apache.org/job/HBase-1.3/jdk=latest1.8,label=yahoo-not-h2/ws/>
+ ls
bin
CHANGES.txt
conf
dev-support
hbase-annotations
hbase-assembly
hbase-checkstyle
hbase-client
hbase-common
hbase-examples
hbase-external-blockcache
hbase-hadoop2-compat
hbase-hadoop-compat
hbase-it
hbase-native-client
hbase-prefix-tree
hbase-procedure
hbase-protocol
hbase-resource-bundle
hbase-rest
hbase-server
hbase-shaded
hbase-shell
hbase-testing-util
hbase-thrift
LICENSE.txt
NOTICE.txt
pom.xml
README.txt
src
target
++ wc -l
++ grep -e -Dhbase.test
++ grep surefirebooter
++ jps -v
+ ZOMBIE_TESTS_COUNT=0
+ [[ 0 != 0 ]]
+ echo 'We'\''re ok: there is no zombie test'
We're ok: there is no zombie test
POST BUILD TASK : SUCCESS
END OF POST BUILD TASK : 0
Archiving artifacts
Recording test results
Build failed in Jenkins: HBase-1.3 » latest1.8,yahoo-not-h2 #572
Posted by Apache Jenkins Server <je...@builds.apache.org>.
See <https://builds.apache.org/job/HBase-1.3/jdk=latest1.8,label=yahoo-not-h2/572/changes>
Changes:
[eclark] HBASE-15222 Addendum - Use less contended classes for metrics
[matteo.bertozzi] HBASE-15144 Procedure v2 - Web UI displaying Store state
------------------------------------------
[...truncated 47447 lines...]
Java HotSpot(TM) 64-Bit Server VM warning: ignoring option MaxPermSize=256m; support was removed in 8.0
Java HotSpot(TM) 64-Bit Server VM warning: ignoring option MaxPermSize=256m; support was removed in 8.0
Java HotSpot(TM) 64-Bit Server VM warning: ignoring option MaxPermSize=256m; support was removed in 8.0
Tests run: 2, Failures: 0, Errors: 0, Skipped: 0, Time elapsed: 12.595 sec - in org.apache.hadoop.hbase.coprocessor.TestCoprocessorTableEndpoint
Java HotSpot(TM) 64-Bit Server VM warning: ignoring option MaxPermSize=256m; support was removed in 8.0
Running org.apache.hadoop.hbase.coprocessor.TestRegionServerCoprocessorEndpoint
Tests run: 2, Failures: 0, Errors: 0, Skipped: 0, Time elapsed: 1.171 sec - in org.apache.hadoop.hbase.coprocessor.TestRegionServerCoprocessorEndpoint
Java HotSpot(TM) 64-Bit Server VM warning: ignoring option MaxPermSize=256m; support was removed in 8.0
Running org.apache.hadoop.hbase.coprocessor.TestRegionObserverInterface
Tests run: 2, Failures: 0, Errors: 0, Skipped: 0, Time elapsed: 120.313 sec - in org.apache.hadoop.hbase.TestIOFencing
Java HotSpot(TM) 64-Bit Server VM warning: ignoring option MaxPermSize=256m; support was removed in 8.0
Running org.apache.hadoop.hbase.coprocessor.TestMasterCoprocessorExceptionWithRemove
Tests run: 1, Failures: 0, Errors: 0, Skipped: 0, Time elapsed: 5.806 sec - in org.apache.hadoop.hbase.coprocessor.TestMasterCoprocessorExceptionWithRemove
Java HotSpot(TM) 64-Bit Server VM warning: ignoring option MaxPermSize=256m; support was removed in 8.0
Running org.apache.hadoop.hbase.coprocessor.TestAggregateProtocol
Tests run: 44, Failures: 0, Errors: 0, Skipped: 0, Time elapsed: 7.051 sec - in org.apache.hadoop.hbase.coprocessor.TestAggregateProtocol
Java HotSpot(TM) 64-Bit Server VM warning: ignoring option MaxPermSize=256m; support was removed in 8.0
Running org.apache.hadoop.hbase.coprocessor.TestBatchCoprocessorEndpoint
Tests run: 4, Failures: 0, Errors: 0, Skipped: 0, Time elapsed: 2.321 sec - in org.apache.hadoop.hbase.coprocessor.TestBatchCoprocessorEndpoint
Java HotSpot(TM) 64-Bit Server VM warning: ignoring option MaxPermSize=256m; support was removed in 8.0
Running org.apache.hadoop.hbase.coprocessor.TestRegionServerObserver
Running org.apache.hadoop.hbase.coprocessor.TestHTableWrapper
Tests run: 1, Failures: 0, Errors: 0, Skipped: 0, Time elapsed: 7.309 sec - in org.apache.hadoop.hbase.coprocessor.TestHTableWrapper
Java HotSpot(TM) 64-Bit Server VM warning: ignoring option MaxPermSize=256m; support was removed in 8.0
Java HotSpot(TM) 64-Bit Server VM warning: ignoring option MaxPermSize=256m; support was removed in 8.0
Java HotSpot(TM) 64-Bit Server VM warning: ignoring option MaxPermSize=256m; support was removed in 8.0
Tests run: 1, Failures: 0, Errors: 0, Skipped: 0, Time elapsed: 23.211 sec - in org.apache.hadoop.hbase.coprocessor.TestRegionServerObserver
Java HotSpot(TM) 64-Bit Server VM warning: ignoring option MaxPermSize=256m; support was removed in 8.0
Running org.apache.hadoop.hbase.coprocessor.TestRegionServerCoprocessorExceptionWithAbort
Running org.apache.hadoop.hbase.coprocessor.TestClassLoading
Tests run: 14, Failures: 0, Errors: 0, Skipped: 2, Time elapsed: 74.75 sec - in org.apache.hadoop.hbase.coprocessor.TestRegionObserverInterface
Java HotSpot(TM) 64-Bit Server VM warning: ignoring option MaxPermSize=256m; support was removed in 8.0
Tests run: 2, Failures: 0, Errors: 0, Skipped: 0, Time elapsed: 29.981 sec - in org.apache.hadoop.hbase.coprocessor.TestRegionServerCoprocessorExceptionWithAbort
Java HotSpot(TM) 64-Bit Server VM warning: ignoring option MaxPermSize=256m; support was removed in 8.0
Running org.apache.hadoop.hbase.coprocessor.TestDoubleColumnInterpreter
Tests run: 9, Failures: 0, Errors: 0, Skipped: 0, Time elapsed: 31.648 sec - in org.apache.hadoop.hbase.coprocessor.TestClassLoading
Java HotSpot(TM) 64-Bit Server VM warning: ignoring option MaxPermSize=256m; support was removed in 8.0
Tests run: 38, Failures: 0, Errors: 0, Skipped: 0, Time elapsed: 8.612 sec - in org.apache.hadoop.hbase.coprocessor.TestDoubleColumnInterpreter
Java HotSpot(TM) 64-Bit Server VM warning: ignoring option MaxPermSize=256m; support was removed in 8.0
Running org.apache.hadoop.hbase.coprocessor.TestRegionObserverBypass
Tests run: 2, Failures: 0, Errors: 0, Skipped: 0, Time elapsed: 8.982 sec - in org.apache.hadoop.hbase.coprocessor.TestRegionObserverBypass
Java HotSpot(TM) 64-Bit Server VM warning: ignoring option MaxPermSize=256m; support was removed in 8.0
Running org.apache.hadoop.hbase.coprocessor.TestRowProcessorEndpoint
Running org.apache.hadoop.hbase.coprocessor.TestCoprocessorStop
Running org.apache.hadoop.hbase.coprocessor.TestRegionServerCoprocessorExceptionWithRemove
Tests run: 1, Failures: 0, Errors: 0, Skipped: 0, Time elapsed: 16.519 sec - in org.apache.hadoop.hbase.coprocessor.TestCoprocessorStop
Java HotSpot(TM) 64-Bit Server VM warning: ignoring option MaxPermSize=256m; support was removed in 8.0
Tests run: 4, Failures: 0, Errors: 0, Skipped: 0, Time elapsed: 19.716 sec - in org.apache.hadoop.hbase.coprocessor.TestRowProcessorEndpoint
Java HotSpot(TM) 64-Bit Server VM warning: ignoring option MaxPermSize=256m; support was removed in 8.0
Tests run: 1, Failures: 0, Errors: 0, Skipped: 0, Time elapsed: 16.089 sec - in org.apache.hadoop.hbase.coprocessor.TestRegionServerCoprocessorExceptionWithRemove
Java HotSpot(TM) 64-Bit Server VM warning: ignoring option MaxPermSize=256m; support was removed in 8.0
Running org.apache.hadoop.hbase.coprocessor.TestMasterObserver
Running org.apache.hadoop.hbase.coprocessor.TestBigDecimalColumnInterpreter
Running org.apache.hadoop.hbase.coprocessor.TestCoprocessorEndpoint
Tests run: 38, Failures: 0, Errors: 0, Skipped: 0, Time elapsed: 6.548 sec - in org.apache.hadoop.hbase.coprocessor.TestBigDecimalColumnInterpreter
Java HotSpot(TM) 64-Bit Server VM warning: ignoring option MaxPermSize=256m; support was removed in 8.0
Tests run: 6, Failures: 0, Errors: 0, Skipped: 0, Time elapsed: 3.08 sec - in org.apache.hadoop.hbase.coprocessor.TestCoprocessorEndpoint
Java HotSpot(TM) 64-Bit Server VM warning: ignoring option MaxPermSize=256m; support was removed in 8.0
Running org.apache.hadoop.hbase.TestGlobalMemStoreSize
Tests run: 9, Failures: 0, Errors: 0, Skipped: 0, Time elapsed: 386.189 sec - in org.apache.hadoop.hbase.snapshot.TestExportSnapshot
Java HotSpot(TM) 64-Bit Server VM warning: ignoring option MaxPermSize=256m; support was removed in 8.0
Running org.apache.hadoop.hbase.coprocessor.TestWALObserver
Tests run: 6, Failures: 0, Errors: 0, Skipped: 0, Time elapsed: 8.805 sec - in org.apache.hadoop.hbase.coprocessor.TestWALObserver
Java HotSpot(TM) 64-Bit Server VM warning: ignoring option MaxPermSize=256m; support was removed in 8.0
Tests run: 1, Failures: 0, Errors: 0, Skipped: 0, Time elapsed: 21.945 sec - in org.apache.hadoop.hbase.TestGlobalMemStoreSize
Running org.apache.hadoop.hbase.TestJMXListener
Java HotSpot(TM) 64-Bit Server VM warning: ignoring option MaxPermSize=256m; support was removed in 8.0
Java HotSpot(TM) 64-Bit Server VM warning: ignoring option MaxPermSize=256m; support was removed in 8.0
Java HotSpot(TM) 64-Bit Server VM warning: ignoring option MaxPermSize=256m; support was removed in 8.0
Java HotSpot(TM) 64-Bit Server VM warning: ignoring option MaxPermSize=256m; support was removed in 8.0
Running org.apache.hadoop.hbase.TestMetaTableLocator
Tests run: 7, Failures: 0, Errors: 0, Skipped: 0, Time elapsed: 3.547 sec - in org.apache.hadoop.hbase.TestMetaTableLocator
Java HotSpot(TM) 64-Bit Server VM warning: ignoring option MaxPermSize=256m; support was removed in 8.0
Running org.apache.hadoop.hbase.TestStochasticBalancerJmxMetrics
Tests run: 2, Failures: 0, Errors: 0, Skipped: 0, Time elapsed: 1.778 sec - in org.apache.hadoop.hbase.TestStochasticBalancerJmxMetrics
Java HotSpot(TM) 64-Bit Server VM warning: ignoring option MaxPermSize=256m; support was removed in 8.0
Tests run: 9, Failures: 0, Errors: 0, Skipped: 0, Time elapsed: 46.885 sec - in org.apache.hadoop.hbase.coprocessor.TestMasterObserver
Java HotSpot(TM) 64-Bit Server VM warning: ignoring option MaxPermSize=256m; support was removed in 8.0
Running org.apache.hadoop.hbase.zookeeper.TestZKTableStateManager
Tests run: 9, Failures: 0, Errors: 0, Skipped: 0, Time elapsed: 386.14 sec - in org.apache.hadoop.hbase.snapshot.TestSecureExportSnapshot
Java HotSpot(TM) 64-Bit Server VM warning: ignoring option MaxPermSize=256m; support was removed in 8.0
Tests run: 1, Failures: 0, Errors: 0, Skipped: 0, Time elapsed: 1.13 sec - in org.apache.hadoop.hbase.zookeeper.TestZKTableStateManager
Java HotSpot(TM) 64-Bit Server VM warning: ignoring option MaxPermSize=256m; support was removed in 8.0
Running org.apache.hadoop.hbase.zookeeper.TestZKMulti
Running org.apache.hadoop.hbase.zookeeper.lock.TestZKInterProcessReadWriteLock
Tests run: 2, Failures: 0, Errors: 0, Skipped: 0, Time elapsed: 16.576 sec - in org.apache.hadoop.hbase.TestJMXListener
Java HotSpot(TM) 64-Bit Server VM warning: ignoring option MaxPermSize=256m; support was removed in 8.0
Running org.apache.hadoop.hbase.zookeeper.TestZKLeaderManager
Tests run: 12, Failures: 0, Errors: 0, Skipped: 0, Time elapsed: 1.594 sec - in org.apache.hadoop.hbase.zookeeper.TestZKMulti
Tests run: 1, Failures: 0, Errors: 0, Skipped: 0, Time elapsed: 0.176 sec - in org.apache.hadoop.hbase.zookeeper.TestZKLeaderManager
Java HotSpot(TM) 64-Bit Server VM warning: ignoring option MaxPermSize=256m; support was removed in 8.0
Java HotSpot(TM) 64-Bit Server VM warning: ignoring option MaxPermSize=256m; support was removed in 8.0
Java HotSpot(TM) 64-Bit Server VM warning: ignoring option MaxPermSize=256m; support was removed in 8.0
Running org.apache.hadoop.hbase.zookeeper.TestRecoverableZooKeeper
Running org.apache.hadoop.hbase.zookeeper.TestHQuorumPeer
Running org.apache.hadoop.hbase.zookeeper.TestZooKeeperNodeTracker
Tests run: 3, Failures: 0, Errors: 0, Skipped: 0, Time elapsed: 0.899 sec - in org.apache.hadoop.hbase.zookeeper.TestZooKeeperNodeTracker
Java HotSpot(TM) 64-Bit Server VM warning: ignoring option MaxPermSize=256m; support was removed in 8.0
Tests run: 1, Failures: 0, Errors: 0, Skipped: 0, Time elapsed: 1.33 sec - in org.apache.hadoop.hbase.zookeeper.TestRecoverableZooKeeper
Tests run: 4, Failures: 0, Errors: 0, Skipped: 0, Time elapsed: 1.32 sec - in org.apache.hadoop.hbase.zookeeper.TestHQuorumPeer
Java HotSpot(TM) 64-Bit Server VM warning: ignoring option MaxPermSize=256m; support was removed in 8.0
Java HotSpot(TM) 64-Bit Server VM warning: ignoring option MaxPermSize=256m; support was removed in 8.0
Running org.apache.hadoop.hbase.TestClusterBootOrder
Running org.apache.hadoop.hbase.zookeeper.TestZooKeeperACL
Java HotSpot(TM) 64-Bit Server VM warning: ignoring option MaxPermSize=256m; support was removed in 8.0
Tests run: 7, Failures: 0, Errors: 0, Skipped: 0, Time elapsed: 0.59 sec - in org.apache.hadoop.hbase.zookeeper.TestZooKeeperACL
Running org.apache.hadoop.hbase.TestServerSideScanMetricsFromClientSide
Tests run: 2, Failures: 0, Errors: 0, Skipped: 0, Time elapsed: 2.323 sec - in org.apache.hadoop.hbase.TestServerSideScanMetricsFromClientSide
Tests run: 6, Failures: 0, Errors: 0, Skipped: 0, Time elapsed: 24.893 sec - in org.apache.hadoop.hbase.zookeeper.lock.TestZKInterProcessReadWriteLock
Tests run: 2, Failures: 0, Errors: 0, Skipped: 0, Time elapsed: 32.628 sec - in org.apache.hadoop.hbase.TestClusterBootOrder
Results :
Failed tests:
org.apache.hadoop.hbase.regionserver.TestRegionServerMetrics.testRangeCountMetrics(org.apache.hadoop.hbase.regionserver.TestRegionServerMetrics)
Run 1: TestRegionServerMetrics.testRangeCountMetrics:510 Should get counter mutatetimerangecount01 but did not
Run 2: TestRegionServerMetrics.testRangeCountMetrics:510 Should get counter mutatetimerangecount01 but did not
Run 3: TestRegionServerMetrics.testRangeCountMetrics:510 Should get counter mutatetimerangecount01 but did not
Flaked tests:
org.apache.hadoop.hbase.regionserver.TestFailedAppendAndSync.testLockupAroundBadAssignSync(org.apache.hadoop.hbase.regionserver.TestFailedAppendAndSync)
Run 1: TestFailedAppendAndSync.testLockupAroundBadAssignSync:239 » TestTimedOut test ...
Run 2: PASS
org.apache.hadoop.hbase.regionserver.TestHRegion.testBatchPut_whileNoRowLocksHeld(org.apache.hadoop.hbase.regionserver.TestHRegion)
Run 1: TestHRegion.testBatchPut_whileNoRowLocksHeld:1516 Metrics Counters should be equal expected:<3322> but was:<3321>
Run 2: PASS
Tests run: 2484, Failures: 1, Errors: 0, Skipped: 40, Flakes: 2
[INFO] ------------------------------------------------------------------------
[INFO] Reactor Summary:
[INFO]
[INFO] Apache HBase ...................................... SUCCESS [54.764s]
[INFO] Apache HBase - Checkstyle ......................... SUCCESS [6.415s]
[INFO] Apache HBase - Resource Bundle .................... SUCCESS [0.160s]
[INFO] Apache HBase - Annotations ........................ SUCCESS [1.251s]
[INFO] Apache HBase - Protocol ........................... SUCCESS [17.301s]
[INFO] Apache HBase - Common ............................. SUCCESS [2:05.090s]
[INFO] Apache HBase - Procedure .......................... SUCCESS [3:20.403s]
[INFO] Apache HBase - Client ............................. SUCCESS [1:21.834s]
[INFO] Apache HBase - Hadoop Compatibility ............... SUCCESS [8.455s]
[INFO] Apache HBase - Hadoop Two Compatibility ........... SUCCESS [9.374s]
[INFO] Apache HBase - Prefix Tree ........................ SUCCESS [9.097s]
[INFO] Apache HBase - Server ............................. FAILURE [1:31:00.058s]
[INFO] Apache HBase - Testing Util ....................... SKIPPED
[INFO] Apache HBase - Thrift ............................. SKIPPED
[INFO] Apache HBase - Rest ............................... SKIPPED
[INFO] Apache HBase - Shell .............................. SKIPPED
[INFO] Apache HBase - Integration Tests .................. SKIPPED
[INFO] Apache HBase - Examples ........................... SKIPPED
[INFO] Apache HBase - External Block Cache ............... SKIPPED
[INFO] Apache HBase - Assembly ........................... SKIPPED
[INFO] Apache HBase - Shaded ............................. SKIPPED
[INFO] Apache HBase - Shaded - Client .................... SKIPPED
[INFO] Apache HBase - Shaded - Server .................... SKIPPED
[INFO] ------------------------------------------------------------------------
[INFO] BUILD FAILURE
[INFO] ------------------------------------------------------------------------
[INFO] Total time: 1:39:49.783s
[INFO] Finished at: Thu Feb 25 20:57:12 UTC 2016
[INFO] Final Memory: 95M/791M
[INFO] ------------------------------------------------------------------------
[ERROR] Failed to execute goal org.apache.maven.plugins:maven-surefire-plugin:2.18.1:test (secondPartTestsExecution) on project hbase-server: There are test failures.
[ERROR]
[ERROR] Please refer to <https://builds.apache.org/job/HBase-1.3/jdk=latest1.8,label=yahoo-not-h2/ws/hbase-server/target/surefire-reports> for the individual test results.
[ERROR] -> [Help 1]
[ERROR]
[ERROR] To see the full stack trace of the errors, re-run Maven with the -e switch.
[ERROR] Re-run Maven using the -X switch to enable full debug logging.
[ERROR]
[ERROR] For more information about the errors and possible solutions, please read the following articles:
[ERROR] [Help 1] http://cwiki.apache.org/confluence/display/MAVEN/MojoFailureException
[ERROR]
[ERROR] After correcting the problems, you can resume the build with the command
[ERROR] mvn <goals> -rf :hbase-server
Build step 'Invoke top-level Maven targets' marked build as failure
Performing Post build task...
Match found for :.* : True
Logical operation result is TRUE
Running script : # Post-build task script. TODO: Check this in and have all builds reference check-in.
pwd && ls
# NOTE!!!! The below code has been copied and pasted from ./dev-tools/run-test.sh
# Do not change here without syncing there and vice-versa.
ZOMBIE_TESTS_COUNT=`jps -v | grep surefirebooter | grep -e '-Dhbase.test' | wc -l`
if [[ $ZOMBIE_TESTS_COUNT != 0 ]] ; then
echo "Suspicious java process found - waiting 30s to see if there are just slow to stop"
sleep 30
ZOMBIE_TESTS_COUNT=`jps -v | grep surefirebooter | grep -e '-Dhbase.test' | wc -l`
if [[ $ZOMBIE_TESTS_COUNT != 0 ]] ; then
echo " {color:red}There appear to be $ZOMBIE_TESTS_COUNT zombie tests{color}, they should have been killed by surefire but survived"
jps -v | grep surefirebooter | grep -e '-Dhbase.test'
jps -v | grep surefirebooter | grep -e '-Dhbase.test' | cut -d ' ' -f 1 | xargs -n 1 jstack
# Exit with error
exit 1
else
echo "We're ok: there is no zombie test, but some tests took some time to stop"
fi
else
echo "We're ok: there is no zombie test"
fi
[yahoo-not-h2] $ /bin/bash -xe /tmp/hudson5822898776848954250.sh
+ pwd
<https://builds.apache.org/job/HBase-1.3/jdk=latest1.8,label=yahoo-not-h2/ws/>
+ ls
bin
CHANGES.txt
conf
dev-support
hbase-annotations
hbase-assembly
hbase-checkstyle
hbase-client
hbase-common
hbase-examples
hbase-external-blockcache
hbase-hadoop2-compat
hbase-hadoop-compat
hbase-it
hbase-native-client
hbase-prefix-tree
hbase-procedure
hbase-protocol
hbase-resource-bundle
hbase-rest
hbase-server
hbase-shaded
hbase-shell
hbase-testing-util
hbase-thrift
LICENSE.txt
NOTICE.txt
pom.xml
README.txt
src
target
++ jps -v
++ grep surefirebooter
++ wc -l
++ grep -e -Dhbase.test
+ ZOMBIE_TESTS_COUNT=0
+ [[ 0 != 0 ]]
+ echo 'We'\''re ok: there is no zombie test'
We're ok: there is no zombie test
POST BUILD TASK : SUCCESS
END OF POST BUILD TASK : 0
Archiving artifacts
Recording test results
Build failed in Jenkins: HBase-1.3 » latest1.8,yahoo-not-h2 #571
Posted by Apache Jenkins Server <je...@builds.apache.org>.
See <https://builds.apache.org/job/HBase-1.3/jdk=latest1.8,label=yahoo-not-h2/571/changes>
Changes:
[antonov] HBASE-15136 Explore different queuing behaviors while busy
------------------------------------------
[...truncated 46118 lines...]
Java HotSpot(TM) 64-Bit Server VM warning: ignoring option MaxPermSize=256m; support was removed in 8.0
Java HotSpot(TM) 64-Bit Server VM warning: ignoring option MaxPermSize=256m; support was removed in 8.0
Java HotSpot(TM) 64-Bit Server VM warning: ignoring option MaxPermSize=256m; support was removed in 8.0
Java HotSpot(TM) 64-Bit Server VM warning: ignoring option MaxPermSize=256m; support was removed in 8.0
Java HotSpot(TM) 64-Bit Server VM warning: ignoring option MaxPermSize=256m; support was removed in 8.0
Running org.apache.hadoop.hbase.replication.TestReplicationWALEntryFilters
Tests run: 4, Failures: 0, Errors: 0, Skipped: 0, Time elapsed: 0.651 sec - in org.apache.hadoop.hbase.replication.TestReplicationWALEntryFilters
Java HotSpot(TM) 64-Bit Server VM warning: ignoring option MaxPermSize=256m; support was removed in 8.0
Java HotSpot(TM) 64-Bit Server VM warning: ignoring option MaxPermSize=256m; support was removed in 8.0
Java HotSpot(TM) 64-Bit Server VM warning: ignoring option MaxPermSize=256m; support was removed in 8.0
Running org.apache.hadoop.hbase.monitoring.TestMemoryBoundedLogMessageBuffer
Tests run: 2, Failures: 0, Errors: 0, Skipped: 0, Time elapsed: 0.398 sec - in org.apache.hadoop.hbase.monitoring.TestMemoryBoundedLogMessageBuffer
Java HotSpot(TM) 64-Bit Server VM warning: ignoring option MaxPermSize=256m; support was removed in 8.0
Running org.apache.hadoop.hbase.monitoring.TestTaskMonitor
Tests run: 3, Failures: 0, Errors: 0, Skipped: 0, Time elapsed: 0.663 sec - in org.apache.hadoop.hbase.monitoring.TestTaskMonitor
Java HotSpot(TM) 64-Bit Server VM warning: ignoring option MaxPermSize=256m; support was removed in 8.0
Java HotSpot(TM) 64-Bit Server VM warning: ignoring option MaxPermSize=256m; support was removed in 8.0
Running org.apache.hadoop.hbase.errorhandling.TestForeignExceptionSerialization
Tests run: 2, Failures: 0, Errors: 0, Skipped: 0, Time elapsed: 0.411 sec - in org.apache.hadoop.hbase.errorhandling.TestForeignExceptionSerialization
Java HotSpot(TM) 64-Bit Server VM warning: ignoring option MaxPermSize=256m; support was removed in 8.0
Running org.apache.hadoop.hbase.errorhandling.TestForeignExceptionDispatcher
Tests run: 3, Failures: 0, Errors: 0, Skipped: 0, Time elapsed: 0.49 sec - in org.apache.hadoop.hbase.errorhandling.TestForeignExceptionDispatcher
Java HotSpot(TM) 64-Bit Server VM warning: ignoring option MaxPermSize=256m; support was removed in 8.0
Running org.apache.hadoop.hbase.errorhandling.TestTimeoutExceptionInjector
Tests run: 4, Failures: 0, Errors: 0, Skipped: 0, Time elapsed: 0.563 sec - in org.apache.hadoop.hbase.errorhandling.TestTimeoutExceptionInjector
Java HotSpot(TM) 64-Bit Server VM warning: ignoring option MaxPermSize=256m; support was removed in 8.0
Running org.apache.hadoop.hbase.TestCompare
Tests run: 1, Failures: 0, Errors: 0, Skipped: 0, Time elapsed: 0.486 sec - in org.apache.hadoop.hbase.TestCompare
Java HotSpot(TM) 64-Bit Server VM warning: ignoring option MaxPermSize=256m; support was removed in 8.0
Java HotSpot(TM) 64-Bit Server VM warning: ignoring option MaxPermSize=256m; support was removed in 8.0
Java HotSpot(TM) 64-Bit Server VM warning: ignoring option MaxPermSize=256m; support was removed in 8.0
Running org.apache.hadoop.hbase.http.TestGlobalFilter
Tests run: 1, Failures: 0, Errors: 0, Skipped: 0, Time elapsed: 0.795 sec - in org.apache.hadoop.hbase.http.TestGlobalFilter
Java HotSpot(TM) 64-Bit Server VM warning: ignoring option MaxPermSize=256m; support was removed in 8.0
Running org.apache.hadoop.hbase.http.TestPathFilter
Tests run: 1, Failures: 0, Errors: 0, Skipped: 0, Time elapsed: 0.75 sec - in org.apache.hadoop.hbase.http.TestPathFilter
Java HotSpot(TM) 64-Bit Server VM warning: ignoring option MaxPermSize=256m; support was removed in 8.0
Running org.apache.hadoop.hbase.http.TestHttpRequestLogAppender
Tests run: 1, Failures: 0, Errors: 0, Skipped: 0, Time elapsed: 0.349 sec - in org.apache.hadoop.hbase.http.TestHttpRequestLogAppender
Java HotSpot(TM) 64-Bit Server VM warning: ignoring option MaxPermSize=256m; support was removed in 8.0
Running org.apache.hadoop.hbase.http.TestHtmlQuoting
Tests run: 4, Failures: 0, Errors: 0, Skipped: 0, Time elapsed: 0.608 sec - in org.apache.hadoop.hbase.http.TestHtmlQuoting
Java HotSpot(TM) 64-Bit Server VM warning: ignoring option MaxPermSize=256m; support was removed in 8.0
Running org.apache.hadoop.hbase.http.log.TestLogLevel
Tests run: 1, Failures: 0, Errors: 0, Skipped: 0, Time elapsed: 0.731 sec - in org.apache.hadoop.hbase.http.log.TestLogLevel
Java HotSpot(TM) 64-Bit Server VM warning: ignoring option MaxPermSize=256m; support was removed in 8.0
Running org.apache.hadoop.hbase.http.conf.TestConfServlet
Tests run: 3, Failures: 0, Errors: 0, Skipped: 0, Time elapsed: 0.593 sec - in org.apache.hadoop.hbase.http.conf.TestConfServlet
Java HotSpot(TM) 64-Bit Server VM warning: ignoring option MaxPermSize=256m; support was removed in 8.0
Running org.apache.hadoop.hbase.http.TestHttpRequestLog
Tests run: 2, Failures: 0, Errors: 0, Skipped: 0, Time elapsed: 0.379 sec - in org.apache.hadoop.hbase.http.TestHttpRequestLog
Java HotSpot(TM) 64-Bit Server VM warning: ignoring option MaxPermSize=256m; support was removed in 8.0
Running org.apache.hadoop.hbase.http.TestHttpServerWebapps
Tests run: 2, Failures: 0, Errors: 0, Skipped: 0, Time elapsed: 0.41 sec - in org.apache.hadoop.hbase.http.TestHttpServerWebapps
Java HotSpot(TM) 64-Bit Server VM warning: ignoring option MaxPermSize=256m; support was removed in 8.0
Running org.apache.hadoop.hbase.http.TestHttpServerLifecycle
Tests run: 6, Failures: 0, Errors: 0, Skipped: 6, Time elapsed: 0.001 sec - in org.apache.hadoop.hbase.http.TestHttpServerLifecycle
Java HotSpot(TM) 64-Bit Server VM warning: ignoring option MaxPermSize=256m; support was removed in 8.0
Running org.apache.hadoop.hbase.http.TestHttpServer
Tests run: 16, Failures: 0, Errors: 0, Skipped: 3, Time elapsed: 2.204 sec - in org.apache.hadoop.hbase.http.TestHttpServer
Java HotSpot(TM) 64-Bit Server VM warning: ignoring option MaxPermSize=256m; support was removed in 8.0
Running org.apache.hadoop.hbase.http.lib.TestStaticUserWebFilter
Tests run: 3, Failures: 0, Errors: 0, Skipped: 0, Time elapsed: 0.651 sec - in org.apache.hadoop.hbase.http.lib.TestStaticUserWebFilter
Java HotSpot(TM) 64-Bit Server VM warning: ignoring option MaxPermSize=256m; support was removed in 8.0
Running org.apache.hadoop.hbase.http.jmx.TestJMXJsonServlet
Tests run: 1, Failures: 0, Errors: 0, Skipped: 0, Time elapsed: 0.5 sec - in org.apache.hadoop.hbase.http.jmx.TestJMXJsonServlet
Java HotSpot(TM) 64-Bit Server VM warning: ignoring option MaxPermSize=256m; support was removed in 8.0
Running org.apache.hadoop.hbase.http.TestServletFilter
Tests run: 3, Failures: 0, Errors: 0, Skipped: 1, Time elapsed: 0.784 sec - in org.apache.hadoop.hbase.http.TestServletFilter
Java HotSpot(TM) 64-Bit Server VM warning: ignoring option MaxPermSize=256m; support was removed in 8.0
Running org.apache.hadoop.hbase.http.TestSSLHttpServer
Tests run: 1, Failures: 0, Errors: 0, Skipped: 0, Time elapsed: 0.28 sec - in org.apache.hadoop.hbase.http.TestSSLHttpServer
Java HotSpot(TM) 64-Bit Server VM warning: ignoring option MaxPermSize=256m; support was removed in 8.0
Java HotSpot(TM) 64-Bit Server VM warning: ignoring option MaxPermSize=256m; support was removed in 8.0
Java HotSpot(TM) 64-Bit Server VM warning: ignoring option MaxPermSize=256m; support was removed in 8.0
Running org.apache.hadoop.hbase.TestServerName
Tests run: 7, Failures: 0, Errors: 0, Skipped: 0, Time elapsed: 0.549 sec - in org.apache.hadoop.hbase.TestServerName
Java HotSpot(TM) 64-Bit Server VM warning: ignoring option MaxPermSize=256m; support was removed in 8.0
Java HotSpot(TM) 64-Bit Server VM warning: ignoring option MaxPermSize=256m; support was removed in 8.0
Running org.apache.hadoop.hbase.mapred.TestRowCounter
Tests run: 4, Failures: 0, Errors: 0, Skipped: 0, Time elapsed: 3.204 sec - in org.apache.hadoop.hbase.mapred.TestRowCounter
Java HotSpot(TM) 64-Bit Server VM warning: ignoring option MaxPermSize=256m; support was removed in 8.0
Java HotSpot(TM) 64-Bit Server VM warning: ignoring option MaxPermSize=256m; support was removed in 8.0
Running org.apache.hadoop.hbase.mapred.TestDriver
Tests run: 1, Failures: 0, Errors: 0, Skipped: 0, Time elapsed: 0.508 sec - in org.apache.hadoop.hbase.mapred.TestDriver
Java HotSpot(TM) 64-Bit Server VM warning: ignoring option MaxPermSize=256m; support was removed in 8.0
Running org.apache.hadoop.hbase.mapred.TestSplitTable
Tests run: 3, Failures: 0, Errors: 0, Skipped: 0, Time elapsed: 0.433 sec - in org.apache.hadoop.hbase.mapred.TestSplitTable
Java HotSpot(TM) 64-Bit Server VM warning: ignoring option MaxPermSize=256m; support was removed in 8.0
Java HotSpot(TM) 64-Bit Server VM warning: ignoring option MaxPermSize=256m; support was removed in 8.0
Java HotSpot(TM) 64-Bit Server VM warning: ignoring option MaxPermSize=256m; support was removed in 8.0
Running org.apache.hadoop.hbase.mapred.TestIdentityTableMap
Tests run: 1, Failures: 0, Errors: 0, Skipped: 0, Time elapsed: 0.6 sec - in org.apache.hadoop.hbase.mapred.TestIdentityTableMap
Java HotSpot(TM) 64-Bit Server VM warning: ignoring option MaxPermSize=256m; support was removed in 8.0
Running org.apache.hadoop.hbase.mapred.TestGroupingTableMap
Tests run: 4, Failures: 0, Errors: 0, Skipped: 0, Time elapsed: 0.82 sec - in org.apache.hadoop.hbase.mapred.TestGroupingTableMap
Java HotSpot(TM) 64-Bit Server VM warning: ignoring option MaxPermSize=256m; support was removed in 8.0
Java HotSpot(TM) 64-Bit Server VM warning: ignoring option MaxPermSize=256m; support was removed in 8.0
Java HotSpot(TM) 64-Bit Server VM warning: ignoring option MaxPermSize=256m; support was removed in 8.0
Results :
Tests in error:
org.apache.hadoop.hbase.ipc.TestRpcMetrics.testSourceMethods(org.apache.hadoop.hbase.ipc.TestRpcMetrics)
Run 1: TestRpcMetrics.testSourceMethods:89 » NullPointer
Run 2: TestRpcMetrics.testSourceMethods:89 » NullPointer
Run 3: TestRpcMetrics.testSourceMethods:89 » NullPointer
org.apache.hadoop.hbase.ipc.TestRpcMetrics.testWrapperSource(org.apache.hadoop.hbase.ipc.TestRpcMetrics)
Run 1: TestRpcMetrics.testWrapperSource:67 » NullPointer
Run 2: TestRpcMetrics.testWrapperSource:67 » NullPointer
Run 3: TestRpcMetrics.testWrapperSource:67 » NullPointer
org.apache.hadoop.hbase.regionserver.TestMetricsRegion.testRegionWrapperMetrics(org.apache.hadoop.hbase.regionserver.TestMetricsRegion)
Run 1: TestMetricsRegion.testRegionWrapperMetrics:38 » NullPointer
Run 2: TestMetricsRegion.testRegionWrapperMetrics:38 » NullPointer
Run 3: TestMetricsRegion.testRegionWrapperMetrics:38 » NullPointer
org.apache.hadoop.hbase.regionserver.TestMetricsRegionServer.testSlowCount(org.apache.hadoop.hbase.regionserver.TestMetricsRegionServer)
Run 1: TestMetricsRegionServer.testSlowCount:126 » NullPointer
Run 2: TestMetricsRegionServer.testSlowCount:126 » NullPointer
Run 3: TestMetricsRegionServer.testSlowCount:126 » NullPointer
org.apache.hadoop.hbase.regionserver.TestMetricsRegionServer.testWrapperSource(org.apache.hadoop.hbase.regionserver.TestMetricsRegionServer)
Run 1: TestMetricsRegionServer.testWrapperSource:56 » NullPointer
Run 2: TestMetricsRegionServer.testWrapperSource:56 » NullPointer
Run 3: TestMetricsRegionServer.testWrapperSource:56 » NullPointer
Tests run: 1004, Failures: 0, Errors: 5, Skipped: 20
[INFO] ------------------------------------------------------------------------
[INFO] Reactor Summary:
[INFO]
[INFO] Apache HBase ...................................... SUCCESS [1:30.661s]
[INFO] Apache HBase - Checkstyle ......................... SUCCESS [6.322s]
[INFO] Apache HBase - Resource Bundle .................... SUCCESS [0.137s]
[INFO] Apache HBase - Annotations ........................ SUCCESS [0.963s]
[INFO] Apache HBase - Protocol ........................... SUCCESS [16.106s]
[INFO] Apache HBase - Common ............................. SUCCESS [2:04.117s]
[INFO] Apache HBase - Procedure .......................... SUCCESS [3:23.744s]
[INFO] Apache HBase - Client ............................. SUCCESS [1:17.702s]
[INFO] Apache HBase - Hadoop Compatibility ............... SUCCESS [7.997s]
[INFO] Apache HBase - Hadoop Two Compatibility ........... SUCCESS [13.853s]
[INFO] Apache HBase - Prefix Tree ........................ SUCCESS [7.541s]
[INFO] Apache HBase - Server ............................. FAILURE [14:07.508s]
[INFO] Apache HBase - Testing Util ....................... SKIPPED
[INFO] Apache HBase - Thrift ............................. SKIPPED
[INFO] Apache HBase - Rest ............................... SKIPPED
[INFO] Apache HBase - Shell .............................. SKIPPED
[INFO] Apache HBase - Integration Tests .................. SKIPPED
[INFO] Apache HBase - Examples ........................... SKIPPED
[INFO] Apache HBase - External Block Cache ............... SKIPPED
[INFO] Apache HBase - Assembly ........................... SKIPPED
[INFO] Apache HBase - Shaded ............................. SKIPPED
[INFO] Apache HBase - Shaded - Client .................... SKIPPED
[INFO] Apache HBase - Shaded - Server .................... SKIPPED
[INFO] ------------------------------------------------------------------------
[INFO] BUILD FAILURE
[INFO] ------------------------------------------------------------------------
[INFO] Total time: 23:45.423s
[INFO] Finished at: Thu Feb 25 08:48:13 UTC 2016
[INFO] Final Memory: 95M/815M
[INFO] ------------------------------------------------------------------------
[ERROR] Failed to execute goal org.apache.maven.plugins:maven-surefire-plugin:2.18.1:test (default-test) on project hbase-server: There are test failures.
[ERROR]
[ERROR] Please refer to <https://builds.apache.org/job/HBase-1.3/jdk=latest1.8,label=yahoo-not-h2/ws/hbase-server/target/surefire-reports> for the individual test results.
[ERROR] -> [Help 1]
[ERROR]
[ERROR] To see the full stack trace of the errors, re-run Maven with the -e switch.
[ERROR] Re-run Maven using the -X switch to enable full debug logging.
[ERROR]
[ERROR] For more information about the errors and possible solutions, please read the following articles:
[ERROR] [Help 1] http://cwiki.apache.org/confluence/display/MAVEN/MojoFailureException
[ERROR]
[ERROR] After correcting the problems, you can resume the build with the command
[ERROR] mvn <goals> -rf :hbase-server
Build step 'Invoke top-level Maven targets' marked build as failure
Performing Post build task...
Match found for :.* : True
Logical operation result is TRUE
Running script : # Post-build task script. TODO: Check this in and have all builds reference check-in.
pwd && ls
# NOTE!!!! The below code has been copied and pasted from ./dev-tools/run-test.sh
# Do not change here without syncing there and vice-versa.
ZOMBIE_TESTS_COUNT=`jps -v | grep surefirebooter | grep -e '-Dhbase.test' | wc -l`
if [[ $ZOMBIE_TESTS_COUNT != 0 ]] ; then
echo "Suspicious java process found - waiting 30s to see if there are just slow to stop"
sleep 30
ZOMBIE_TESTS_COUNT=`jps -v | grep surefirebooter | grep -e '-Dhbase.test' | wc -l`
if [[ $ZOMBIE_TESTS_COUNT != 0 ]] ; then
echo " {color:red}There appear to be $ZOMBIE_TESTS_COUNT zombie tests{color}, they should have been killed by surefire but survived"
jps -v | grep surefirebooter | grep -e '-Dhbase.test'
jps -v | grep surefirebooter | grep -e '-Dhbase.test' | cut -d ' ' -f 1 | xargs -n 1 jstack
# Exit with error
exit 1
else
echo "We're ok: there is no zombie test, but some tests took some time to stop"
fi
else
echo "We're ok: there is no zombie test"
fi
[yahoo-not-h2] $ /bin/bash -xe /tmp/hudson6698977420906971712.sh
+ pwd
<https://builds.apache.org/job/HBase-1.3/jdk=latest1.8,label=yahoo-not-h2/ws/>
+ ls
bin
CHANGES.txt
conf
dev-support
hbase-annotations
hbase-assembly
hbase-checkstyle
hbase-client
hbase-common
hbase-examples
hbase-external-blockcache
hbase-hadoop2-compat
hbase-hadoop-compat
hbase-it
hbase-native-client
hbase-prefix-tree
hbase-procedure
hbase-protocol
hbase-resource-bundle
hbase-rest
hbase-server
hbase-shaded
hbase-shell
hbase-testing-util
hbase-thrift
LICENSE.txt
NOTICE.txt
pom.xml
README.txt
src
target
++ jps -v
++ grep surefirebooter
++ wc -l
++ grep -e -Dhbase.test
+ ZOMBIE_TESTS_COUNT=0
+ [[ 0 != 0 ]]
+ echo 'We'\''re ok: there is no zombie test'
We're ok: there is no zombie test
POST BUILD TASK : SUCCESS
END OF POST BUILD TASK : 0
Archiving artifacts
Recording test results
Build failed in Jenkins: HBase-1.3 » latest1.8,yahoo-not-h2 #570
Posted by Apache Jenkins Server <je...@builds.apache.org>.
See <https://builds.apache.org/job/HBase-1.3/jdk=latest1.8,label=yahoo-not-h2/570/changes>
Changes:
[eclark] HBASE-15319 clearJmxCache does not take effect actually
------------------------------------------
[...truncated 46674 lines...]
Java HotSpot(TM) 64-Bit Server VM warning: ignoring option MaxPermSize=256m; support was removed in 8.0
Java HotSpot(TM) 64-Bit Server VM warning: ignoring option MaxPermSize=256m; support was removed in 8.0
Java HotSpot(TM) 64-Bit Server VM warning: ignoring option MaxPermSize=256m; support was removed in 8.0
Java HotSpot(TM) 64-Bit Server VM warning: ignoring option MaxPermSize=256m; support was removed in 8.0
Java HotSpot(TM) 64-Bit Server VM warning: ignoring option MaxPermSize=256m; support was removed in 8.0
Java HotSpot(TM) 64-Bit Server VM warning: ignoring option MaxPermSize=256m; support was removed in 8.0
Java HotSpot(TM) 64-Bit Server VM warning: ignoring option MaxPermSize=256m; support was removed in 8.0
Java HotSpot(TM) 64-Bit Server VM warning: ignoring option MaxPermSize=256m; support was removed in 8.0
Java HotSpot(TM) 64-Bit Server VM warning: ignoring option MaxPermSize=256m; support was removed in 8.0
Java HotSpot(TM) 64-Bit Server VM warning: ignoring option MaxPermSize=256m; support was removed in 8.0
Java HotSpot(TM) 64-Bit Server VM warning: ignoring option MaxPermSize=256m; support was removed in 8.0
Java HotSpot(TM) 64-Bit Server VM warning: ignoring option MaxPermSize=256m; support was removed in 8.0
Java HotSpot(TM) 64-Bit Server VM warning: ignoring option MaxPermSize=256m; support was removed in 8.0
Java HotSpot(TM) 64-Bit Server VM warning: ignoring option MaxPermSize=256m; support was removed in 8.0
Java HotSpot(TM) 64-Bit Server VM warning: ignoring option MaxPermSize=256m; support was removed in 8.0
Java HotSpot(TM) 64-Bit Server VM warning: ignoring option MaxPermSize=256m; support was removed in 8.0
Java HotSpot(TM) 64-Bit Server VM warning: ignoring option MaxPermSize=256m; support was removed in 8.0
Java HotSpot(TM) 64-Bit Server VM warning: ignoring option MaxPermSize=256m; support was removed in 8.0
Java HotSpot(TM) 64-Bit Server VM warning: ignoring option MaxPermSize=256m; support was removed in 8.0
Java HotSpot(TM) 64-Bit Server VM warning: ignoring option MaxPermSize=256m; support was removed in 8.0
Java HotSpot(TM) 64-Bit Server VM warning: ignoring option MaxPermSize=256m; support was removed in 8.0
Java HotSpot(TM) 64-Bit Server VM warning: ignoring option MaxPermSize=256m; support was removed in 8.0
Java HotSpot(TM) 64-Bit Server VM warning: ignoring option MaxPermSize=256m; support was removed in 8.0
Java HotSpot(TM) 64-Bit Server VM warning: ignoring option MaxPermSize=256m; support was removed in 8.0
Java HotSpot(TM) 64-Bit Server VM warning: ignoring option MaxPermSize=256m; support was removed in 8.0
Running org.apache.hadoop.hbase.master.TestClockSkewDetection
Tests run: 1, Failures: 0, Errors: 0, Skipped: 0, Time elapsed: 1.646 sec - in org.apache.hadoop.hbase.master.TestClockSkewDetection
Java HotSpot(TM) 64-Bit Server VM warning: ignoring option MaxPermSize=256m; support was removed in 8.0
Running org.apache.hadoop.hbase.master.TestHMasterCommandLine
Tests run: 1, Failures: 0, Errors: 0, Skipped: 0, Time elapsed: 1.705 sec - in org.apache.hadoop.hbase.master.TestHMasterCommandLine
Java HotSpot(TM) 64-Bit Server VM warning: ignoring option MaxPermSize=256m; support was removed in 8.0
Java HotSpot(TM) 64-Bit Server VM warning: ignoring option MaxPermSize=256m; support was removed in 8.0
Java HotSpot(TM) 64-Bit Server VM warning: ignoring option MaxPermSize=256m; support was removed in 8.0
Running org.apache.hadoop.hbase.master.balancer.TestRegionLocationFinder
Tests run: 3, Failures: 0, Errors: 0, Skipped: 0, Time elapsed: 11.22 sec - in org.apache.hadoop.hbase.master.balancer.TestRegionLocationFinder
Java HotSpot(TM) 64-Bit Server VM warning: ignoring option MaxPermSize=256m; support was removed in 8.0
Running org.apache.hadoop.hbase.master.balancer.TestServerAndLoad
Tests run: 1, Failures: 0, Errors: 0, Skipped: 0, Time elapsed: 1.616 sec - in org.apache.hadoop.hbase.master.balancer.TestServerAndLoad
Java HotSpot(TM) 64-Bit Server VM warning: ignoring option MaxPermSize=256m; support was removed in 8.0
Java HotSpot(TM) 64-Bit Server VM warning: ignoring option MaxPermSize=256m; support was removed in 8.0
Java HotSpot(TM) 64-Bit Server VM warning: ignoring option MaxPermSize=256m; support was removed in 8.0
Running org.apache.hadoop.hbase.master.balancer.TestFavoredNodeAssignmentHelper
Tests run: 8, Failures: 0, Errors: 0, Skipped: 8, Time elapsed: 0.003 sec - in org.apache.hadoop.hbase.master.balancer.TestFavoredNodeAssignmentHelper
Java HotSpot(TM) 64-Bit Server VM warning: ignoring option MaxPermSize=256m; support was removed in 8.0
Java HotSpot(TM) 64-Bit Server VM warning: ignoring option MaxPermSize=256m; support was removed in 8.0
Java HotSpot(TM) 64-Bit Server VM warning: ignoring option MaxPermSize=256m; support was removed in 8.0
Java HotSpot(TM) 64-Bit Server VM warning: ignoring option MaxPermSize=256m; support was removed in 8.0
Running org.apache.hadoop.hbase.master.TestRegionStates
Tests run: 1, Failures: 0, Errors: 0, Skipped: 0, Time elapsed: 2.188 sec - in org.apache.hadoop.hbase.master.TestRegionStates
Java HotSpot(TM) 64-Bit Server VM warning: ignoring option MaxPermSize=256m; support was removed in 8.0
Java HotSpot(TM) 64-Bit Server VM warning: ignoring option MaxPermSize=256m; support was removed in 8.0
Java HotSpot(TM) 64-Bit Server VM warning: ignoring option MaxPermSize=256m; support was removed in 8.0
Java HotSpot(TM) 64-Bit Server VM warning: ignoring option MaxPermSize=256m; support was removed in 8.0
Java HotSpot(TM) 64-Bit Server VM warning: ignoring option MaxPermSize=256m; support was removed in 8.0
Running org.apache.hadoop.hbase.master.TestCatalogJanitor
Tests run: 7, Failures: 0, Errors: 0, Skipped: 0, Time elapsed: 24.72 sec - in org.apache.hadoop.hbase.master.TestCatalogJanitor
Java HotSpot(TM) 64-Bit Server VM warning: ignoring option MaxPermSize=256m; support was removed in 8.0
Java HotSpot(TM) 64-Bit Server VM warning: ignoring option MaxPermSize=256m; support was removed in 8.0
Running org.apache.hadoop.hbase.master.TestRegionPlan
Tests run: 1, Failures: 0, Errors: 0, Skipped: 0, Time elapsed: 1.916 sec - in org.apache.hadoop.hbase.master.TestRegionPlan
Java HotSpot(TM) 64-Bit Server VM warning: ignoring option MaxPermSize=256m; support was removed in 8.0
Running org.apache.hadoop.hbase.master.TestRegionState
Tests run: 1, Failures: 0, Errors: 0, Skipped: 0, Time elapsed: 4.063 sec - in org.apache.hadoop.hbase.master.TestRegionState
Java HotSpot(TM) 64-Bit Server VM warning: ignoring option MaxPermSize=256m; support was removed in 8.0
Java HotSpot(TM) 64-Bit Server VM warning: ignoring option MaxPermSize=256m; support was removed in 8.0
Java HotSpot(TM) 64-Bit Server VM warning: ignoring option MaxPermSize=256m; support was removed in 8.0
Running org.apache.hadoop.hbase.master.snapshot.TestSnapshotManager
Tests run: 2, Failures: 0, Errors: 0, Skipped: 0, Time elapsed: 2.098 sec - in org.apache.hadoop.hbase.master.snapshot.TestSnapshotManager
Java HotSpot(TM) 64-Bit Server VM warning: ignoring option MaxPermSize=256m; support was removed in 8.0
Running org.apache.hadoop.hbase.master.snapshot.TestSnapshotHFileCleaner
Tests run: 1, Failures: 0, Errors: 0, Skipped: 0, Time elapsed: 2.366 sec - in org.apache.hadoop.hbase.master.snapshot.TestSnapshotHFileCleaner
Java HotSpot(TM) 64-Bit Server VM warning: ignoring option MaxPermSize=256m; support was removed in 8.0
Java HotSpot(TM) 64-Bit Server VM warning: ignoring option MaxPermSize=256m; support was removed in 8.0
Java HotSpot(TM) 64-Bit Server VM warning: ignoring option MaxPermSize=256m; support was removed in 8.0
Java HotSpot(TM) 64-Bit Server VM warning: ignoring option MaxPermSize=256m; support was removed in 8.0
Java HotSpot(TM) 64-Bit Server VM warning: ignoring option MaxPermSize=256m; support was removed in 8.0
Java HotSpot(TM) 64-Bit Server VM warning: ignoring option MaxPermSize=256m; support was removed in 8.0
Java HotSpot(TM) 64-Bit Server VM warning: ignoring option MaxPermSize=256m; support was removed in 8.0
Java HotSpot(TM) 64-Bit Server VM warning: ignoring option MaxPermSize=256m; support was removed in 8.0
Java HotSpot(TM) 64-Bit Server VM warning: ignoring option MaxPermSize=256m; support was removed in 8.0
Java HotSpot(TM) 64-Bit Server VM warning: ignoring option MaxPermSize=256m; support was removed in 8.0
Java HotSpot(TM) 64-Bit Server VM warning: ignoring option MaxPermSize=256m; support was removed in 8.0
Java HotSpot(TM) 64-Bit Server VM warning: ignoring option MaxPermSize=256m; support was removed in 8.0
Running org.apache.hadoop.hbase.master.TestMasterQosFunction
Tests run: 2, Failures: 0, Errors: 0, Skipped: 0, Time elapsed: 5.867 sec - in org.apache.hadoop.hbase.master.TestMasterQosFunction
Java HotSpot(TM) 64-Bit Server VM warning: ignoring option MaxPermSize=256m; support was removed in 8.0
Running org.apache.hadoop.hbase.TestTagRewriteCell
Tests run: 1, Failures: 0, Errors: 0, Skipped: 0, Time elapsed: 2.954 sec - in org.apache.hadoop.hbase.TestTagRewriteCell
Results :
Failed tests:
org.apache.hadoop.hbase.ipc.TestSimpleRpcScheduler.testSoftAndHardQueueLimits(org.apache.hadoop.hbase.ipc.TestSimpleRpcScheduler)
Run 1: TestSimpleRpcScheduler.testSoftAndHardQueueLimits:354 null
Run 2: TestSimpleRpcScheduler.testSoftAndHardQueueLimits:354 null
Run 3: TestSimpleRpcScheduler.testSoftAndHardQueueLimits:354 null
Tests in error:
org.apache.hadoop.hbase.ipc.TestRpcMetrics.testSourceMethods(org.apache.hadoop.hbase.ipc.TestRpcMetrics)
Run 1: TestRpcMetrics.testSourceMethods:89 » NullPointer
Run 2: TestRpcMetrics.testSourceMethods:89 » NullPointer
Run 3: TestRpcMetrics.testSourceMethods:89 » NullPointer
org.apache.hadoop.hbase.ipc.TestRpcMetrics.testWrapperSource(org.apache.hadoop.hbase.ipc.TestRpcMetrics)
Run 1: TestRpcMetrics.testWrapperSource:67 » NullPointer
Run 2: TestRpcMetrics.testWrapperSource:67 » NullPointer
Run 3: TestRpcMetrics.testWrapperSource:67 » NullPointer
org.apache.hadoop.hbase.regionserver.TestMetricsRegion.testRegionWrapperMetrics(org.apache.hadoop.hbase.regionserver.TestMetricsRegion)
Run 1: TestMetricsRegion.testRegionWrapperMetrics:38 » NullPointer
Run 2: TestMetricsRegion.testRegionWrapperMetrics:38 » NullPointer
Run 3: TestMetricsRegion.testRegionWrapperMetrics:38 » NullPointer
org.apache.hadoop.hbase.regionserver.TestMetricsRegionServer.testSlowCount(org.apache.hadoop.hbase.regionserver.TestMetricsRegionServer)
Run 1: TestMetricsRegionServer.testSlowCount:126 » NullPointer
Run 2: TestMetricsRegionServer.testSlowCount:126 » NullPointer
Run 3: TestMetricsRegionServer.testSlowCount:126 » NullPointer
org.apache.hadoop.hbase.regionserver.TestMetricsRegionServer.testWrapperSource(org.apache.hadoop.hbase.regionserver.TestMetricsRegionServer)
Run 1: TestMetricsRegionServer.testWrapperSource:56 » NullPointer
Run 2: TestMetricsRegionServer.testWrapperSource:56 » NullPointer
Run 3: TestMetricsRegionServer.testWrapperSource:56 » NullPointer
Flaked tests:
org.apache.hadoop.hbase.ipc.TestAsyncIPC.testRTEDuringAsyncConnectionSetup[0](org.apache.hadoop.hbase.ipc.TestAsyncIPC)
Run 1: TestAsyncIPC.testRTEDuringAsyncConnectionSetup:229 Waiting timed out after [1,000] msec
Run 2: PASS
Tests run: 1003, Failures: 1, Errors: 5, Skipped: 20, Flakes: 1
[INFO] ------------------------------------------------------------------------
[INFO] Reactor Summary:
[INFO]
[INFO] Apache HBase ...................................... SUCCESS [1:21.213s]
[INFO] Apache HBase - Checkstyle ......................... SUCCESS [8.079s]
[INFO] Apache HBase - Resource Bundle .................... SUCCESS [0.961s]
[INFO] Apache HBase - Annotations ........................ SUCCESS [5.059s]
[INFO] Apache HBase - Protocol ........................... SUCCESS [50.667s]
[INFO] Apache HBase - Common ............................. SUCCESS [5:56.459s]
[INFO] Apache HBase - Procedure .......................... SUCCESS [6:44.296s]
[INFO] Apache HBase - Client ............................. SUCCESS [3:21.918s]
[INFO] Apache HBase - Hadoop Compatibility ............... SUCCESS [19.537s]
[INFO] Apache HBase - Hadoop Two Compatibility ........... SUCCESS [38.093s]
[INFO] Apache HBase - Prefix Tree ........................ SUCCESS [40.163s]
[INFO] Apache HBase - Server ............................. FAILURE [55:34.990s]
[INFO] Apache HBase - Testing Util ....................... SKIPPED
[INFO] Apache HBase - Thrift ............................. SKIPPED
[INFO] Apache HBase - Rest ............................... SKIPPED
[INFO] Apache HBase - Shell .............................. SKIPPED
[INFO] Apache HBase - Integration Tests .................. SKIPPED
[INFO] Apache HBase - Examples ........................... SKIPPED
[INFO] Apache HBase - External Block Cache ............... SKIPPED
[INFO] Apache HBase - Assembly ........................... SKIPPED
[INFO] Apache HBase - Shaded ............................. SKIPPED
[INFO] Apache HBase - Shaded - Client .................... SKIPPED
[INFO] Apache HBase - Shaded - Server .................... SKIPPED
[INFO] ------------------------------------------------------------------------
[INFO] BUILD FAILURE
[INFO] ------------------------------------------------------------------------
[INFO] Total time: 1:16:11.823s
[INFO] Finished at: Thu Feb 25 06:10:20 UTC 2016
[INFO] Final Memory: 95M/3186M
[INFO] ------------------------------------------------------------------------
[ERROR] Failed to execute goal org.apache.maven.plugins:maven-surefire-plugin:2.18.1:test (default-test) on project hbase-server: There are test failures.
[ERROR]
[ERROR] Please refer to <https://builds.apache.org/job/HBase-1.3/jdk=latest1.8,label=yahoo-not-h2/ws/hbase-server/target/surefire-reports> for the individual test results.
[ERROR] -> [Help 1]
[ERROR]
[ERROR] To see the full stack trace of the errors, re-run Maven with the -e switch.
[ERROR] Re-run Maven using the -X switch to enable full debug logging.
[ERROR]
[ERROR] For more information about the errors and possible solutions, please read the following articles:
[ERROR] [Help 1] http://cwiki.apache.org/confluence/display/MAVEN/MojoFailureException
[ERROR]
[ERROR] After correcting the problems, you can resume the build with the command
[ERROR] mvn <goals> -rf :hbase-server
Build step 'Invoke top-level Maven targets' marked build as failure
Performing Post build task...
Match found for :.* : True
Logical operation result is TRUE
Running script : # Post-build task script. TODO: Check this in and have all builds reference check-in.
pwd && ls
# NOTE!!!! The below code has been copied and pasted from ./dev-tools/run-test.sh
# Do not change here without syncing there and vice-versa.
ZOMBIE_TESTS_COUNT=`jps -v | grep surefirebooter | grep -e '-Dhbase.test' | wc -l`
if [[ $ZOMBIE_TESTS_COUNT != 0 ]] ; then
echo "Suspicious java process found - waiting 30s to see if there are just slow to stop"
sleep 30
ZOMBIE_TESTS_COUNT=`jps -v | grep surefirebooter | grep -e '-Dhbase.test' | wc -l`
if [[ $ZOMBIE_TESTS_COUNT != 0 ]] ; then
echo " {color:red}There appear to be $ZOMBIE_TESTS_COUNT zombie tests{color}, they should have been killed by surefire but survived"
jps -v | grep surefirebooter | grep -e '-Dhbase.test'
jps -v | grep surefirebooter | grep -e '-Dhbase.test' | cut -d ' ' -f 1 | xargs -n 1 jstack
# Exit with error
exit 1
else
echo "We're ok: there is no zombie test, but some tests took some time to stop"
fi
else
echo "We're ok: there is no zombie test"
fi
[yahoo-not-h2] $ /bin/bash -xe /tmp/hudson6600697751550042208.sh
+ pwd
<https://builds.apache.org/job/HBase-1.3/jdk=latest1.8,label=yahoo-not-h2/ws/>
+ ls
bin
CHANGES.txt
conf
dev-support
hbase-annotations
hbase-assembly
hbase-checkstyle
hbase-client
hbase-common
hbase-examples
hbase-external-blockcache
hbase-hadoop2-compat
hbase-hadoop-compat
hbase-it
hbase-native-client
hbase-prefix-tree
hbase-procedure
hbase-protocol
hbase-resource-bundle
hbase-rest
hbase-server
hbase-shaded
hbase-shell
hbase-testing-util
hbase-thrift
LICENSE.txt
NOTICE.txt
pom.xml
README.txt
src
target
++ wc -l
++ grep -e -Dhbase.test
++ grep surefirebooter
++ jps -v
+ ZOMBIE_TESTS_COUNT=0
+ [[ 0 != 0 ]]
+ echo 'We'\''re ok: there is no zombie test'
We're ok: there is no zombie test
POST BUILD TASK : SUCCESS
END OF POST BUILD TASK : 0
Archiving artifacts
Recording test results