You are viewing a plain text version of this content. The canonical link for it is here.
Posted to builds@beam.apache.org by Apache Jenkins Server <je...@builds.apache.org> on 2021/11/17 06:31:26 UTC
Build failed in Jenkins: beam_PostCommit_Java_PVR_Spark2_Streaming #857
See <https://ci-beam.apache.org/job/beam_PostCommit_Java_PVR_Spark2_Streaming/857/display/redirect?page=changes>
Changes:
[noreply] Merge pull request #15997: [BEAM-8688] Upgrading gcsio library to latest
------------------------------------------
[...truncated 580 B...]
Cloning the remote Git repository
Cloning repository https://github.com/apache/beam.git
> git init <https://ci-beam.apache.org/job/beam_PostCommit_Java_PVR_Spark2_Streaming/ws/src> # timeout=10
Fetching upstream changes from https://github.com/apache/beam.git
> git --version # timeout=10
> git --version # 'git version 2.7.4'
> git fetch --tags --progress https://github.com/apache/beam.git +refs/heads/*:refs/remotes/origin/* # timeout=10
> git config remote.origin.url https://github.com/apache/beam.git # timeout=10
> git config --add remote.origin.fetch +refs/heads/*:refs/remotes/origin/* # timeout=10
> git config remote.origin.url https://github.com/apache/beam.git # timeout=10
Fetching upstream changes from https://github.com/apache/beam.git
> git fetch --tags --progress https://github.com/apache/beam.git +refs/heads/*:refs/remotes/origin/* +refs/pull/${ghprbPullId}/*:refs/remotes/origin/pr/${ghprbPullId}/* # timeout=10
> git rev-parse origin/master^{commit} # timeout=10
Checking out Revision 6dc1b6ff5cdde27d3642f995c066dd58c3d4c6ec (origin/master)
> git config core.sparsecheckout # timeout=10
> git checkout -f 6dc1b6ff5cdde27d3642f995c066dd58c3d4c6ec # timeout=10
Commit message: "Merge pull request #15997: [BEAM-8688] Upgrading gcsio library to latest along with flogger"
> git rev-list --no-walk 072fcae6d44e8540faed79e20370c3d7be267197 # timeout=10
No emails were triggered.
[EnvInject] - Executing scripts and injecting environment variables after the SCM step.
[EnvInject] - Injecting as environment variables the properties content
SPARK_LOCAL_IP=127.0.0.1
SETUPTOOLS_USE_DISTUTILS=stdlib
[EnvInject] - Variables injected successfully.
[Gradle] - Launching build.
[src] $ <https://ci-beam.apache.org/job/beam_PostCommit_Java_PVR_Spark2_Streaming/ws/src/gradlew> --continue --max-workers=12 -Dorg.gradle.jvmargs=-Xms2g -Dorg.gradle.jvmargs=-Xmx4g -Dorg.gradle.vfs.watch=false -Pdocker-pull-licenses :runners:spark:2:job-server:validatesPortableRunnerStreaming
Starting a Gradle Daemon, 1 busy Daemon could not be reused, use --status for details
> Task :buildSrc:compileJava NO-SOURCE
> Task :buildSrc:compileGroovy FROM-CACHE
> Task :buildSrc:pluginDescriptors
> Task :buildSrc:processResources
> Task :buildSrc:classes
> Task :buildSrc:jar
> Task :buildSrc:assemble
> Task :buildSrc:spotlessGroovy FROM-CACHE
> Task :buildSrc:spotlessGroovyCheck UP-TO-DATE
> Task :buildSrc:spotlessGroovyGradle FROM-CACHE
> Task :buildSrc:spotlessGroovyGradleCheck UP-TO-DATE
> Task :buildSrc:spotlessCheck UP-TO-DATE
> Task :buildSrc:pluginUnderTestMetadata
> Task :buildSrc:compileTestJava NO-SOURCE
> Task :buildSrc:compileTestGroovy NO-SOURCE
> Task :buildSrc:processTestResources NO-SOURCE
> Task :buildSrc:testClasses UP-TO-DATE
> Task :buildSrc:test NO-SOURCE
> Task :buildSrc:validatePlugins FROM-CACHE
> Task :buildSrc:check UP-TO-DATE
> Task :buildSrc:build
Configuration on demand is an incubating feature.
> Task :model:job-management:createCheckerFrameworkManifest
> Task :runners:java-job-service:createCheckerFrameworkManifest
> Task :sdks:java:core:createCheckerFrameworkManifest
> Task :runners:core-construction-java:createCheckerFrameworkManifest
> Task :model:fn-execution:createCheckerFrameworkManifest
> Task :model:pipeline:createCheckerFrameworkManifest
> Task :runners:java-fn-execution:createCheckerFrameworkManifest
> Task :sdks:java:fn-execution:createCheckerFrameworkManifest
> Task :runners:core-java:createCheckerFrameworkManifest
> Task :sdks:java:expansion-service:createCheckerFrameworkManifest
> Task :sdks:java:harness:createCheckerFrameworkManifest
> Task :sdks:java:extensions:google-cloud-platform-core:createCheckerFrameworkManifest
> Task :sdks:java:core:generateAvroProtocol NO-SOURCE
> Task :runners:core-java:processResources NO-SOURCE
> Task :runners:java-job-service:processResources NO-SOURCE
> Task :sdks:java:expansion-service:processResources NO-SOURCE
> Task :sdks:java:harness:processResources NO-SOURCE
> Task :runners:core-construction-java:processResources NO-SOURCE
> Task :sdks:java:extensions:google-cloud-platform-core:processResources NO-SOURCE
> Task :runners:core-java:processTestResources NO-SOURCE
> Task :runners:java-fn-execution:processResources NO-SOURCE
> Task :sdks:java:core:generateAvroJava NO-SOURCE
> Task :sdks:java:fn-execution:processResources NO-SOURCE
> Task :runners:core-construction-java:processTestResources NO-SOURCE
> Task :runners:spark:2:copyResourcesOverrides NO-SOURCE
> Task :runners:portability:java:createCheckerFrameworkManifest
> Task :model:job-management:extractProto
> Task :runners:portability:java:processResources NO-SOURCE
> Task :model:fn-execution:extractProto
> Task :runners:portability:java:processTestResources NO-SOURCE
> Task :sdks:java:io:kafka:createCheckerFrameworkManifest
> Task :sdks:java:io:kafka:processResources NO-SOURCE
> Task :runners:spark:2:copySourceOverrides
> Task :runners:spark:2:copyTestResourcesOverrides NO-SOURCE
> Task :model:job-management:processResources
> Task :runners:spark:2:createCheckerFrameworkManifest
> Task :model:fn-execution:processResources
> Task :runners:spark:2:processResources
> Task :runners:spark:2:copyTestSourceOverrides NO-SOURCE
> Task :runners:spark:2:processTestResources
> Task :sdks:java:core:generateGrammarSource FROM-CACHE
> Task :sdks:java:core:processResources
> Task :sdks:java:core:generateTestAvroProtocol NO-SOURCE
> Task :sdks:java:core:generateTestAvroJava
> Task :sdks:java:core:generateTestGrammarSource NO-SOURCE
> Task :sdks:java:core:processTestResources
> Task :model:pipeline:extractIncludeProto
> Task :model:pipeline:extractProto
> Task :model:pipeline:generateProto FROM-CACHE
> Task :model:pipeline:compileJava FROM-CACHE
> Task :model:pipeline:processResources
> Task :model:pipeline:classes
> Task :model:pipeline:jar
> Task :model:pipeline:shadowJar FROM-CACHE
> Task :model:job-management:extractIncludeProto
> Task :model:fn-execution:extractIncludeProto
> Task :model:job-management:generateProto FROM-CACHE
> Task :model:fn-execution:generateProto FROM-CACHE
> Task :model:job-management:compileJava FROM-CACHE
> Task :model:job-management:classes
> Task :model:fn-execution:compileJava FROM-CACHE
> Task :model:fn-execution:classes
> Task :model:fn-execution:shadowJar FROM-CACHE
> Task :model:job-management:shadowJar FROM-CACHE
> Task :sdks:java:core:compileJava FROM-CACHE
> Task :sdks:java:core:classes
> Task :sdks:java:core:shadowJar FROM-CACHE
> Task :sdks:java:core:jar
> Task :sdks:java:fn-execution:compileJava FROM-CACHE
> Task :sdks:java:fn-execution:classes UP-TO-DATE
> Task :sdks:java:fn-execution:jar
> Task :runners:core-construction-java:compileJava FROM-CACHE
> Task :runners:core-construction-java:classes UP-TO-DATE
> Task :runners:core-construction-java:jar
> Task :runners:core-java:compileJava FROM-CACHE
> Task :runners:core-java:classes UP-TO-DATE
> Task :runners:core-java:jar
> Task :sdks:java:extensions:google-cloud-platform-core:compileJava FROM-CACHE
> Task :sdks:java:extensions:google-cloud-platform-core:classes UP-TO-DATE
> Task :sdks:java:extensions:google-cloud-platform-core:jar
> Task :sdks:java:core:compileTestJava FROM-CACHE
> Task :sdks:java:core:testClasses
> Task :sdks:java:harness:compileJava FROM-CACHE
> Task :sdks:java:harness:classes UP-TO-DATE
> Task :sdks:java:core:shadowTestJar FROM-CACHE
> Task :sdks:java:harness:jar
> Task :runners:core-java:compileTestJava FROM-CACHE
> Task :runners:core-java:testClasses UP-TO-DATE
> Task :runners:core-java:testJar
> Task :runners:core-construction-java:compileTestJava FROM-CACHE
> Task :runners:core-construction-java:testClasses UP-TO-DATE
> Task :runners:core-construction-java:testJar
> Task :sdks:java:harness:shadowJar FROM-CACHE
> Task :runners:java-fn-execution:compileJava FROM-CACHE
> Task :runners:java-fn-execution:classes UP-TO-DATE
> Task :runners:java-fn-execution:jar
> Task :sdks:java:expansion-service:compileJava FROM-CACHE
> Task :sdks:java:expansion-service:classes UP-TO-DATE
> Task :sdks:java:expansion-service:jar
> Task :runners:java-job-service:compileJava FROM-CACHE
> Task :runners:java-job-service:classes UP-TO-DATE
> Task :runners:java-job-service:jar
> Task :sdks:java:io:kafka:compileJava FROM-CACHE
> Task :sdks:java:io:kafka:classes UP-TO-DATE
> Task :sdks:java:io:kafka:jar
> Task :runners:portability:java:compileJava
> Task :runners:spark:2:compileJava
> Task :runners:portability:java:classes
> Task :runners:portability:java:jar
> Task :runners:portability:java:compileTestJava
Note: <https://ci-beam.apache.org/job/beam_PostCommit_Java_PVR_Spark2_Streaming/ws/src/runners/portability/java/src/test/java/org/apache/beam/runners/portability/CloseableResourceTest.java> uses or overrides a deprecated API.
Note: Recompile with -Xlint:deprecation for details.
> Task :runners:portability:java:testClasses
> Task :runners:portability:java:testJar
> Task :runners:spark:2:compileJava
Note: Some input files use or override a deprecated API.
Note: Recompile with -Xlint:deprecation for details.
Note: Some input files use unchecked or unsafe operations.
Note: Recompile with -Xlint:unchecked for details.
> Task :runners:spark:2:classes
> Task :runners:spark:2:jar
> Task :runners:spark:2:compileTestJava
Note: Some input files use or override a deprecated API.
Note: Recompile with -Xlint:deprecation for details.
Note: Some input files use unchecked or unsafe operations.
Note: Recompile with -Xlint:unchecked for details.
> Task :runners:spark:2:testClasses
> Task :runners:spark:2:testJar
> Task :runners:spark:2:job-server:validatesPortableRunnerStreaming
org.apache.beam.sdk.PipelineTest > testIdentityTransform FAILED
java.lang.AssertionError at PipelineTest.java:318
org.apache.beam.sdk.transforms.CombineTest$BasicTests > testBinaryCombinePerKeyInstanceMethodReference FAILED
java.lang.AssertionError at CombineTest.java:948
org.apache.beam.sdk.transforms.ReshuffleTest > testAssignShardFn FAILED
java.lang.AssertionError at ReshuffleTest.java:302
org.apache.beam.sdk.testing.PAssertTest > testPAssertThatListSatisfiesOneMatcher FAILED
java.lang.AssertionError at PAssertTest.java:665
org.apache.beam.sdk.PipelineTest > testTupleProjectionTransform FAILED
java.lang.AssertionError at PipelineTest.java:340
org.apache.beam.sdk.transforms.ReshuffleTest > testJustReshuffle FAILED
java.lang.AssertionError at ReshuffleTest.java:106
org.apache.beam.sdk.transforms.ParDoTest$BasicTests > testParDo FAILED
java.lang.AssertionError at ParDoTest.java:386
org.apache.beam.sdk.testing.PAssertTest > testNotEqualTo FAILED
java.lang.AssertionError at PAssertTest.java:362
org.apache.beam.sdk.transforms.ParDoTest$TimestampTests > testParDoShiftTimestampUnlimited FAILED
java.lang.AssertionError at ParDoTest.java:1961
org.apache.beam.sdk.transforms.CombineTest$WindowingTests > testWindowedCombineEmpty FAILED
java.lang.AssertionError at CombineTest.java:1330
org.apache.beam.sdk.transforms.ParDoTest$BasicTests > testParDoInCustomTransform FAILED
java.lang.AssertionError at ParDoTest.java:448
org.apache.beam.sdk.transforms.ImpulseTest > testImpulse FAILED
java.lang.AssertionError at ImpulseTest.java:47
112 tests completed, 12 failed, 1 skipped
> Task :runners:spark:2:job-server:validatesPortableRunnerStreaming FAILED
FAILURE: Build failed with an exception.
* What went wrong:
Execution failed for task ':runners:spark:2:job-server:validatesPortableRunnerStreaming'.
> There were failing tests. See the report at: file://<https://ci-beam.apache.org/job/beam_PostCommit_Java_PVR_Spark2_Streaming/ws/src/runners/spark/2/job-server/build/reports/tests/validatesPortableRunnerStreaming/index.html>
* Try:
Run with --stacktrace option to get the stack trace. Run with --info or --debug option to get more log output. Run with --scan to get full insights.
* Get more help at https://help.gradle.org
Deprecated Gradle features were used in this build, making it incompatible with Gradle 7.0.
Use '--warning-mode all' to show the individual deprecation warnings.
See https://docs.gradle.org/6.9.1/userguide/command_line_interface.html#sec:command_line_warnings
BUILD FAILED in 30m 53s
78 actionable tasks: 52 executed, 26 from cache
Publishing build scan...
https://gradle.com/s/uyrodcajtxsx4
Build step 'Invoke Gradle script' changed build result to FAILURE
Build step 'Invoke Gradle script' marked build as failure
---------------------------------------------------------------------
To unsubscribe, e-mail: builds-unsubscribe@beam.apache.org
For additional commands, e-mail: builds-help@beam.apache.org
Jenkins build is back to normal : beam_PostCommit_Java_PVR_Spark2_Streaming #864
Posted by Apache Jenkins Server <je...@builds.apache.org>.
See <https://ci-beam.apache.org/job/beam_PostCommit_Java_PVR_Spark2_Streaming/864/display/redirect?page=changes>
---------------------------------------------------------------------
To unsubscribe, e-mail: builds-unsubscribe@beam.apache.org
For additional commands, e-mail: builds-help@beam.apache.org
Build failed in Jenkins: beam_PostCommit_Java_PVR_Spark2_Streaming #863
Posted by Apache Jenkins Server <je...@builds.apache.org>.
See <https://ci-beam.apache.org/job/beam_PostCommit_Java_PVR_Spark2_Streaming/863/display/redirect?page=changes>
Changes:
[noreply] Merge pull request #15785 from Support for passing priority parameter in
------------------------------------------
Started by timer
Running as SYSTEM
[EnvInject] - Loading node environment variables.
Building remotely on apache-beam-jenkins-8 (beam) in workspace <https://ci-beam.apache.org/job/beam_PostCommit_Java_PVR_Spark2_Streaming/ws/>
The recommended git tool is: NONE
No credentials specified
Wiping out workspace first.
Cloning the remote Git repository
Cloning repository https://github.com/apache/beam.git
> git init <https://ci-beam.apache.org/job/beam_PostCommit_Java_PVR_Spark2_Streaming/ws/src> # timeout=10
Fetching upstream changes from https://github.com/apache/beam.git
> git --version # timeout=10
> git --version # 'git version 2.7.4'
> git fetch --tags --progress https://github.com/apache/beam.git +refs/heads/*:refs/remotes/origin/* # timeout=10
> git config remote.origin.url https://github.com/apache/beam.git # timeout=10
> git config --add remote.origin.fetch +refs/heads/*:refs/remotes/origin/* # timeout=10
> git config remote.origin.url https://github.com/apache/beam.git # timeout=10
Fetching upstream changes from https://github.com/apache/beam.git
> git fetch --tags --progress https://github.com/apache/beam.git +refs/heads/*:refs/remotes/origin/* +refs/pull/${ghprbPullId}/*:refs/remotes/origin/pr/${ghprbPullId}/* # timeout=10
> git rev-parse origin/master^{commit} # timeout=10
Checking out Revision 48984603fb74736be2887474b43990b150a87132 (origin/master)
> git config core.sparsecheckout # timeout=10
> git checkout -f 48984603fb74736be2887474b43990b150a87132 # timeout=10
Commit message: "Merge pull request #15785 from Support for passing priority parameter in SpannerIO"
> git rev-list --no-walk 3f504c7d7863703ed7d9eccb6ab5007dfe1d9146 # timeout=10
No emails were triggered.
[EnvInject] - Executing scripts and injecting environment variables after the SCM step.
[EnvInject] - Injecting as environment variables the properties content
SPARK_LOCAL_IP=127.0.0.1
SETUPTOOLS_USE_DISTUTILS=stdlib
[EnvInject] - Variables injected successfully.
[Gradle] - Launching build.
[src] $ <https://ci-beam.apache.org/job/beam_PostCommit_Java_PVR_Spark2_Streaming/ws/src/gradlew> --continue --max-workers=12 -Dorg.gradle.jvmargs=-Xms2g -Dorg.gradle.jvmargs=-Xmx4g -Dorg.gradle.vfs.watch=false -Pdocker-pull-licenses :runners:spark:2:job-server:validatesPortableRunnerStreaming
Starting a Gradle Daemon, 2 busy Daemons could not be reused, use --status for details
> Task :buildSrc:compileJava NO-SOURCE
> Task :buildSrc:compileGroovy FROM-CACHE
> Task :buildSrc:pluginDescriptors
> Task :buildSrc:processResources
> Task :buildSrc:classes
> Task :buildSrc:jar
> Task :buildSrc:assemble
> Task :buildSrc:spotlessGroovy FROM-CACHE
> Task :buildSrc:spotlessGroovyCheck UP-TO-DATE
> Task :buildSrc:spotlessGroovyGradle FROM-CACHE
> Task :buildSrc:spotlessGroovyGradleCheck UP-TO-DATE
> Task :buildSrc:spotlessCheck UP-TO-DATE
> Task :buildSrc:pluginUnderTestMetadata
> Task :buildSrc:compileTestJava NO-SOURCE
> Task :buildSrc:compileTestGroovy NO-SOURCE
> Task :buildSrc:processTestResources NO-SOURCE
> Task :buildSrc:testClasses UP-TO-DATE
> Task :buildSrc:test NO-SOURCE
> Task :buildSrc:validatePlugins FROM-CACHE
> Task :buildSrc:check UP-TO-DATE
> Task :buildSrc:build
Configuration on demand is an incubating feature.
> Task :model:fn-execution:createCheckerFrameworkManifest
> Task :sdks:java:expansion-service:createCheckerFrameworkManifest
> Task :runners:java-fn-execution:createCheckerFrameworkManifest
> Task :model:job-management:createCheckerFrameworkManifest
> Task :runners:core-construction-java:createCheckerFrameworkManifest
> Task :runners:java-job-service:createCheckerFrameworkManifest
> Task :sdks:java:fn-execution:createCheckerFrameworkManifest
> Task :runners:core-java:createCheckerFrameworkManifest
> Task :sdks:java:core:createCheckerFrameworkManifest
> Task :sdks:java:extensions:google-cloud-platform-core:createCheckerFrameworkManifest
> Task :runners:core-construction-java:processResources NO-SOURCE
> Task :sdks:java:core:generateAvroProtocol NO-SOURCE
> Task :sdks:java:harness:createCheckerFrameworkManifest
> Task :model:pipeline:createCheckerFrameworkManifest
> Task :model:job-management:extractProto
> Task :runners:core-java:processResources NO-SOURCE
> Task :sdks:java:core:generateAvroJava NO-SOURCE
> Task :sdks:java:extensions:google-cloud-platform-core:processResources NO-SOURCE
> Task :sdks:java:expansion-service:processResources NO-SOURCE
> Task :sdks:java:fn-execution:processResources NO-SOURCE
> Task :sdks:java:harness:processResources NO-SOURCE
> Task :runners:java-fn-execution:processResources NO-SOURCE
> Task :runners:core-construction-java:processTestResources NO-SOURCE
> Task :runners:java-job-service:processResources NO-SOURCE
> Task :runners:core-java:processTestResources NO-SOURCE
> Task :model:fn-execution:extractProto
> Task :runners:spark:2:copyResourcesOverrides NO-SOURCE
> Task :runners:portability:java:createCheckerFrameworkManifest
> Task :runners:portability:java:processResources NO-SOURCE
> Task :runners:portability:java:processTestResources NO-SOURCE
> Task :model:job-management:processResources
> Task :sdks:java:io:kafka:createCheckerFrameworkManifest
> Task :sdks:java:io:kafka:processResources NO-SOURCE
> Task :runners:spark:2:copySourceOverrides
> Task :runners:spark:2:copyTestResourcesOverrides NO-SOURCE
> Task :runners:spark:2:createCheckerFrameworkManifest
> Task :runners:spark:2:processResources
> Task :runners:spark:2:copyTestSourceOverrides NO-SOURCE
> Task :model:fn-execution:processResources
> Task :sdks:java:core:generateGrammarSource FROM-CACHE
> Task :runners:spark:2:processTestResources
> Task :sdks:java:core:processResources
> Task :sdks:java:core:generateTestAvroProtocol NO-SOURCE
> Task :model:pipeline:extractIncludeProto
> Task :model:pipeline:extractProto
> Task :sdks:java:core:generateTestAvroJava
> Task :sdks:java:core:generateTestGrammarSource NO-SOURCE
> Task :sdks:java:core:processTestResources
> Task :model:pipeline:generateProto FROM-CACHE
> Task :model:pipeline:compileJava FROM-CACHE
> Task :model:pipeline:processResources
> Task :model:pipeline:classes
> Task :model:pipeline:jar
> Task :model:pipeline:shadowJar FROM-CACHE
> Task :model:job-management:extractIncludeProto
> Task :model:job-management:generateProto FROM-CACHE
> Task :model:fn-execution:extractIncludeProto
> Task :model:fn-execution:generateProto FROM-CACHE
> Task :model:fn-execution:compileJava FROM-CACHE
> Task :model:fn-execution:classes
> Task :model:job-management:compileJava FROM-CACHE
> Task :model:job-management:classes
> Task :model:job-management:shadowJar FROM-CACHE
> Task :model:fn-execution:shadowJar FROM-CACHE
> Task :sdks:java:core:compileJava FROM-CACHE
> Task :sdks:java:core:classes
> Task :sdks:java:core:shadowJar FROM-CACHE
> Task :sdks:java:core:jar
> Task :sdks:java:fn-execution:compileJava FROM-CACHE
> Task :sdks:java:fn-execution:classes UP-TO-DATE
> Task :sdks:java:fn-execution:jar
> Task :runners:core-construction-java:compileJava FROM-CACHE
> Task :runners:core-construction-java:classes UP-TO-DATE
> Task :runners:core-construction-java:jar
> Task :runners:core-java:compileJava FROM-CACHE
> Task :runners:core-java:classes UP-TO-DATE
> Task :runners:core-java:jar
> Task :sdks:java:extensions:google-cloud-platform-core:compileJava FROM-CACHE
> Task :sdks:java:extensions:google-cloud-platform-core:classes UP-TO-DATE
> Task :sdks:java:extensions:google-cloud-platform-core:jar
> Task :sdks:java:harness:compileJava FROM-CACHE
> Task :sdks:java:harness:classes UP-TO-DATE
> Task :sdks:java:harness:jar
> Task :sdks:java:harness:shadowJar FROM-CACHE
> Task :runners:java-fn-execution:compileJava FROM-CACHE
> Task :runners:java-fn-execution:classes UP-TO-DATE
> Task :runners:java-fn-execution:jar
> Task :sdks:java:expansion-service:compileJava FROM-CACHE
> Task :sdks:java:expansion-service:classes UP-TO-DATE
> Task :sdks:java:expansion-service:jar
> Task :runners:java-job-service:compileJava FROM-CACHE
> Task :runners:java-job-service:classes UP-TO-DATE
> Task :runners:java-job-service:jar
> Task :sdks:java:io:kafka:compileJava FROM-CACHE
> Task :sdks:java:io:kafka:classes UP-TO-DATE
> Task :sdks:java:io:kafka:jar
> Task :runners:spark:2:compileJava FROM-CACHE
> Task :runners:spark:2:classes
> Task :runners:spark:2:jar
> Task :sdks:java:core:compileTestJava
> Task :runners:portability:java:compileJava
> Task :runners:portability:java:classes
> Task :runners:portability:java:jar
> Task :sdks:java:core:compileTestJava
Note: Some input files use or override a deprecated API.
Note: Recompile with -Xlint:deprecation for details.
Note: Some input files use unchecked or unsafe operations.
Note: Recompile with -Xlint:unchecked for details.
> Task :sdks:java:core:testClasses
> Task :sdks:java:core:shadowTestJar FROM-CACHE
> Task :runners:core-construction-java:compileTestJava
Note: Some input files use or override a deprecated API.
Note: Recompile with -Xlint:deprecation for details.
Note: Some input files use unchecked or unsafe operations.
Note: Recompile with -Xlint:unchecked for details.
> Task :runners:core-construction-java:testClasses
> Task :runners:core-java:compileTestJava
Note: Some input files use or override a deprecated API.
Note: Recompile with -Xlint:deprecation for details.
Note: Some input files use unchecked or unsafe operations.
Note: Recompile with -Xlint:unchecked for details.
> Task :runners:core-java:testClasses
> Task :runners:core-construction-java:testJar
> Task :runners:core-java:testJar
> Task :runners:portability:java:compileTestJava
Note: <https://ci-beam.apache.org/job/beam_PostCommit_Java_PVR_Spark2_Streaming/ws/src/runners/portability/java/src/test/java/org/apache/beam/runners/portability/CloseableResourceTest.java> uses or overrides a deprecated API.
Note: Recompile with -Xlint:deprecation for details.
> Task :runners:portability:java:testClasses
> Task :runners:portability:java:testJar
> Task :runners:spark:2:compileTestJava
Note: Some input files use or override a deprecated API.
Note: Recompile with -Xlint:deprecation for details.
Note: Some input files use unchecked or unsafe operations.
Note: Recompile with -Xlint:unchecked for details.
> Task :runners:spark:2:testClasses
> Task :runners:spark:2:testJar
> Task :runners:spark:2:job-server:validatesPortableRunnerStreaming
org.apache.beam.sdk.transforms.CombineFnsTest > testComposedCombineNullValues FAILED
java.lang.RuntimeException at CombineFnsTest.java:251
Shutting SDK harness down.
org.apache.beam.sdk.transforms.GroupByKeyTest > org.apache.beam.sdk.transforms.GroupByKeyTest$BasicTests.testLargeKeys10MB FAILED
java.lang.AssertionError at GroupByKeyTest.java:477
org.apache.beam.sdk.transforms.GroupByKeyTest > org.apache.beam.sdk.transforms.GroupByKeyTest$BasicTests.testGroupByKeyWithBadEqualsHashCode FAILED
java.lang.AssertionError at GroupByKeyTest.java:453
org.apache.beam.sdk.transforms.ParDoTest$LifecycleTests > testParDoWithErrorInStartBatch FAILED
java.lang.AssertionError at Assert.java:89
112 tests completed, 4 failed, 1 skipped
> Task :runners:spark:2:job-server:validatesPortableRunnerStreaming FAILED
FAILURE: Build failed with an exception.
* What went wrong:
Execution failed for task ':runners:spark:2:job-server:validatesPortableRunnerStreaming'.
> There were failing tests. See the report at: file://<https://ci-beam.apache.org/job/beam_PostCommit_Java_PVR_Spark2_Streaming/ws/src/runners/spark/2/job-server/build/reports/tests/validatesPortableRunnerStreaming/index.html>
* Try:
Run with --stacktrace option to get the stack trace. Run with --info or --debug option to get more log output. Run with --scan to get full insights.
* Get more help at https://help.gradle.org
Deprecated Gradle features were used in this build, making it incompatible with Gradle 7.0.
Use '--warning-mode all' to show the individual deprecation warnings.
See https://docs.gradle.org/6.9.1/userguide/command_line_interface.html#sec:command_line_warnings
BUILD FAILED in 31m 32s
78 actionable tasks: 54 executed, 24 from cache
Publishing build scan...
https://gradle.com/s/bozpxkcjxkc3y
Build step 'Invoke Gradle script' changed build result to FAILURE
Build step 'Invoke Gradle script' marked build as failure
---------------------------------------------------------------------
To unsubscribe, e-mail: builds-unsubscribe@beam.apache.org
For additional commands, e-mail: builds-help@beam.apache.org
Build failed in Jenkins: beam_PostCommit_Java_PVR_Spark2_Streaming #862
Posted by Apache Jenkins Server <je...@builds.apache.org>.
See <https://ci-beam.apache.org/job/beam_PostCommit_Java_PVR_Spark2_Streaming/862/display/redirect?page=changes>
Changes:
[noreply] [BEAM-13183] [BEAM-8152] Use venv instead of virtualenv to create Python
------------------------------------------
[...truncated 1.69 KB...]
Commit message: "[BEAM-13183] [BEAM-8152] Use venv instead of virtualenv to create Python environments in Gradle scripts. (#15819)"
> git rev-list --no-walk 2335ec61b579581b078f5b3ab61a9a47ba03545f # timeout=10
No emails were triggered.
[EnvInject] - Executing scripts and injecting environment variables after the SCM step.
[EnvInject] - Injecting as environment variables the properties content
SPARK_LOCAL_IP=127.0.0.1
SETUPTOOLS_USE_DISTUTILS=stdlib
[EnvInject] - Variables injected successfully.
[Gradle] - Launching build.
[src] $ <https://ci-beam.apache.org/job/beam_PostCommit_Java_PVR_Spark2_Streaming/ws/src/gradlew> --continue --max-workers=12 -Dorg.gradle.jvmargs=-Xms2g -Dorg.gradle.jvmargs=-Xmx4g -Dorg.gradle.vfs.watch=false -Pdocker-pull-licenses :runners:spark:2:job-server:validatesPortableRunnerStreaming
Starting a Gradle Daemon, 2 busy Daemons could not be reused, use --status for details
> Task :buildSrc:compileJava NO-SOURCE
> Task :buildSrc:compileGroovy FROM-CACHE
> Task :buildSrc:pluginDescriptors
> Task :buildSrc:processResources
> Task :buildSrc:classes
> Task :buildSrc:jar
> Task :buildSrc:assemble
> Task :buildSrc:spotlessGroovy FROM-CACHE
> Task :buildSrc:spotlessGroovyCheck UP-TO-DATE
> Task :buildSrc:spotlessGroovyGradle FROM-CACHE
> Task :buildSrc:spotlessGroovyGradleCheck UP-TO-DATE
> Task :buildSrc:spotlessCheck UP-TO-DATE
> Task :buildSrc:pluginUnderTestMetadata
> Task :buildSrc:compileTestJava NO-SOURCE
> Task :buildSrc:compileTestGroovy NO-SOURCE
> Task :buildSrc:processTestResources NO-SOURCE
> Task :buildSrc:testClasses UP-TO-DATE
> Task :buildSrc:test NO-SOURCE
> Task :buildSrc:validatePlugins FROM-CACHE
> Task :buildSrc:check UP-TO-DATE
> Task :buildSrc:build
Configuration on demand is an incubating feature.
> Task :sdks:java:fn-execution:createCheckerFrameworkManifest
> Task :sdks:java:expansion-service:createCheckerFrameworkManifest
> Task :runners:core-construction-java:createCheckerFrameworkManifest
> Task :model:pipeline:createCheckerFrameworkManifest
> Task :runners:java-fn-execution:createCheckerFrameworkManifest
> Task :sdks:java:core:createCheckerFrameworkManifest
> Task :model:fn-execution:createCheckerFrameworkManifest
> Task :sdks:java:harness:createCheckerFrameworkManifest
> Task :runners:core-java:createCheckerFrameworkManifest
> Task :runners:java-job-service:createCheckerFrameworkManifest
> Task :model:job-management:createCheckerFrameworkManifest
> Task :sdks:java:extensions:google-cloud-platform-core:createCheckerFrameworkManifest
> Task :sdks:java:fn-execution:processResources NO-SOURCE
> Task :sdks:java:core:generateAvroProtocol NO-SOURCE
> Task :runners:core-construction-java:processResources NO-SOURCE
> Task :runners:core-java:processResources NO-SOURCE
> Task :sdks:java:core:generateAvroJava NO-SOURCE
> Task :sdks:java:expansion-service:processResources NO-SOURCE
> Task :runners:java-fn-execution:processResources NO-SOURCE
> Task :runners:core-construction-java:processTestResources NO-SOURCE
> Task :sdks:java:extensions:google-cloud-platform-core:processResources NO-SOURCE
> Task :sdks:java:harness:processResources NO-SOURCE
> Task :runners:java-job-service:processResources NO-SOURCE
> Task :runners:core-java:processTestResources NO-SOURCE
> Task :runners:portability:java:createCheckerFrameworkManifest
> Task :runners:portability:java:processResources NO-SOURCE
> Task :model:job-management:extractProto
> Task :runners:spark:2:copyResourcesOverrides NO-SOURCE
> Task :model:fn-execution:extractProto
> Task :runners:portability:java:processTestResources NO-SOURCE
> Task :sdks:java:io:kafka:createCheckerFrameworkManifest
> Task :sdks:java:io:kafka:processResources NO-SOURCE
> Task :model:job-management:processResources
> Task :runners:spark:2:copySourceOverrides
> Task :model:fn-execution:processResources
> Task :runners:spark:2:copyTestResourcesOverrides NO-SOURCE
> Task :runners:spark:2:createCheckerFrameworkManifest
> Task :runners:spark:2:processResources
> Task :runners:spark:2:copyTestSourceOverrides NO-SOURCE
> Task :runners:spark:2:processTestResources
> Task :sdks:java:core:generateGrammarSource FROM-CACHE
> Task :sdks:java:core:processResources
> Task :sdks:java:core:generateTestAvroProtocol NO-SOURCE
> Task :sdks:java:core:generateTestAvroJava
> Task :sdks:java:core:generateTestGrammarSource NO-SOURCE
> Task :sdks:java:core:processTestResources
> Task :model:pipeline:extractIncludeProto
> Task :model:pipeline:extractProto
> Task :model:pipeline:generateProto FROM-CACHE
> Task :model:pipeline:compileJava FROM-CACHE
> Task :model:pipeline:processResources
> Task :model:pipeline:classes
> Task :model:pipeline:jar
> Task :model:pipeline:shadowJar FROM-CACHE
> Task :model:fn-execution:extractIncludeProto
> Task :model:job-management:extractIncludeProto
> Task :model:job-management:generateProto FROM-CACHE
> Task :model:fn-execution:generateProto FROM-CACHE
> Task :model:job-management:compileJava FROM-CACHE
> Task :model:job-management:classes
> Task :model:fn-execution:compileJava FROM-CACHE
> Task :model:fn-execution:classes
> Task :model:job-management:shadowJar FROM-CACHE
> Task :model:fn-execution:shadowJar FROM-CACHE
> Task :sdks:java:core:compileJava FROM-CACHE
> Task :sdks:java:core:classes
> Task :sdks:java:core:shadowJar FROM-CACHE
> Task :sdks:java:core:jar
> Task :sdks:java:fn-execution:compileJava FROM-CACHE
> Task :sdks:java:fn-execution:classes UP-TO-DATE
> Task :sdks:java:fn-execution:jar
> Task :runners:core-construction-java:compileJava FROM-CACHE
> Task :runners:core-construction-java:classes UP-TO-DATE
> Task :runners:core-construction-java:jar
> Task :sdks:java:core:compileTestJava FROM-CACHE
> Task :sdks:java:core:testClasses
> Task :sdks:java:core:shadowTestJar FROM-CACHE
> Task :runners:core-java:compileJava FROM-CACHE
> Task :runners:core-java:classes UP-TO-DATE
> Task :runners:core-java:jar
> Task :sdks:java:extensions:google-cloud-platform-core:compileJava FROM-CACHE
> Task :sdks:java:extensions:google-cloud-platform-core:classes UP-TO-DATE
> Task :runners:core-construction-java:compileTestJava FROM-CACHE
> Task :runners:core-construction-java:testClasses UP-TO-DATE
> Task :sdks:java:extensions:google-cloud-platform-core:jar
> Task :runners:core-construction-java:testJar
> Task :runners:core-java:compileTestJava FROM-CACHE
> Task :runners:core-java:testClasses UP-TO-DATE
> Task :sdks:java:harness:compileJava FROM-CACHE
> Task :sdks:java:harness:classes UP-TO-DATE
> Task :runners:core-java:testJar
> Task :sdks:java:harness:jar
> Task :sdks:java:harness:shadowJar FROM-CACHE
> Task :runners:java-fn-execution:compileJava FROM-CACHE
> Task :runners:java-fn-execution:classes UP-TO-DATE
> Task :runners:java-fn-execution:jar
> Task :sdks:java:expansion-service:compileJava FROM-CACHE
> Task :sdks:java:expansion-service:classes UP-TO-DATE
> Task :sdks:java:expansion-service:jar
> Task :runners:java-job-service:compileJava FROM-CACHE
> Task :runners:java-job-service:classes UP-TO-DATE
> Task :sdks:java:io:kafka:compileJava FROM-CACHE
> Task :sdks:java:io:kafka:classes UP-TO-DATE
> Task :runners:java-job-service:jar
> Task :sdks:java:io:kafka:jar
> Task :runners:portability:java:compileJava FROM-CACHE
> Task :runners:portability:java:classes UP-TO-DATE
> Task :runners:portability:java:jar
> Task :runners:portability:java:compileTestJava FROM-CACHE
> Task :runners:portability:java:testClasses UP-TO-DATE
> Task :runners:portability:java:testJar
> Task :runners:spark:2:compileJava FROM-CACHE
> Task :runners:spark:2:classes
> Task :runners:spark:2:jar
> Task :runners:spark:2:compileTestJava FROM-CACHE
> Task :runners:spark:2:testClasses
> Task :runners:spark:2:testJar
> Task :runners:spark:2:job-server:validatesPortableRunnerStreaming
org.apache.beam.sdk.testing.PAssertTest > testIsEqualTo FAILED
java.lang.AssertionError at PAssertTest.java:315
org.apache.beam.sdk.PipelineTest > testTupleInjectionTransform FAILED
java.lang.AssertionError at PipelineTest.java:368
org.apache.beam.sdk.transforms.CombineFnsTest > testComposedCombineNullValues FAILED
java.lang.AssertionError at CombineFnsTest.java:251
org.apache.beam.sdk.schemas.AvroSchemaTest > testAvroPipelineGroupBy FAILED
java.lang.AssertionError at AvroSchemaTest.java:497
org.apache.beam.sdk.testing.PAssertTest > testEmpty FAILED
java.lang.AssertionError at PAssertTest.java:471
org.apache.beam.sdk.PipelineTest > testIdentityTransform FAILED
java.lang.AssertionError at PipelineTest.java:318
org.apache.beam.sdk.transforms.CombineTest$BasicTests > testBinaryCombinePerKeyInstanceMethodReference FAILED
java.lang.AssertionError at CombineTest.java:948
org.apache.beam.sdk.transforms.KvSwapTest > testKvSwap FAILED
java.lang.AssertionError at KvSwapTest.java:80
org.apache.beam.sdk.testing.PAssertTest > testPAssertThatListSatisfiesOneMatcher FAILED
java.lang.AssertionError at PAssertTest.java:665
org.apache.beam.sdk.PipelineTest > testTupleProjectionTransform FAILED
java.lang.AssertionError at PipelineTest.java:340
org.apache.beam.sdk.transforms.CombineTest$BasicTests > testCombinePerKeyInstanceMethodReference FAILED
java.lang.AssertionError at CombineTest.java:934
org.apache.beam.sdk.transforms.ReshuffleTest > testAssignShardFn FAILED
java.lang.AssertionError at ReshuffleTest.java:302
org.apache.beam.sdk.testing.PAssertTest > testPAssertThatFlattened FAILED
java.lang.AssertionError at PAssertTest.java:626
org.apache.beam.sdk.transforms.CombineTest$BasicTests > testCombinePerKeyLambda FAILED
java.lang.AssertionError at CombineTest.java:906
org.apache.beam.sdk.PipelineTest > testMultipleApply FAILED
java.lang.AssertionError at PipelineTest.java:252
org.apache.beam.sdk.transforms.ReshuffleTest > testReshuffleAfterFixedWindows FAILED
java.lang.AssertionError at ReshuffleTest.java:235
org.apache.beam.sdk.testing.PAssertTest > testPAssertThatListSatisfiesMultipleMatchers FAILED
java.lang.AssertionError at PAssertTest.java:720
org.apache.beam.sdk.transforms.CombineTest$BasicTests > testBinaryCombinePerKeyLambda FAILED
java.lang.AssertionError at CombineTest.java:920
org.apache.beam.sdk.values.PCollectionTupleTest > testComposePCollectionTuple FAILED
java.lang.AssertionError at PCollectionTupleTest.java:106
org.apache.beam.sdk.transforms.join.CoGroupByKeyTest > testCoGroupByKeyHandleResults FAILED
java.lang.RuntimeException at CoGroupByKeyTest.java:466
org.apache.beam.sdk.transforms.FlattenTest > testFlattenIterablesLists FAILED
java.lang.AssertionError at FlattenTest.java:270
org.apache.beam.sdk.transforms.ParDoTest$BasicTests > testParDoEmptyOutputs FAILED
java.lang.AssertionError at ParDoTest.java:418
org.apache.beam.sdk.transforms.ParDoSchemaTest > testSchemaFieldSelectionUnboxing FAILED
java.lang.AssertionError at ParDoSchemaTest.java:561
112 tests completed, 23 failed, 1 skipped
> Task :runners:spark:2:job-server:validatesPortableRunnerStreaming FAILED
FAILURE: Build failed with an exception.
* What went wrong:
Execution failed for task ':runners:spark:2:job-server:validatesPortableRunnerStreaming'.
> There were failing tests. See the report at: file://<https://ci-beam.apache.org/job/beam_PostCommit_Java_PVR_Spark2_Streaming/ws/src/runners/spark/2/job-server/build/reports/tests/validatesPortableRunnerStreaming/index.html>
* Try:
Run with --stacktrace option to get the stack trace. Run with --info or --debug option to get more log output. Run with --scan to get full insights.
* Get more help at https://help.gradle.org
Deprecated Gradle features were used in this build, making it incompatible with Gradle 7.0.
Use '--warning-mode all' to show the individual deprecation warnings.
See https://docs.gradle.org/6.9.1/userguide/command_line_interface.html#sec:command_line_warnings
BUILD FAILED in 28m 54s
78 actionable tasks: 48 executed, 30 from cache
Publishing build scan...
https://gradle.com/s/a4atgkm2q6bqy
Build step 'Invoke Gradle script' changed build result to FAILURE
Build step 'Invoke Gradle script' marked build as failure
---------------------------------------------------------------------
To unsubscribe, e-mail: builds-unsubscribe@beam.apache.org
For additional commands, e-mail: builds-help@beam.apache.org
Build failed in Jenkins: beam_PostCommit_Java_PVR_Spark2_Streaming #861
Posted by Apache Jenkins Server <je...@builds.apache.org>.
See <https://ci-beam.apache.org/job/beam_PostCommit_Java_PVR_Spark2_Streaming/861/display/redirect>
Changes:
------------------------------------------
[...truncated 33.95 KB...]
> Task :runners:portability:java:testJar
> Task :runners:spark:2:compileJava FROM-CACHE
> Task :runners:spark:2:classes
> Task :runners:spark:2:jar
> Task :runners:spark:2:compileTestJava
Note: Some input files use or override a deprecated API.
Note: Recompile with -Xlint:deprecation for details.
Note: Some input files use unchecked or unsafe operations.
Note: Recompile with -Xlint:unchecked for details.
> Task :runners:spark:2:testClasses
> Task :runners:spark:2:testJar
> Task :runners:spark:2:job-server:validatesPortableRunnerStreaming
org.apache.beam.sdk.transforms.CombineFnsTest > testComposedCombineNullValues FAILED
java.lang.RuntimeException at CombineFnsTest.java:251
org.apache.beam.sdk.transforms.ReshuffleTest > testReshuffleAfterSlidingWindows FAILED
java.lang.AssertionError at ReshuffleTest.java:255
org.apache.beam.sdk.testing.PAssertTest > testPAssertThatListSatisfiesMultipleMatchers FAILED
java.lang.AssertionError at PAssertTest.java:720
org.apache.beam.sdk.transforms.CombineTest$BasicTests > testHotKeyCombiningWithAccumulationMode FAILED
java.lang.AssertionError at CombineTest.java:760
org.apache.beam.sdk.transforms.join.CoGroupByKeyTest > testCoGroupByKeyHandleResults FAILED
java.lang.AssertionError at CoGroupByKeyTest.java:466
org.apache.beam.sdk.testing.PAssertTest > testContainsInAnyOrder FAILED
java.lang.AssertionError at PAssertTest.java:403
org.apache.beam.sdk.transforms.ReshuffleTest > testReshufflePreservesTimestamps FAILED
java.lang.AssertionError at ReshuffleTest.java:152
org.apache.beam.sdk.transforms.ParDoTest$TimestampTests > testParDoShiftTimestamp FAILED
java.lang.AssertionError at ParDoTest.java:1872
org.apache.beam.sdk.testing.PAssertTest > testContainsInAnyOrderNotSerializable FAILED
java.lang.AssertionError at PAssertTest.java:189
org.apache.beam.sdk.transforms.KeysTest > testKeys FAILED
java.lang.AssertionError at KeysTest.java:66
org.apache.beam.sdk.transforms.ReshuffleTest > testJustReshuffle FAILED
java.lang.AssertionError at ReshuffleTest.java:106
org.apache.beam.sdk.transforms.ParDoTest$TimestampTests > testParDoTaggedOutputWithTimestamp FAILED
java.lang.AssertionError at ParDoTest.java:1849
org.apache.beam.sdk.testing.PAssertTest > testSerializablePredicate FAILED
java.lang.AssertionError at PAssertTest.java:210
org.apache.beam.sdk.transforms.KeysTest > testKeysEmpty FAILED
java.lang.AssertionError at KeysTest.java:79
org.apache.beam.sdk.transforms.ParDoTest$TimestampTests > testParDoShiftTimestampUnlimited FAILED
java.lang.AssertionError at ParDoTest.java:1961
org.apache.beam.sdk.testing.PAssertTest > testNotEqualTo FAILED
java.lang.AssertionError at PAssertTest.java:362
org.apache.beam.sdk.transforms.CombineTest$WindowingTests > testWindowedCombineEmpty FAILED
java.lang.AssertionError at CombineTest.java:1330
org.apache.beam.sdk.transforms.ParDoTest$BasicTests > testParDo FAILED
java.lang.AssertionError at ParDoTest.java:386
org.apache.beam.sdk.transforms.ParDoTest$BasicTests > testParDoEmpty FAILED
java.lang.AssertionError at ParDoTest.java:402
org.apache.beam.sdk.transforms.FlattenTest > testFlattenIterablesEmpty FAILED
java.lang.AssertionError at FlattenTest.java:317
org.apache.beam.sdk.transforms.ImpulseTest > testImpulse FAILED
java.lang.AssertionError at ImpulseTest.java:47
org.apache.beam.sdk.transforms.ParDoTest$BasicTests > testParDoInCustomTransform FAILED
java.lang.AssertionError at ParDoTest.java:448
org.apache.beam.sdk.transforms.ParDoSchemaTest > testSchemaFieldSelectionNested FAILED
java.lang.AssertionError at ParDoSchemaTest.java:652
org.apache.beam.sdk.transforms.ParDoTest$BasicTests > testParDoEmptyOutputs FAILED
java.lang.AssertionError at ParDoTest.java:418
org.apache.beam.sdk.transforms.ParDoSchemaTest > testSchemaFieldSelectionUnboxing FAILED
java.lang.AssertionError at ParDoSchemaTest.java:561
org.apache.beam.sdk.transforms.FlattenTest > testFlattenInputMultipleCopies FAILED
java.lang.AssertionError at FlattenTest.java:167
org.apache.beam.sdk.transforms.ParDoSchemaTest > testSchemaFieldDescriptorSelectionUnboxing FAILED
java.lang.AssertionError at ParDoSchemaTest.java:602
org.apache.beam.sdk.transforms.FlattenTest > testFlattenPCollectionsEmpty FAILED
java.lang.AssertionError at FlattenTest.java:135
org.apache.beam.sdk.transforms.ParDoSchemaTest > testInferredSchemaPipeline FAILED
java.lang.AssertionError at ParDoSchemaTest.java:424
org.apache.beam.sdk.transforms.FlattenTest > testFlattenPCollectionsSingletonList FAILED
java.lang.AssertionError at FlattenTest.java:109
org.apache.beam.sdk.transforms.ParDoSchemaTest > testFieldAccessSchemaPipeline FAILED
java.lang.AssertionError at ParDoSchemaTest.java:346
org.apache.beam.sdk.transforms.FlattenTest > testFlattenPCollections FAILED
java.lang.AssertionError at FlattenTest.java:97
org.apache.beam.sdk.transforms.ReifyTimestampsTest > inValuesSucceeds FAILED
java.lang.AssertionError at ReifyTimestampsTest.java:60
org.apache.beam.sdk.transforms.ParDoSchemaTest > testSimpleSchemaPipeline FAILED
java.lang.AssertionError at ParDoSchemaTest.java:115
org.apache.beam.sdk.transforms.FlattenTest > testFlattenPCollectionsThenParDo FAILED
java.lang.AssertionError at FlattenTest.java:123
org.apache.beam.sdk.metrics.MetricsTest$AttemptedMetricTests > testAttemptedDistributionMetrics FAILED
java.lang.AssertionError at MetricsTest.java:379
org.apache.beam.sdk.transforms.ParDoSchemaTest > testSchemaConversionPipeline FAILED
java.lang.AssertionError at ParDoSchemaTest.java:472
org.apache.beam.sdk.transforms.FlattenTest > testFlattenMultiplePCollectionsHavingMultipleConsumers FAILED
java.lang.AssertionError at FlattenTest.java:352
org.apache.beam.sdk.metrics.MetricsTest$AttemptedMetricTests > testAttemptedCounterMetrics FAILED
java.lang.AssertionError at MetricsTest.java:371
org.apache.beam.sdk.transforms.ParDoSchemaTest > testReadAndWriteWithSchemaRegistry FAILED
java.lang.AssertionError at ParDoSchemaTest.java:311
org.apache.beam.sdk.transforms.FlattenTest > testFlattenWithDifferentInputAndOutputCoders FAILED
java.lang.AssertionError at FlattenTest.java:374
org.apache.beam.sdk.transforms.ParDoSchemaTest > testReadAndWriteMultiOutput FAILED
java.lang.RuntimeException at ParDoSchemaTest.java:266
org.apache.beam.sdk.transforms.FlattenTest > testFlattenIterablesSets FAILED
java.lang.AssertionError at FlattenTest.java:285
org.apache.beam.sdk.transforms.ParDoTest$MultipleInputsAndOutputTests > testParDoWithOnlyTaggedOutput FAILED
java.lang.AssertionError at ParDoTest.java:799
org.apache.beam.sdk.transforms.FlattenTest > testFlattenPCollectionsEmptyThenParDo FAILED
java.lang.AssertionError at FlattenTest.java:229
org.apache.beam.sdk.transforms.ParDoTest$MultipleInputsAndOutputTests > testMultiOutputChaining FAILED
java.lang.AssertionError at ParDoTest.java:1445
org.apache.beam.sdk.transforms.CreateTest > testCreateEmpty FAILED
java.lang.AssertionError at CreateTest.java:105
org.apache.beam.sdk.transforms.ParDoTest$MultipleInputsAndOutputTests > testParDoEmptyWithTaggedOutput FAILED
java.lang.AssertionError at ParDoTest.java:746
org.apache.beam.sdk.transforms.CreateTest > testCreateWithKVVoidType FAILED
java.lang.AssertionError at CreateTest.java:341
org.apache.beam.sdk.transforms.ParDoTest$MultipleInputsAndOutputTests > testParDoWithTaggedOutput FAILED
java.lang.AssertionError at ParDoTest.java:704
org.apache.beam.sdk.transforms.CreateTest > testCreateWithNullsAndValues FAILED
java.lang.AssertionError at CreateTest.java:165
org.apache.beam.sdk.transforms.ParDoTest$MultipleInputsAndOutputTests > testParDoWithEmptyTaggedOutput FAILED
java.lang.AssertionError at ParDoTest.java:770
org.apache.beam.sdk.transforms.CreateTest > testCreateWithVoidType FAILED
java.lang.AssertionError at CreateTest.java:329
org.apache.beam.sdk.transforms.GroupByKeyTest > org.apache.beam.sdk.transforms.GroupByKeyTest$BasicTests.testLargeKeys1MB FAILED
java.lang.AssertionError at GroupByKeyTest.java:471
org.apache.beam.sdk.transforms.CreateTest > testCreate FAILED
java.lang.AssertionError at CreateTest.java:94
org.apache.beam.sdk.transforms.GroupByKeyTest > org.apache.beam.sdk.transforms.GroupByKeyTest$BasicTests.testGroupByKeyEmpty FAILED
java.lang.AssertionError at GroupByKeyTest.java:153
org.apache.beam.sdk.transforms.GroupByKeyTest > org.apache.beam.sdk.transforms.GroupByKeyTest$BasicTests.testGroupByKey FAILED
java.lang.AssertionError at GroupByKeyTest.java:136
org.apache.beam.sdk.transforms.GroupByKeyTest > org.apache.beam.sdk.transforms.GroupByKeyTest$BasicTests.testLargeKeys10MB FAILED
java.lang.AssertionError at GroupByKeyTest.java:477
org.apache.beam.sdk.transforms.GroupByKeyTest > org.apache.beam.sdk.transforms.GroupByKeyTest$BasicTests.testGroupByKeyWithBadEqualsHashCode FAILED
java.lang.AssertionError at GroupByKeyTest.java:453
org.apache.beam.sdk.transforms.GroupByKeyTest > org.apache.beam.sdk.transforms.GroupByKeyTest$BasicTests.testLargeKeys100KB FAILED
java.lang.AssertionError at GroupByKeyTest.java:465
org.apache.beam.sdk.transforms.ParDoTest$LifecycleTests > testWindowingInStartAndFinishBundle FAILED
java.lang.AssertionError at ParDoTest.java:1789
org.apache.beam.sdk.transforms.ParDoTest$LifecycleTests > testParDoWithErrorInStartBatch FAILED
java.lang.AssertionError at Assert.java:89
org.apache.beam.sdk.transforms.ParDoTest$LifecycleTests > testParDoWithErrorInProcessElement FAILED
java.lang.AssertionError at Assert.java:89
org.apache.beam.sdk.transforms.ParDoTest$LifecycleTests > testParDoWithErrorInFinishBatch FAILED
java.lang.AssertionError at Assert.java:89
org.apache.beam.sdk.transforms.WithTimestampsTest > withTimestampsShouldApplyTimestamps FAILED
java.lang.RuntimeException at WithTimestampsTest.java:78
org.apache.beam.sdk.transforms.WithTimestampsTest > withTimestampsBackwardsInTimeAndWithAllowedTimestampSkewShouldSucceed FAILED
java.lang.AssertionError at WithTimestampsTest.java:143
org.apache.beam.sdk.transforms.WithTimestampsTest > withTimestampsLambdaShouldApplyTimestamps FAILED
java.lang.AssertionError at WithTimestampsTest.java:206
org.apache.beam.runners.core.metrics.MetricsPusherTest > pushesUserMetrics FAILED
java.lang.NullPointerException at MetricsPusherTest.java:74
org.apache.beam.runners.core.metrics.MetricsPusherTest > pushesSystemMetrics FAILED
java.lang.NullPointerException at MetricsPusherTest.java:95
112 tests completed, 69 failed, 1 skipped
> Task :runners:spark:2:job-server:validatesPortableRunnerStreaming FAILED
FAILURE: Build failed with an exception.
* What went wrong:
Execution failed for task ':runners:spark:2:job-server:validatesPortableRunnerStreaming'.
> There were failing tests. See the report at: file://<https://ci-beam.apache.org/job/beam_PostCommit_Java_PVR_Spark2_Streaming/ws/src/runners/spark/2/job-server/build/reports/tests/validatesPortableRunnerStreaming/index.html>
* Try:
Run with --stacktrace option to get the stack trace. Run with --info or --debug option to get more log output. Run with --scan to get full insights.
* Get more help at https://help.gradle.org
Deprecated Gradle features were used in this build, making it incompatible with Gradle 7.0.
Use '--warning-mode all' to show the individual deprecation warnings.
See https://docs.gradle.org/6.9.1/userguide/command_line_interface.html#sec:command_line_warnings
BUILD FAILED in 37m 34s
78 actionable tasks: 49 executed, 29 from cache
Publishing build scan...
https://gradle.com/s/oflhezlfcqtxe
Build step 'Invoke Gradle script' changed build result to FAILURE
Build step 'Invoke Gradle script' marked build as failure
---------------------------------------------------------------------
To unsubscribe, e-mail: builds-unsubscribe@beam.apache.org
For additional commands, e-mail: builds-help@beam.apache.org
Build failed in Jenkins: beam_PostCommit_Java_PVR_Spark2_Streaming #860
Posted by Apache Jenkins Server <je...@builds.apache.org>.
See <https://ci-beam.apache.org/job/beam_PostCommit_Java_PVR_Spark2_Streaming/860/display/redirect?page=changes>
Changes:
[Brian Hulette] remove pkg_resources in run_generate_requirements.sh
[Brian Hulette] Run generatePythonRequirementsAll for pyarrow 6
[noreply] Update dev container tags used by Dataflow runner with unreleased SDKs.
[noreply] [BEAM-13265] Add withDeterministicRecordIdFn which allows for
------------------------------------------
[...truncated 15 B...]
[EnvInject] - Loading node environment variables.
Building remotely on apache-beam-jenkins-4 (beam) in workspace <https://ci-beam.apache.org/job/beam_PostCommit_Java_PVR_Spark2_Streaming/ws/>
The recommended git tool is: NONE
No credentials specified
Wiping out workspace first.
Cloning the remote Git repository
Cloning repository https://github.com/apache/beam.git
> git init <https://ci-beam.apache.org/job/beam_PostCommit_Java_PVR_Spark2_Streaming/ws/src> # timeout=10
Fetching upstream changes from https://github.com/apache/beam.git
> git --version # timeout=10
> git --version # 'git version 2.7.4'
> git fetch --tags --progress https://github.com/apache/beam.git +refs/heads/*:refs/remotes/origin/* # timeout=10
> git config remote.origin.url https://github.com/apache/beam.git # timeout=10
> git config --add remote.origin.fetch +refs/heads/*:refs/remotes/origin/* # timeout=10
> git config remote.origin.url https://github.com/apache/beam.git # timeout=10
Fetching upstream changes from https://github.com/apache/beam.git
> git fetch --tags --progress https://github.com/apache/beam.git +refs/heads/*:refs/remotes/origin/* +refs/pull/${ghprbPullId}/*:refs/remotes/origin/pr/${ghprbPullId}/* # timeout=10
> git rev-parse origin/master^{commit} # timeout=10
Checking out Revision 2335ec61b579581b078f5b3ab61a9a47ba03545f (origin/master)
> git config core.sparsecheckout # timeout=10
> git checkout -f 2335ec61b579581b078f5b3ab61a9a47ba03545f # timeout=10
Commit message: " [BEAM-13624] Run generatePythonRequirementsAll for pyarrow 6 #16000"
> git rev-list --no-walk d3544f0318a4924f8e74557eb6a489f16b29dd38 # timeout=10
No emails were triggered.
[EnvInject] - Executing scripts and injecting environment variables after the SCM step.
[EnvInject] - Injecting as environment variables the properties content
SPARK_LOCAL_IP=127.0.0.1
SETUPTOOLS_USE_DISTUTILS=stdlib
[EnvInject] - Variables injected successfully.
[Gradle] - Launching build.
[src] $ <https://ci-beam.apache.org/job/beam_PostCommit_Java_PVR_Spark2_Streaming/ws/src/gradlew> --continue --max-workers=12 -Dorg.gradle.jvmargs=-Xms2g -Dorg.gradle.jvmargs=-Xmx4g -Dorg.gradle.vfs.watch=false -Pdocker-pull-licenses :runners:spark:2:job-server:validatesPortableRunnerStreaming
Starting a Gradle Daemon, 2 busy Daemons could not be reused, use --status for details
> Task :buildSrc:compileJava NO-SOURCE
> Task :buildSrc:compileGroovy FROM-CACHE
> Task :buildSrc:pluginDescriptors
> Task :buildSrc:processResources
> Task :buildSrc:classes
> Task :buildSrc:jar
> Task :buildSrc:assemble
> Task :buildSrc:spotlessGroovy FROM-CACHE
> Task :buildSrc:spotlessGroovyCheck UP-TO-DATE
> Task :buildSrc:spotlessGroovyGradle FROM-CACHE
> Task :buildSrc:spotlessGroovyGradleCheck UP-TO-DATE
> Task :buildSrc:spotlessCheck UP-TO-DATE
> Task :buildSrc:pluginUnderTestMetadata
> Task :buildSrc:compileTestJava NO-SOURCE
> Task :buildSrc:compileTestGroovy NO-SOURCE
> Task :buildSrc:processTestResources NO-SOURCE
> Task :buildSrc:testClasses UP-TO-DATE
> Task :buildSrc:test NO-SOURCE
> Task :buildSrc:validatePlugins FROM-CACHE
> Task :buildSrc:check UP-TO-DATE
> Task :buildSrc:build
Configuration on demand is an incubating feature.
> Task :sdks:java:extensions:google-cloud-platform-core:createCheckerFrameworkManifest
> Task :sdks:java:harness:createCheckerFrameworkManifest
> Task :sdks:java:expansion-service:createCheckerFrameworkManifest
> Task :sdks:java:core:createCheckerFrameworkManifest
> Task :model:pipeline:createCheckerFrameworkManifest
> Task :runners:java-fn-execution:createCheckerFrameworkManifest
> Task :runners:core-java:createCheckerFrameworkManifest
> Task :runners:core-construction-java:createCheckerFrameworkManifest
> Task :runners:java-job-service:createCheckerFrameworkManifest
> Task :model:fn-execution:createCheckerFrameworkManifest
> Task :model:job-management:createCheckerFrameworkManifest
> Task :sdks:java:fn-execution:createCheckerFrameworkManifest
> Task :sdks:java:extensions:google-cloud-platform-core:processResources NO-SOURCE
> Task :runners:core-construction-java:processResources NO-SOURCE
> Task :sdks:java:core:generateAvroProtocol NO-SOURCE
> Task :runners:core-java:processResources NO-SOURCE
> Task :runners:java-job-service:processResources NO-SOURCE
> Task :sdks:java:fn-execution:processResources NO-SOURCE
> Task :sdks:java:expansion-service:processResources NO-SOURCE
> Task :sdks:java:harness:processResources NO-SOURCE
> Task :model:job-management:extractProto
> Task :model:fn-execution:extractProto
> Task :runners:java-fn-execution:processResources NO-SOURCE
> Task :sdks:java:core:generateAvroJava NO-SOURCE
> Task :runners:core-construction-java:processTestResources NO-SOURCE
> Task :runners:spark:2:copyResourcesOverrides NO-SOURCE
> Task :runners:portability:java:createCheckerFrameworkManifest
> Task :runners:core-java:processTestResources NO-SOURCE
> Task :runners:portability:java:processResources NO-SOURCE
> Task :runners:portability:java:processTestResources NO-SOURCE
> Task :model:job-management:processResources
> Task :sdks:java:io:kafka:createCheckerFrameworkManifest
> Task :sdks:java:io:kafka:processResources NO-SOURCE
> Task :model:fn-execution:processResources
> Task :runners:spark:2:copySourceOverrides
> Task :runners:spark:2:copyTestResourcesOverrides NO-SOURCE
> Task :runners:spark:2:createCheckerFrameworkManifest
> Task :runners:spark:2:processResources
> Task :runners:spark:2:copyTestSourceOverrides NO-SOURCE
> Task :runners:spark:2:processTestResources
> Task :sdks:java:core:generateGrammarSource FROM-CACHE
> Task :sdks:java:core:processResources
> Task :sdks:java:core:generateTestAvroProtocol NO-SOURCE
> Task :sdks:java:core:generateTestAvroJava
> Task :sdks:java:core:generateTestGrammarSource NO-SOURCE
> Task :sdks:java:core:processTestResources
> Task :model:pipeline:extractIncludeProto
> Task :model:pipeline:extractProto
> Task :model:pipeline:generateProto FROM-CACHE
> Task :model:pipeline:compileJava FROM-CACHE
> Task :model:pipeline:processResources
> Task :model:pipeline:classes
> Task :model:pipeline:jar
> Task :model:pipeline:shadowJar FROM-CACHE
> Task :model:job-management:extractIncludeProto
> Task :model:fn-execution:extractIncludeProto
> Task :model:job-management:generateProto FROM-CACHE
> Task :model:fn-execution:generateProto FROM-CACHE
> Task :model:fn-execution:compileJava FROM-CACHE
> Task :model:fn-execution:classes
> Task :model:job-management:compileJava FROM-CACHE
> Task :model:job-management:classes
> Task :model:job-management:shadowJar FROM-CACHE
> Task :model:fn-execution:shadowJar FROM-CACHE
> Task :sdks:java:core:compileJava FROM-CACHE
> Task :sdks:java:core:classes
> Task :sdks:java:core:shadowJar FROM-CACHE
> Task :sdks:java:fn-execution:compileJava FROM-CACHE
> Task :sdks:java:fn-execution:classes UP-TO-DATE
> Task :sdks:java:core:jar
> Task :sdks:java:fn-execution:jar
> Task :runners:core-construction-java:compileJava FROM-CACHE
> Task :runners:core-construction-java:classes UP-TO-DATE
> Task :runners:core-construction-java:jar
> Task :runners:core-java:compileJava FROM-CACHE
> Task :runners:core-java:classes UP-TO-DATE
> Task :runners:core-java:jar
> Task :sdks:java:extensions:google-cloud-platform-core:compileJava FROM-CACHE
> Task :sdks:java:extensions:google-cloud-platform-core:classes UP-TO-DATE
> Task :sdks:java:extensions:google-cloud-platform-core:jar
> Task :sdks:java:core:compileTestJava FROM-CACHE
> Task :sdks:java:core:testClasses
> Task :sdks:java:harness:compileJava FROM-CACHE
> Task :sdks:java:harness:classes UP-TO-DATE
> Task :sdks:java:harness:jar
> Task :sdks:java:core:shadowTestJar FROM-CACHE
> Task :runners:core-java:compileTestJava FROM-CACHE
> Task :runners:core-java:testClasses UP-TO-DATE
> Task :runners:core-java:testJar
> Task :runners:core-construction-java:compileTestJava FROM-CACHE
> Task :runners:core-construction-java:testClasses UP-TO-DATE
> Task :runners:core-construction-java:testJar
> Task :sdks:java:harness:shadowJar FROM-CACHE
> Task :runners:java-fn-execution:compileJava FROM-CACHE
> Task :runners:java-fn-execution:classes UP-TO-DATE
> Task :runners:java-fn-execution:jar
> Task :sdks:java:expansion-service:compileJava FROM-CACHE
> Task :sdks:java:expansion-service:classes UP-TO-DATE
> Task :sdks:java:expansion-service:jar
> Task :sdks:java:io:kafka:compileJava FROM-CACHE
> Task :runners:java-job-service:compileJava FROM-CACHE
> Task :sdks:java:io:kafka:classes UP-TO-DATE
> Task :runners:java-job-service:classes UP-TO-DATE
> Task :runners:java-job-service:jar
> Task :sdks:java:io:kafka:jar
> Task :runners:portability:java:compileJava FROM-CACHE
> Task :runners:portability:java:classes UP-TO-DATE
> Task :runners:portability:java:jar
> Task :runners:portability:java:compileTestJava FROM-CACHE
> Task :runners:portability:java:testClasses UP-TO-DATE
> Task :runners:portability:java:testJar
> Task :runners:spark:2:compileJava FROM-CACHE
> Task :runners:spark:2:classes
> Task :runners:spark:2:jar
> Task :runners:spark:2:compileTestJava FROM-CACHE
> Task :runners:spark:2:testClasses
> Task :runners:spark:2:testJar
> Task :runners:spark:2:job-server:validatesPortableRunnerStreaming
org.apache.beam.sdk.schemas.AvroSchemaTest > testAvroPipelineGroupBy FAILED
java.lang.AssertionError at AvroSchemaTest.java:497
org.apache.beam.sdk.transforms.CombineFnsTest > testComposedCombineNullValues FAILED
java.lang.AssertionError at CombineFnsTest.java:251
org.apache.beam.sdk.PipelineTest > testTupleInjectionTransform FAILED
java.lang.AssertionError at PipelineTest.java:368
org.apache.beam.sdk.transforms.ReshuffleTest > testAssignShardFn FAILED
java.lang.AssertionError at ReshuffleTest.java:302
org.apache.beam.sdk.testing.PAssertTest > testPAssertThatListSatisfiesOneMatcher FAILED
java.lang.AssertionError at PAssertTest.java:665
org.apache.beam.sdk.transforms.CombineTest$BasicTests > testCombinePerKeyInstanceMethodReference FAILED
java.lang.AssertionError at CombineTest.java:934
org.apache.beam.sdk.PipelineTest > testTupleProjectionTransform FAILED
java.lang.AssertionError at PipelineTest.java:340
org.apache.beam.sdk.transforms.ParDoTest$BasicTests > testPipelineOptionsParameter FAILED
java.lang.AssertionError at ParDoTest.java:627
org.apache.beam.sdk.testing.PAssertTest > testGlobalWindowContainsInAnyOrder FAILED
java.lang.AssertionError at PAssertTest.java:425
org.apache.beam.sdk.transforms.ParDoTest$TimestampTests > testParDoOutputWithTimestamp FAILED
java.lang.AssertionError at ParDoTest.java:1814
org.apache.beam.sdk.transforms.ParDoSchemaTest > testReadAndWrite FAILED
java.lang.AssertionError at ParDoSchemaTest.java:169
org.apache.beam.sdk.transforms.ParDoTest$BasicTests > testParDoInCustomTransform FAILED
java.lang.AssertionError at ParDoTest.java:448
org.apache.beam.sdk.transforms.ImpulseTest > testImpulse FAILED
java.lang.AssertionError at ImpulseTest.java:47
org.apache.beam.sdk.transforms.ParDoSchemaTest > testSchemaFieldSelectionNested FAILED
java.lang.AssertionError at ParDoSchemaTest.java:652
org.apache.beam.sdk.transforms.FlattenTest > testFlattenIterablesEmpty FAILED
java.lang.AssertionError at FlattenTest.java:317
org.apache.beam.sdk.transforms.FlattenTest > testFlattenIterablesLists FAILED
java.lang.AssertionError at FlattenTest.java:270
112 tests completed, 16 failed, 1 skipped
> Task :runners:spark:2:job-server:validatesPortableRunnerStreaming FAILED
FAILURE: Build failed with an exception.
* What went wrong:
Execution failed for task ':runners:spark:2:job-server:validatesPortableRunnerStreaming'.
> There were failing tests. See the report at: file://<https://ci-beam.apache.org/job/beam_PostCommit_Java_PVR_Spark2_Streaming/ws/src/runners/spark/2/job-server/build/reports/tests/validatesPortableRunnerStreaming/index.html>
* Try:
Run with --stacktrace option to get the stack trace. Run with --info or --debug option to get more log output. Run with --scan to get full insights.
* Get more help at https://help.gradle.org
Deprecated Gradle features were used in this build, making it incompatible with Gradle 7.0.
Use '--warning-mode all' to show the individual deprecation warnings.
See https://docs.gradle.org/6.9.1/userguide/command_line_interface.html#sec:command_line_warnings
BUILD FAILED in 28m 12s
78 actionable tasks: 48 executed, 30 from cache
Publishing build scan...
https://gradle.com/s/x6jgpo7kdjxti
Build step 'Invoke Gradle script' changed build result to FAILURE
Build step 'Invoke Gradle script' marked build as failure
---------------------------------------------------------------------
To unsubscribe, e-mail: builds-unsubscribe@beam.apache.org
For additional commands, e-mail: builds-help@beam.apache.org
Build failed in Jenkins: beam_PostCommit_Java_PVR_Spark2_Streaming #859
Posted by Apache Jenkins Server <je...@builds.apache.org>.
See <https://ci-beam.apache.org/job/beam_PostCommit_Java_PVR_Spark2_Streaming/859/display/redirect?page=changes>
Changes:
[samuelw] [BEAM-12818] Write windowed file output to a consistent subdirectory
[samuelw] [BEAM-13268] Change autosharding big query inserts to happen in parallel
[noreply] [BEAM-3293] Add check for error on NewIterable call (#16006)
------------------------------------------
[...truncated 14.98 KB...]
> Task :sdks:java:io:kafka:createCheckerFrameworkManifest
> Task :sdks:java:io:kafka:processResources NO-SOURCE
> Task :model:job-management:processResources
> Task :runners:spark:2:copySourceOverrides
> Task :runners:spark:2:copyTestResourcesOverrides NO-SOURCE
> Task :model:fn-execution:processResources
> Task :runners:spark:2:createCheckerFrameworkManifest
> Task :runners:spark:2:processResources
> Task :runners:spark:2:copyTestSourceOverrides NO-SOURCE
> Task :runners:spark:2:processTestResources
> Task :sdks:java:core:generateGrammarSource FROM-CACHE
> Task :sdks:java:core:processResources
> Task :sdks:java:core:generateTestAvroProtocol NO-SOURCE
> Task :sdks:java:core:generateTestAvroJava
> Task :sdks:java:core:generateTestGrammarSource NO-SOURCE
> Task :sdks:java:core:processTestResources
> Task :model:pipeline:extractIncludeProto
> Task :model:pipeline:extractProto
> Task :model:pipeline:generateProto FROM-CACHE
> Task :model:pipeline:compileJava FROM-CACHE
> Task :model:pipeline:processResources
> Task :model:pipeline:classes
> Task :model:pipeline:jar
> Task :model:fn-execution:extractIncludeProto
> Task :model:job-management:extractIncludeProto
> Task :model:pipeline:shadowJar FROM-CACHE
> Task :model:job-management:generateProto FROM-CACHE
> Task :model:fn-execution:generateProto FROM-CACHE
> Task :model:job-management:compileJava FROM-CACHE
> Task :model:job-management:classes
> Task :model:fn-execution:compileJava FROM-CACHE
> Task :model:fn-execution:classes
> Task :model:fn-execution:shadowJar FROM-CACHE
> Task :model:job-management:shadowJar FROM-CACHE
> Task :sdks:java:core:compileJava
Note: Some input files use or override a deprecated API.
Note: Recompile with -Xlint:deprecation for details.
Note: Some input files use unchecked or unsafe operations.
Note: Recompile with -Xlint:unchecked for details.
> Task :sdks:java:core:classes
> Task :sdks:java:core:shadowJar
> Task :sdks:java:core:jar
> Task :sdks:java:fn-execution:compileJava
Note: Some input files use or override a deprecated API.
Note: Recompile with -Xlint:deprecation for details.
Note: Some input files use unchecked or unsafe operations.
Note: Recompile with -Xlint:unchecked for details.
> Task :sdks:java:fn-execution:classes
> Task :sdks:java:fn-execution:jar
> Task :sdks:java:core:compileTestJava
> Task :runners:core-construction-java:compileJava
> Task :sdks:java:core:compileTestJava
Note: Some input files use or override a deprecated API.
Note: Recompile with -Xlint:deprecation for details.
Note: Some input files use unchecked or unsafe operations.
Note: Recompile with -Xlint:unchecked for details.
> Task :sdks:java:core:testClasses
> Task :sdks:java:core:shadowTestJar
> Task :runners:core-construction-java:compileJava
Note: Some input files use or override a deprecated API.
Note: Recompile with -Xlint:deprecation for details.
Note: Some input files use unchecked or unsafe operations.
Note: Recompile with -Xlint:unchecked for details.
> Task :runners:core-construction-java:classes
> Task :runners:core-construction-java:jar
> Task :runners:core-construction-java:compileTestJava
Note: Some input files use or override a deprecated API.
Note: Recompile with -Xlint:deprecation for details.
Note: Some input files use unchecked or unsafe operations.
Note: Recompile with -Xlint:unchecked for details.
> Task :runners:core-construction-java:testClasses
> Task :runners:core-construction-java:testJar
> Task :runners:core-java:compileJava
Note: Some input files use or override a deprecated API.
Note: Recompile with -Xlint:deprecation for details.
Note: Some input files use unchecked or unsafe operations.
Note: Recompile with -Xlint:unchecked for details.
> Task :runners:core-java:classes
> Task :runners:core-java:jar
> Task :runners:core-java:compileTestJava
Note: Some input files use or override a deprecated API.
Note: Recompile with -Xlint:deprecation for details.
Note: Some input files use unchecked or unsafe operations.
Note: Recompile with -Xlint:unchecked for details.
> Task :runners:core-java:testClasses
> Task :runners:core-java:testJar
> Task :sdks:java:extensions:google-cloud-platform-core:compileJava
Note: Some input files use or override a deprecated API.
Note: Recompile with -Xlint:deprecation for details.
> Task :sdks:java:extensions:google-cloud-platform-core:classes
> Task :sdks:java:extensions:google-cloud-platform-core:jar
> Task :sdks:java:harness:compileJava
Note: Some input files use or override a deprecated API.
Note: Recompile with -Xlint:deprecation for details.
Note: Some input files use unchecked or unsafe operations.
Note: Recompile with -Xlint:unchecked for details.
> Task :sdks:java:harness:classes
> Task :sdks:java:harness:jar
> Task :sdks:java:harness:shadowJar
> Task :runners:java-fn-execution:compileJava
Note: Some input files use or override a deprecated API.
Note: Recompile with -Xlint:deprecation for details.
Note: Some input files use unchecked or unsafe operations.
Note: Recompile with -Xlint:unchecked for details.
> Task :runners:java-fn-execution:classes
> Task :runners:java-fn-execution:jar
> Task :sdks:java:expansion-service:compileJava
Note: Some input files use unchecked or unsafe operations.
Note: Recompile with -Xlint:unchecked for details.
> Task :sdks:java:expansion-service:classes
> Task :sdks:java:expansion-service:jar
> Task :runners:java-job-service:compileJava
Note: <https://ci-beam.apache.org/job/beam_PostCommit_Java_PVR_Spark2_Streaming/ws/src/runners/java-job-service/src/main/java/org/apache/beam/runners/jobsubmission/PortablePipelineJarCreator.java> uses unchecked or unsafe operations.
Note: Recompile with -Xlint:unchecked for details.
> Task :runners:java-job-service:classes
> Task :runners:java-job-service:jar
> Task :sdks:java:io:kafka:compileJava
> Task :runners:portability:java:compileJava
> Task :runners:spark:2:compileJava
> Task :runners:portability:java:classes
> Task :runners:portability:java:jar
> Task :runners:portability:java:compileTestJava
Note: <https://ci-beam.apache.org/job/beam_PostCommit_Java_PVR_Spark2_Streaming/ws/src/runners/portability/java/src/test/java/org/apache/beam/runners/portability/CloseableResourceTest.java> uses or overrides a deprecated API.
Note: Recompile with -Xlint:deprecation for details.
> Task :runners:portability:java:testClasses
> Task :runners:portability:java:testJar
> Task :sdks:java:io:kafka:compileJava
Note: Some input files use or override a deprecated API.
Note: Recompile with -Xlint:deprecation for details.
Note: Some input files use unchecked or unsafe operations.
Note: Recompile with -Xlint:unchecked for details.
> Task :sdks:java:io:kafka:classes
> Task :sdks:java:io:kafka:jar
> Task :runners:spark:2:compileJava
Note: Some input files use or override a deprecated API.
Note: Recompile with -Xlint:deprecation for details.
Note: Some input files use unchecked or unsafe operations.
Note: Recompile with -Xlint:unchecked for details.
> Task :runners:spark:2:classes
> Task :runners:spark:2:jar
> Task :runners:spark:2:compileTestJava
Note: Some input files use or override a deprecated API.
Note: Recompile with -Xlint:deprecation for details.
Note: Some input files use unchecked or unsafe operations.
Note: Recompile with -Xlint:unchecked for details.
> Task :runners:spark:2:testClasses
> Task :runners:spark:2:testJar
> Task :runners:spark:2:job-server:validatesPortableRunnerStreaming
org.apache.beam.sdk.transforms.CombineFnsTest > testComposedCombineNullValues FAILED
java.lang.RuntimeException at CombineFnsTest.java:251
org.apache.beam.sdk.transforms.FlattenTest > testFlattenPCollections FAILED
java.lang.AssertionError at FlattenTest.java:97
org.apache.beam.sdk.transforms.ReifyTimestampsTest > inValuesSucceeds FAILED
java.lang.AssertionError at ReifyTimestampsTest.java:60
org.apache.beam.sdk.transforms.ParDoSchemaTest > testSimpleSchemaPipeline FAILED
java.lang.AssertionError at ParDoSchemaTest.java:115
org.apache.beam.sdk.transforms.FlattenTest > testFlattenPCollectionsThenParDo FAILED
java.lang.AssertionError at FlattenTest.java:123
org.apache.beam.sdk.transforms.ParDoSchemaTest > testSchemaConversionPipeline FAILED
java.lang.AssertionError at ParDoSchemaTest.java:472
org.apache.beam.sdk.metrics.MetricsTest$AttemptedMetricTests > testAttemptedDistributionMetrics FAILED
java.lang.AssertionError at MetricsTest.java:379
org.apache.beam.sdk.transforms.FlattenTest > testFlattenMultiplePCollectionsHavingMultipleConsumers FAILED
java.lang.AssertionError at FlattenTest.java:352
org.apache.beam.sdk.transforms.FlattenTest > testFlattenIterablesSets FAILED
java.lang.AssertionError at FlattenTest.java:285
org.apache.beam.sdk.transforms.ParDoTest$MultipleInputsAndOutputTests > testParDoWithOnlyTaggedOutput FAILED
java.lang.AssertionError at ParDoTest.java:799
org.apache.beam.sdk.transforms.ParDoTest$MultipleInputsAndOutputTests > testParDoWithTaggedOutput FAILED
java.lang.AssertionError at ParDoTest.java:704
org.apache.beam.sdk.transforms.CreateTest > testCreateWithNullsAndValues FAILED
java.lang.AssertionError at CreateTest.java:165
org.apache.beam.sdk.transforms.ParDoTest$MultipleInputsAndOutputTests > testParDoWithEmptyTaggedOutput FAILED
java.lang.AssertionError at ParDoTest.java:770
org.apache.beam.sdk.transforms.CreateTest > testCreate FAILED
java.lang.AssertionError at CreateTest.java:94
org.apache.beam.sdk.transforms.GroupByKeyTest > org.apache.beam.sdk.transforms.GroupByKeyTest$BasicTests.testGroupByKeyEmpty FAILED
java.lang.AssertionError at GroupByKeyTest.java:153
112 tests completed, 15 failed, 1 skipped
> Task :runners:spark:2:job-server:validatesPortableRunnerStreaming FAILED
FAILURE: Build failed with an exception.
* What went wrong:
Execution failed for task ':runners:spark:2:job-server:validatesPortableRunnerStreaming'.
> There were failing tests. See the report at: file://<https://ci-beam.apache.org/job/beam_PostCommit_Java_PVR_Spark2_Streaming/ws/src/runners/spark/2/job-server/build/reports/tests/validatesPortableRunnerStreaming/index.html>
* Try:
Run with --stacktrace option to get the stack trace. Run with --info or --debug option to get more log output. Run with --scan to get full insights.
* Get more help at https://help.gradle.org
Deprecated Gradle features were used in this build, making it incompatible with Gradle 7.0.
Use '--warning-mode all' to show the individual deprecation warnings.
See https://docs.gradle.org/6.9.1/userguide/command_line_interface.html#sec:command_line_warnings
BUILD FAILED in 45m 57s
78 actionable tasks: 68 executed, 10 from cache
Publishing build scan...
https://gradle.com/s/sutwu55hoqiva
Build step 'Invoke Gradle script' changed build result to FAILURE
Build step 'Invoke Gradle script' marked build as failure
---------------------------------------------------------------------
To unsubscribe, e-mail: builds-unsubscribe@beam.apache.org
For additional commands, e-mail: builds-help@beam.apache.org
Build failed in Jenkins: beam_PostCommit_Java_PVR_Spark2_Streaming #858
Posted by Apache Jenkins Server <je...@builds.apache.org>.
See <https://ci-beam.apache.org/job/beam_PostCommit_Java_PVR_Spark2_Streaming/858/display/redirect>
Changes:
------------------------------------------
[...truncated 2.19 KB...]
[Gradle] - Launching build.
[src] $ <https://ci-beam.apache.org/job/beam_PostCommit_Java_PVR_Spark2_Streaming/ws/src/gradlew> --continue --max-workers=12 -Dorg.gradle.jvmargs=-Xms2g -Dorg.gradle.jvmargs=-Xmx4g -Dorg.gradle.vfs.watch=false -Pdocker-pull-licenses :runners:spark:2:job-server:validatesPortableRunnerStreaming
Starting a Gradle Daemon, 2 busy Daemons could not be reused, use --status for details
> Task :buildSrc:compileJava NO-SOURCE
> Task :buildSrc:compileGroovy FROM-CACHE
> Task :buildSrc:pluginDescriptors
> Task :buildSrc:processResources
> Task :buildSrc:classes
> Task :buildSrc:jar
> Task :buildSrc:assemble
> Task :buildSrc:spotlessGroovy FROM-CACHE
> Task :buildSrc:spotlessGroovyCheck UP-TO-DATE
> Task :buildSrc:spotlessGroovyGradle FROM-CACHE
> Task :buildSrc:spotlessGroovyGradleCheck UP-TO-DATE
> Task :buildSrc:spotlessCheck UP-TO-DATE
> Task :buildSrc:pluginUnderTestMetadata
> Task :buildSrc:compileTestJava NO-SOURCE
> Task :buildSrc:compileTestGroovy NO-SOURCE
> Task :buildSrc:processTestResources NO-SOURCE
> Task :buildSrc:testClasses UP-TO-DATE
> Task :buildSrc:test NO-SOURCE
> Task :buildSrc:validatePlugins FROM-CACHE
> Task :buildSrc:check UP-TO-DATE
> Task :buildSrc:build
Configuration on demand is an incubating feature.
> Task :runners:java-job-service:createCheckerFrameworkManifest
> Task :sdks:java:fn-execution:createCheckerFrameworkManifest
> Task :sdks:java:harness:createCheckerFrameworkManifest
> Task :runners:java-fn-execution:createCheckerFrameworkManifest
> Task :sdks:java:expansion-service:createCheckerFrameworkManifest
> Task :runners:core-construction-java:createCheckerFrameworkManifest
> Task :runners:core-java:createCheckerFrameworkManifest
> Task :model:pipeline:createCheckerFrameworkManifest
> Task :sdks:java:extensions:google-cloud-platform-core:createCheckerFrameworkManifest
> Task :model:fn-execution:createCheckerFrameworkManifest
> Task :model:job-management:createCheckerFrameworkManifest
> Task :sdks:java:core:createCheckerFrameworkManifest
> Task :runners:java-fn-execution:processResources NO-SOURCE
> Task :runners:java-job-service:processResources NO-SOURCE
> Task :sdks:java:core:generateAvroProtocol NO-SOURCE
> Task :sdks:java:expansion-service:processResources NO-SOURCE
> Task :sdks:java:fn-execution:processResources NO-SOURCE
> Task :runners:core-java:processResources NO-SOURCE
> Task :sdks:java:core:generateAvroJava NO-SOURCE
> Task :runners:core-construction-java:processResources NO-SOURCE
> Task :sdks:java:extensions:google-cloud-platform-core:processResources NO-SOURCE
> Task :sdks:java:harness:processResources NO-SOURCE
> Task :model:job-management:extractProto
> Task :model:fn-execution:extractProto
> Task :runners:core-java:processTestResources NO-SOURCE
> Task :runners:portability:java:createCheckerFrameworkManifest
> Task :sdks:java:io:kafka:createCheckerFrameworkManifest
> Task :runners:core-construction-java:processTestResources NO-SOURCE
> Task :sdks:java:io:kafka:processResources NO-SOURCE
> Task :runners:spark:2:copyResourcesOverrides NO-SOURCE
> Task :runners:portability:java:processResources NO-SOURCE
> Task :runners:portability:java:processTestResources NO-SOURCE
> Task :model:job-management:processResources
> Task :runners:spark:2:copySourceOverrides
> Task :runners:spark:2:copyTestResourcesOverrides NO-SOURCE
> Task :runners:spark:2:createCheckerFrameworkManifest
> Task :model:fn-execution:processResources
> Task :runners:spark:2:processResources
> Task :runners:spark:2:copyTestSourceOverrides NO-SOURCE
> Task :runners:spark:2:processTestResources
> Task :sdks:java:core:generateGrammarSource FROM-CACHE
> Task :sdks:java:core:processResources
> Task :sdks:java:core:generateTestAvroProtocol NO-SOURCE
> Task :sdks:java:core:generateTestAvroJava
> Task :sdks:java:core:generateTestGrammarSource NO-SOURCE
> Task :sdks:java:core:processTestResources
> Task :model:pipeline:extractIncludeProto
> Task :model:pipeline:extractProto
> Task :model:pipeline:generateProto FROM-CACHE
> Task :model:pipeline:compileJava FROM-CACHE
> Task :model:pipeline:processResources
> Task :model:pipeline:classes
> Task :model:pipeline:jar
> Task :model:pipeline:shadowJar FROM-CACHE
> Task :model:fn-execution:extractIncludeProto
> Task :model:job-management:extractIncludeProto
> Task :model:fn-execution:generateProto FROM-CACHE
> Task :model:job-management:generateProto FROM-CACHE
> Task :model:job-management:compileJava FROM-CACHE
> Task :model:job-management:classes
> Task :model:fn-execution:compileJava FROM-CACHE
> Task :model:fn-execution:classes
> Task :model:job-management:shadowJar FROM-CACHE
> Task :model:fn-execution:shadowJar FROM-CACHE
> Task :sdks:java:core:compileJava FROM-CACHE
> Task :sdks:java:core:classes
> Task :sdks:java:core:shadowJar FROM-CACHE
> Task :sdks:java:core:jar
> Task :sdks:java:fn-execution:compileJava FROM-CACHE
> Task :sdks:java:fn-execution:classes UP-TO-DATE
> Task :sdks:java:fn-execution:jar
> Task :runners:core-construction-java:compileJava FROM-CACHE
> Task :runners:core-construction-java:classes UP-TO-DATE
> Task :runners:core-construction-java:jar
> Task :sdks:java:core:compileTestJava FROM-CACHE
> Task :sdks:java:core:testClasses
> Task :runners:core-java:compileJava FROM-CACHE
> Task :runners:core-java:classes UP-TO-DATE
> Task :sdks:java:core:shadowTestJar FROM-CACHE
> Task :runners:core-java:jar
> Task :sdks:java:extensions:google-cloud-platform-core:compileJava FROM-CACHE
> Task :sdks:java:extensions:google-cloud-platform-core:classes UP-TO-DATE
> Task :sdks:java:extensions:google-cloud-platform-core:jar
> Task :runners:core-construction-java:compileTestJava FROM-CACHE
> Task :runners:core-java:compileTestJava FROM-CACHE
> Task :runners:core-construction-java:testClasses UP-TO-DATE
> Task :runners:core-java:testClasses UP-TO-DATE
> Task :sdks:java:harness:compileJava FROM-CACHE
> Task :sdks:java:harness:classes UP-TO-DATE
> Task :runners:core-java:testJar
> Task :sdks:java:harness:jar
> Task :runners:core-construction-java:testJar
> Task :sdks:java:harness:shadowJar FROM-CACHE
> Task :runners:java-fn-execution:compileJava FROM-CACHE
> Task :runners:java-fn-execution:classes UP-TO-DATE
> Task :runners:java-fn-execution:jar
> Task :sdks:java:expansion-service:compileJava FROM-CACHE
> Task :sdks:java:expansion-service:classes UP-TO-DATE
> Task :sdks:java:expansion-service:jar
> Task :runners:java-job-service:compileJava FROM-CACHE
> Task :runners:java-job-service:classes UP-TO-DATE
> Task :runners:java-job-service:jar
> Task :sdks:java:io:kafka:compileJava FROM-CACHE
> Task :sdks:java:io:kafka:classes UP-TO-DATE
> Task :runners:portability:java:compileJava FROM-CACHE
> Task :runners:portability:java:classes UP-TO-DATE
> Task :sdks:java:io:kafka:jar
> Task :runners:portability:java:jar
> Task :runners:portability:java:compileTestJava FROM-CACHE
> Task :runners:portability:java:testClasses UP-TO-DATE
> Task :runners:portability:java:testJar
> Task :runners:spark:2:compileJava FROM-CACHE
> Task :runners:spark:2:classes
> Task :runners:spark:2:jar
> Task :runners:spark:2:compileTestJava FROM-CACHE
> Task :runners:spark:2:testClasses
> Task :runners:spark:2:testJar
> Task :runners:spark:2:job-server:validatesPortableRunnerStreaming
org.apache.beam.sdk.transforms.CombineFnsTest > testComposedCombineNullValues FAILED
java.lang.RuntimeException at CombineFnsTest.java:251
org.apache.beam.sdk.PipelineTest > testIdentityTransform FAILED
java.lang.AssertionError at PipelineTest.java:318
org.apache.beam.sdk.testing.PAssertTest > testEmpty FAILED
java.lang.AssertionError at PAssertTest.java:471
org.apache.beam.sdk.transforms.KvSwapTest > testKvSwap FAILED
java.lang.AssertionError at KvSwapTest.java:80
org.apache.beam.sdk.transforms.CombineTest$BasicTests > testBinaryCombinePerKeyInstanceMethodReference FAILED
java.lang.AssertionError at CombineTest.java:948
org.apache.beam.sdk.PipelineTest > testTupleProjectionTransform FAILED
java.lang.AssertionError at PipelineTest.java:340
org.apache.beam.sdk.transforms.ReshuffleTest > testAssignShardFn FAILED
java.lang.AssertionError at ReshuffleTest.java:302
org.apache.beam.sdk.testing.PAssertTest > testPAssertThatListSatisfiesOneMatcher FAILED
java.lang.AssertionError at PAssertTest.java:665
org.apache.beam.sdk.transforms.CombineTest$BasicTests > testCombinePerKeyInstanceMethodReference FAILED
java.lang.AssertionError at CombineTest.java:934
org.apache.beam.sdk.PipelineTest > testMultipleApply FAILED
java.lang.AssertionError at PipelineTest.java:252
org.apache.beam.sdk.testing.PAssertTest > testPAssertThatFlattened FAILED
java.lang.AssertionError at PAssertTest.java:626
org.apache.beam.sdk.transforms.ReshuffleTest > testReshuffleAfterFixedWindows FAILED
java.lang.AssertionError at ReshuffleTest.java:235
org.apache.beam.sdk.transforms.CombineTest$BasicTests > testCombinePerKeyLambda FAILED
java.lang.AssertionError at CombineTest.java:906
org.apache.beam.sdk.testing.PAssertTest > testPAssertThatListSatisfiesMultipleMatchers FAILED
java.lang.RuntimeException at PAssertTest.java:720
org.apache.beam.sdk.values.PCollectionTupleTest > testComposePCollectionTuple FAILED
java.lang.RuntimeException at PCollectionTupleTest.java:106
org.apache.beam.sdk.transforms.ReshuffleTest > testReshufflePreservesTimestamps FAILED
java.lang.AssertionError at ReshuffleTest.java:152
org.apache.beam.sdk.transforms.CombineTest$BasicTests > testHotKeyCombiningWithAccumulationMode FAILED
java.lang.AssertionError at CombineTest.java:760
org.apache.beam.sdk.testing.PAssertTest > testContainsInAnyOrder FAILED
java.lang.AssertionError at PAssertTest.java:403
org.apache.beam.sdk.transforms.join.CoGroupByKeyTest > testCoGroupByKeyHandleResults FAILED
java.lang.AssertionError at CoGroupByKeyTest.java:466
org.apache.beam.sdk.transforms.ReshuffleTest > testJustReshuffle FAILED
java.lang.AssertionError at ReshuffleTest.java:106
org.apache.beam.sdk.transforms.ParDoTest$TimestampTests > testParDoShiftTimestamp FAILED
java.lang.AssertionError at ParDoTest.java:1872
org.apache.beam.sdk.testing.PAssertTest > testContainsInAnyOrderNotSerializable FAILED
java.lang.AssertionError at PAssertTest.java:189
org.apache.beam.sdk.transforms.KeysTest > testKeys FAILED
java.lang.AssertionError at KeysTest.java:66
org.apache.beam.sdk.transforms.FlattenTest > testFlattenPCollectionsEmpty FAILED
java.lang.AssertionError at FlattenTest.java:135
org.apache.beam.sdk.transforms.ReifyTimestampsTest > extractFromValuesWhenValueTimestampedLaterSucceeds FAILED
java.lang.AssertionError at ReifyTimestampsTest.java:128
org.apache.beam.sdk.transforms.ParDoSchemaTest > testInferredSchemaPipeline FAILED
java.lang.AssertionError at ParDoSchemaTest.java:424
112 tests completed, 26 failed, 1 skipped
> Task :runners:spark:2:job-server:validatesPortableRunnerStreaming FAILED
FAILURE: Build failed with an exception.
* What went wrong:
Execution failed for task ':runners:spark:2:job-server:validatesPortableRunnerStreaming'.
> There were failing tests. See the report at: file://<https://ci-beam.apache.org/job/beam_PostCommit_Java_PVR_Spark2_Streaming/ws/src/runners/spark/2/job-server/build/reports/tests/validatesPortableRunnerStreaming/index.html>
* Try:
Run with --stacktrace option to get the stack trace. Run with --info or --debug option to get more log output. Run with --scan to get full insights.
* Get more help at https://help.gradle.org
Deprecated Gradle features were used in this build, making it incompatible with Gradle 7.0.
Use '--warning-mode all' to show the individual deprecation warnings.
See https://docs.gradle.org/6.9.1/userguide/command_line_interface.html#sec:command_line_warnings
BUILD FAILED in 28m 53s
78 actionable tasks: 48 executed, 30 from cache
Publishing build scan...
https://gradle.com/s/plxpobnhu7x6w
Build step 'Invoke Gradle script' changed build result to FAILURE
Build step 'Invoke Gradle script' marked build as failure
---------------------------------------------------------------------
To unsubscribe, e-mail: builds-unsubscribe@beam.apache.org
For additional commands, e-mail: builds-help@beam.apache.org