You are viewing a plain text version of this content. The canonical link for it is here.
Posted to builds@solr.apache.org by Apache Jenkins Server <je...@builds.apache.org> on 2025/04/06 12:40:32 UTC
[JENKINS] Solr » Solr-Artifacts-main - Build # 1591 - Failure!
Build: https://ci-builds.apache.org/job/Solr/job/Solr-Artifacts-main/1591/
No tests ran.
Build Log:
[...truncated 289 lines...]
BUILD FAILED in 4m 7s
90 actionable tasks: 90 executed
Publishing build scan...
https://develocity.apache.org/s/7h6225qhrfpv4
Build step 'Invoke Gradle script' changed build result to FAILURE
Build step 'Invoke Gradle script' marked build as failure
Archiving artifacts
Publishing Javadoc
Email was triggered for: Failure - Any
Sending email for trigger: Failure - Any
[JENKINS] Solr » Solr-Artifacts-main - Build # 1592 - Still Failing!
Posted by Apache Jenkins Server <je...@builds.apache.org>.
Build: https://ci-builds.apache.org/job/Solr/job/Solr-Artifacts-main/1592/
No tests ran.
Build Log:
[...truncated 289 lines...]
BUILD FAILED in 4m 27s
90 actionable tasks: 90 executed
Publishing build scan...
https://develocity.apache.org/s/dxnf33gvgowum
Build step 'Invoke Gradle script' changed build result to FAILURE
Build step 'Invoke Gradle script' marked build as failure
Archiving artifacts
Publishing Javadoc
Email was triggered for: Failure - Any
Sending email for trigger: Failure - Any