You are viewing a plain text version of this content. The canonical link for it is here.
Posted to yarn-dev@hadoop.apache.org by Apache Jenkins Server <je...@builds.apache.org> on 2014/03/14 19:55:46 UTC
Failed: YARN-1833 PreCommit Build #3368
Jira: https://issues.apache.org/jira/browse/YARN-1833
Build: https://builds.apache.org/job/PreCommit-YARN-Build/3368/
###################################################################################
########################## LAST 60 LINES OF THE CONSOLE ###########################
[...truncated 3058 lines...]
NOP
{color:red}-1 overall{color}. Here are the results of testing the latest attachment
http://issues.apache.org/jira/secure/attachment/12634771/YARN-1833.patch
against trunk revision .
{color:green}+1 @author{color}. The patch does not contain any @author tags.
{color:green}+1 tests included{color}. The patch appears to include 1 new or modified test files.
{color:green}+1 javac{color}. The applied patch does not increase the total number of javac compiler warnings.
{color:green}+1 javadoc{color}. There were no new javadoc warning messages.
{color:green}+1 eclipse:eclipse{color}. The patch built with eclipse:eclipse.
{color:green}+1 findbugs{color}. The patch does not introduce any new Findbugs (version 1.3.9) warnings.
{color:green}+1 release audit{color}. The applied patch does not increase the total number of release audit warnings.
{color:red}-1 core tests{color}. The patch failed these unit tests in hadoop-yarn-project/hadoop-yarn/hadoop-yarn-server/hadoop-yarn-server-resourcemanager:
org.apache.hadoop.yarn.server.resourcemanager.TestResourceTrackerService
{color:green}+1 contrib tests{color}. The patch passed contrib unit tests.
Test results: https://builds.apache.org/job/PreCommit-YARN-Build/3368//testReport/
Console output: https://builds.apache.org/job/PreCommit-YARN-Build/3368//console
This message is automatically generated.
======================================================================
======================================================================
Adding comment to Jira.
======================================================================
======================================================================
Comment added.
6c2591c55b0f044f97b2e704ca8c054a4f8c0391 logged out
======================================================================
======================================================================
Finished build.
======================================================================
======================================================================
Build step 'Execute shell' marked build as failure
Archiving artifacts
[description-setter] Could not determine description.
Recording test results
Email was triggered for: Failure
Sending email for trigger: Failure
###################################################################################
############################## FAILED TESTS (if any) ##############################
1 tests failed.
FAILED: org.apache.hadoop.yarn.server.resourcemanager.TestResourceTrackerService.testReconnectNode
Error Message:
Metrics source ClusterMetrics already exists!
Stack Trace:
org.apache.hadoop.metrics2.MetricsException: Metrics source ClusterMetrics already exists!
at org.apache.hadoop.metrics2.lib.DefaultMetricsSystem.newSourceName(DefaultMetricsSystem.java:134)
at org.apache.hadoop.metrics2.lib.DefaultMetricsSystem.sourceName(DefaultMetricsSystem.java:115)
at org.apache.hadoop.metrics2.impl.MetricsSystemImpl.register(MetricsSystemImpl.java:217)
at org.apache.hadoop.yarn.server.resourcemanager.ClusterMetrics.registerMetrics(ClusterMetrics.java:71)
at org.apache.hadoop.yarn.server.resourcemanager.ClusterMetrics.getMetrics(ClusterMetrics.java:58)
at org.apache.hadoop.yarn.server.resourcemanager.NodesListManager.setDecomissionedNMsMetrics(NodesListManager.java:131)
at org.apache.hadoop.yarn.server.resourcemanager.NodesListManager.serviceInit(NodesListManager.java:78)
at org.apache.hadoop.service.AbstractService.init(AbstractService.java:163)
at org.apache.hadoop.service.CompositeService.serviceInit(CompositeService.java:107)
at org.apache.hadoop.yarn.server.resourcemanager.ResourceManager$RMActiveServices.serviceInit(ResourceManager.java:465)
at org.apache.hadoop.service.AbstractService.init(AbstractService.java:163)
at org.apache.hadoop.yarn.server.resourcemanager.ResourceManager.createAndInitActiveServices(ResourceManager.java:818)
at org.apache.hadoop.yarn.server.resourcemanager.ResourceManager.serviceInit(ResourceManager.java:231)
at org.apache.hadoop.service.AbstractService.init(AbstractService.java:163)
at org.apache.hadoop.yarn.server.resourcemanager.MockRM.<init>(MockRM.java:93)
at org.apache.hadoop.yarn.server.resourcemanager.MockRM.<init>(MockRM.java:88)
at org.apache.hadoop.yarn.server.resourcemanager.MockRM.<init>(MockRM.java:84)
at org.apache.hadoop.yarn.server.resourcemanager.TestResourceTrackerService$1.<init>(TestResourceTrackerService.java:494)
at org.apache.hadoop.yarn.server.resourcemanager.TestResourceTrackerService.testReconnectNode(TestResourceTrackerService.java:494)
Success: YARN-1690 PreCommit Build #3371
Posted by Apache Jenkins Server <je...@builds.apache.org>.
Jira: https://issues.apache.org/jira/browse/YARN-1690
Build: https://builds.apache.org/job/PreCommit-YARN-Build/3371/
###################################################################################
########################## LAST 60 LINES OF THE CONSOLE ###########################
[...truncated 3063 lines...]
/bin/kill -9 28995
kill: No such process
NOP
{color:green}+1 overall{color}. Here are the results of testing the latest attachment
http://issues.apache.org/jira/secure/attachment/12634854/YARN-1690-5.patch
against trunk revision .
{color:green}+1 @author{color}. The patch does not contain any @author tags.
{color:green}+1 tests included{color}. The patch appears to include 2 new or modified test files.
{color:green}+1 javac{color}. The applied patch does not increase the total number of javac compiler warnings.
{color:green}+1 javadoc{color}. There were no new javadoc warning messages.
{color:green}+1 eclipse:eclipse{color}. The patch built with eclipse:eclipse.
{color:green}+1 findbugs{color}. The patch does not introduce any new Findbugs (version 1.3.9) warnings.
{color:green}+1 release audit{color}. The applied patch does not increase the total number of release audit warnings.
{color:green}+1 core tests{color}. The patch passed unit tests in hadoop-yarn-project/hadoop-yarn/hadoop-yarn-applications/hadoop-yarn-applications-distributedshell hadoop-yarn-project/hadoop-yarn/hadoop-yarn-server/hadoop-yarn-server-applicationhistoryservice hadoop-yarn-project/hadoop-yarn/hadoop-yarn-server/hadoop-yarn-server-tests.
{color:green}+1 contrib tests{color}. The patch passed contrib unit tests.
Test results: https://builds.apache.org/job/PreCommit-YARN-Build/3371//testReport/
Console output: https://builds.apache.org/job/PreCommit-YARN-Build/3371//console
This message is automatically generated.
======================================================================
======================================================================
Adding comment to Jira.
======================================================================
======================================================================
Comment added.
4d0d1f4cb3dc2f61866eb541c28e4f5083841490 logged out
======================================================================
======================================================================
Finished build.
======================================================================
======================================================================
Archiving artifacts
Description set: YARN-1690
Recording test results
Email was triggered for: Success
Sending email for trigger: Success
###################################################################################
############################## FAILED TESTS (if any) ##############################
All tests passed
Failed: YARN-1833 PreCommit Build #3370
Posted by Apache Jenkins Server <je...@builds.apache.org>.
Jira: https://issues.apache.org/jira/browse/YARN-1833
Build: https://builds.apache.org/job/PreCommit-YARN-Build/3370/
###################################################################################
########################## LAST 60 LINES OF THE CONSOLE ###########################
[...truncated 3057 lines...]
{color:red}-1 overall{color}. Here are the results of testing the latest attachment
http://issues.apache.org/jira/secure/attachment/12634829/YARN-1833-v2.patch
against trunk revision .
{color:green}+1 @author{color}. The patch does not contain any @author tags.
{color:green}+1 tests included{color}. The patch appears to include 1 new or modified test files.
{color:green}+1 javac{color}. The applied patch does not increase the total number of javac compiler warnings.
{color:green}+1 javadoc{color}. There were no new javadoc warning messages.
{color:green}+1 eclipse:eclipse{color}. The patch built with eclipse:eclipse.
{color:green}+1 findbugs{color}. The patch does not introduce any new Findbugs (version 1.3.9) warnings.
{color:green}+1 release audit{color}. The applied patch does not increase the total number of release audit warnings.
{color:red}-1 core tests{color}. The patch failed these unit tests in hadoop-yarn-project/hadoop-yarn/hadoop-yarn-server/hadoop-yarn-server-resourcemanager:
org.apache.hadoop.yarn.server.resourcemanager.TestRMRestart
The following test timeouts occurred in hadoop-yarn-project/hadoop-yarn/hadoop-yarn-server/hadoop-yarn-server-resourcemanager:
org.apache.hadoop.yarn.server.resourcemanager.TestResourceTrackerService
{color:green}+1 contrib tests{color}. The patch passed contrib unit tests.
Test results: https://builds.apache.org/job/PreCommit-YARN-Build/3370//testReport/
Console output: https://builds.apache.org/job/PreCommit-YARN-Build/3370//console
This message is automatically generated.
======================================================================
======================================================================
Adding comment to Jira.
======================================================================
======================================================================
Comment added.
8b07123a33f0e329bfb916577af77408536034d8 logged out
======================================================================
======================================================================
Finished build.
======================================================================
======================================================================
Build step 'Execute shell' marked build as failure
Archiving artifacts
[description-setter] Could not determine description.
Recording test results
Email was triggered for: Failure
Sending email for trigger: Failure
###################################################################################
############################## FAILED TESTS (if any) ##############################
1 tests failed.
REGRESSION: org.apache.hadoop.yarn.server.resourcemanager.TestRMRestart.testQueueMetricsOnRMRestart
Error Message:
expected:<38> but was:<39>
Stack Trace:
java.lang.AssertionError: expected:<38> but was:<39>
at org.junit.Assert.fail(Assert.java:93)
at org.junit.Assert.failNotEquals(Assert.java:647)
at org.junit.Assert.assertEquals(Assert.java:128)
at org.junit.Assert.assertEquals(Assert.java:472)
at org.junit.Assert.assertEquals(Assert.java:456)
at org.apache.hadoop.yarn.server.resourcemanager.TestRMRestart.assertQueueMetrics(TestRMRestart.java:1728)
at org.apache.hadoop.yarn.server.resourcemanager.TestRMRestart.testQueueMetricsOnRMRestart(TestRMRestart.java:1682)
Failed: YARN-1474 PreCommit Build #3369
Posted by Apache Jenkins Server <je...@builds.apache.org>.
Jira: https://issues.apache.org/jira/browse/YARN-1474
Build: https://builds.apache.org/job/PreCommit-YARN-Build/3369/
###################################################################################
########################## LAST 60 LINES OF THE CONSOLE ###########################
[...truncated 3321 lines...]
{color:red}-1 overall{color}. Here are the results of testing the latest attachment
http://issues.apache.org/jira/secure/attachment/12634796/YARN-1474.7.patch
against trunk revision .
{color:green}+1 @author{color}. The patch does not contain any @author tags.
{color:green}+1 tests included{color}. The patch appears to include 10 new or modified test files.
{color:green}+1 javac{color}. The applied patch does not increase the total number of javac compiler warnings.
{color:green}+1 javadoc{color}. There were no new javadoc warning messages.
{color:green}+1 eclipse:eclipse{color}. The patch built with eclipse:eclipse.
{color:red}-1 findbugs{color}. The patch appears to introduce 10 new Findbugs (version 1.3.9) warnings.
{color:green}+1 release audit{color}. The applied patch does not increase the total number of release audit warnings.
{color:red}-1 core tests{color}. The patch failed these unit tests in hadoop-mapreduce-project/hadoop-mapreduce-client/hadoop-mapreduce-client-app hadoop-tools/hadoop-sls hadoop-yarn-project/hadoop-yarn/hadoop-yarn-server/hadoop-yarn-server-resourcemanager:
org.apache.hadoop.yarn.server.resourcemanager.TestResourceTrackerService
{color:green}+1 contrib tests{color}. The patch passed contrib unit tests.
Test results: https://builds.apache.org/job/PreCommit-YARN-Build/3369//testReport/
Findbugs warnings: https://builds.apache.org/job/PreCommit-YARN-Build/3369//artifact/trunk/patchprocess/newPatchFindbugsWarningshadoop-yarn-server-resourcemanager.html
Console output: https://builds.apache.org/job/PreCommit-YARN-Build/3369//console
This message is automatically generated.
======================================================================
======================================================================
Adding comment to Jira.
======================================================================
======================================================================
Comment added.
0fdd99c9694a0b9debe1c23edfb26ce3a73b3b9b logged out
======================================================================
======================================================================
Finished build.
======================================================================
======================================================================
Build step 'Execute shell' marked build as failure
Archiving artifacts
[description-setter] Could not determine description.
Recording test results
Email was triggered for: Failure
Sending email for trigger: Failure
###################################################################################
############################## FAILED TESTS (if any) ##############################
1 tests failed.
FAILED: org.apache.hadoop.yarn.server.resourcemanager.TestResourceTrackerService.testReconnectNode
Error Message:
Metrics source ClusterMetrics already exists!
Stack Trace:
org.apache.hadoop.metrics2.MetricsException: Metrics source ClusterMetrics already exists!
at org.apache.hadoop.metrics2.lib.DefaultMetricsSystem.newSourceName(DefaultMetricsSystem.java:134)
at org.apache.hadoop.metrics2.lib.DefaultMetricsSystem.sourceName(DefaultMetricsSystem.java:115)
at org.apache.hadoop.metrics2.impl.MetricsSystemImpl.register(MetricsSystemImpl.java:217)
at org.apache.hadoop.yarn.server.resourcemanager.ClusterMetrics.registerMetrics(ClusterMetrics.java:71)
at org.apache.hadoop.yarn.server.resourcemanager.ClusterMetrics.getMetrics(ClusterMetrics.java:58)
at org.apache.hadoop.yarn.server.resourcemanager.NodesListManager.setDecomissionedNMsMetrics(NodesListManager.java:131)
at org.apache.hadoop.yarn.server.resourcemanager.NodesListManager.serviceInit(NodesListManager.java:78)
at org.apache.hadoop.service.AbstractService.init(AbstractService.java:163)
at org.apache.hadoop.service.CompositeService.serviceInit(CompositeService.java:107)
at org.apache.hadoop.yarn.server.resourcemanager.ResourceManager$RMActiveServices.serviceInit(ResourceManager.java:461)
at org.apache.hadoop.service.AbstractService.init(AbstractService.java:163)
at org.apache.hadoop.yarn.server.resourcemanager.ResourceManager.createAndInitActiveServices(ResourceManager.java:814)
at org.apache.hadoop.yarn.server.resourcemanager.ResourceManager.serviceInit(ResourceManager.java:231)
at org.apache.hadoop.service.AbstractService.init(AbstractService.java:163)
at org.apache.hadoop.yarn.server.resourcemanager.MockRM.<init>(MockRM.java:93)
at org.apache.hadoop.yarn.server.resourcemanager.MockRM.<init>(MockRM.java:88)
at org.apache.hadoop.yarn.server.resourcemanager.MockRM.<init>(MockRM.java:84)
at org.apache.hadoop.yarn.server.resourcemanager.TestResourceTrackerService$1.<init>(TestResourceTrackerService.java:494)
at org.apache.hadoop.yarn.server.resourcemanager.TestResourceTrackerService.testReconnectNode(TestResourceTrackerService.java:494)