You are viewing a plain text version of this content. The canonical link for it is here.
Posted to notifications@zookeeper.apache.org by Apache Jenkins Server <je...@builds.apache.org> on 2020/06/03 11:52:02 UTC

ZooKeeper_branch35_jdk8 - Build # 1853 - Failure

See https://builds.apache.org/job/ZooKeeper_branch35_jdk8/1853/

###################################################################################
########################## LAST 60 LINES OF THE CONSOLE ###########################
[...truncated 21.79 KB...]
[ivy:retrieve] :: retrieving :: org.apache.zookeeper#zookeeper
[ivy:retrieve] 	confs: [test]
[ivy:retrieve] 	63 artifacts copied, 0 already retrieved (22992kB/107ms)

compile-test:
    [mkdir] Created dir: /home/jenkins/jenkins-slave/workspace/ZooKeeper_branch35_jdk8/build/test/classes
    [javac] Compiling 264 source files to /home/jenkins/jenkins-slave/workspace/ZooKeeper_branch35_jdk8/build/test/classes
    [javac] Compiling 11 source files to /home/jenkins/jenkins-slave/workspace/ZooKeeper_branch35_jdk8/build/test/classes

test-init:
    [mkdir] Created dir: /home/jenkins/jenkins-slave/workspace/ZooKeeper_branch35_jdk8/build/test/logs
    [mkdir] Created dir: /home/jenkins/jenkins-slave/workspace/ZooKeeper_branch35_jdk8/build/test/tmp
    [mkdir] Created dir: /home/jenkins/jenkins-slave/workspace/ZooKeeper_branch35_jdk8/build/test/data
    [mkdir] Created dir: /home/jenkins/jenkins-slave/workspace/ZooKeeper_branch35_jdk8/build/test/data/invalidsnap
     [copy] Copying 9 files to /home/jenkins/jenkins-slave/workspace/ZooKeeper_branch35_jdk8/build/test/data/invalidsnap
    [mkdir] Created dir: /home/jenkins/jenkins-slave/workspace/ZooKeeper_branch35_jdk8/build/test/data/buffersize
     [copy] Copying 7 files to /home/jenkins/jenkins-slave/workspace/ZooKeeper_branch35_jdk8/build/test/data/buffersize
    [mkdir] Created dir: /home/jenkins/jenkins-slave/workspace/ZooKeeper_branch35_jdk8/build/test/data/ssl
     [copy] Copying 3 files to /home/jenkins/jenkins-slave/workspace/ZooKeeper_branch35_jdk8/build/test/data/ssl
    [mkdir] Created dir: /home/jenkins/jenkins-slave/workspace/ZooKeeper_branch35_jdk8/build/test/data/kerberos
     [copy] Copying 2 files to /home/jenkins/jenkins-slave/workspace/ZooKeeper_branch35_jdk8/build/test/data/kerberos

test-category:

junit-init:

junit.run-single:

junit.run-concurrent:
     [echo] Running 4 concurrent JUnit processes.
    [junit] Error occurred during initialization of VM
    [junit] java.lang.OutOfMemoryError: unable to create new native thread
    [junit] 	at java.lang.Thread.start0(Native Method)
    [junit] 	at java.lang.Thread.start(Thread.java:717)
    [junit] 	at java.lang.ref.Reference.<clinit>(Reference.java:232)
    [junit] 
    [junit] Error occurred during initialization of VM
    [junit] Error occurred during initialization of VM
    [junit] java.lang.OutOfMemoryError: unable to create new native thread
    [junit] java.lang.OutOfMemoryError: unable to create new native thread
    [junit] Running org.apache.zookeeper.ClientRequestTimeoutTest in thread 4
    [junit] Running org.apache.zookeeper.ClientCnxnSocketTest in thread 2
    [junit] Tests run: 1, Failures: 0, Errors: 1, Skipped: 0, Time elapsed: 0 sec, Thread: 2, Class: org.apache.zookeeper.ClientCnxnSocketTest
    [junit] Tests run: 1, Failures: 0, Errors: 1, Skipped: 0, Time elapsed: 0 sec, Thread: 4, Class: org.apache.zookeeper.ClientRequestTimeoutTest
    [junit] Test org.apache.zookeeper.ClientCnxnSocketTest FAILED (crashed)
    [junit] Test org.apache.zookeeper.ClientRequestTimeoutTest FAILED (crashed)
    [junit] Running org.apache.zookeeper.ClientCanonicalizeTest in thread 1
    [junit] Tests run: 4, Failures: 0, Errors: 0, Skipped: 0, Time elapsed: 0.998 sec, Thread: 1, Class: org.apache.zookeeper.ClientCanonicalizeTest

BUILD FAILED
/home/jenkins/jenkins-slave/workspace/ZooKeeper_branch35_jdk8/build.xml:1480: The following error occurred while executing this line:
/home/jenkins/jenkins-slave/workspace/ZooKeeper_branch35_jdk8/build.xml:1316: Context loader has not been reset

Total time: 25 seconds
Build step 'Invoke Ant' marked build as failure
Archiving artifacts
Recording test results
Email was triggered for: Failure - Any
Sending email for trigger: Failure - Any



###################################################################################
############################## FAILED TESTS (if any) ##############################
2 tests failed.
FAILED:  org.apache.zookeeper.ClientCnxnSocketTest.unknown

Error Message:
Forked Java VM exited abnormally. Please note the time in the report does not reflect the time until the VM exit.

Stack Trace:
junit.framework.AssertionFailedError: Forked Java VM exited abnormally. Please note the time in the report does not reflect the time until the VM exit.
	at java.lang.Thread.run(Thread.java:748)


FAILED:  org.apache.zookeeper.ClientRequestTimeoutTest.unknown

Error Message:
Forked Java VM exited abnormally. Please note the time in the report does not reflect the time until the VM exit.

Stack Trace:
junit.framework.AssertionFailedError: Forked Java VM exited abnormally. Please note the time in the report does not reflect the time until the VM exit.
	at java.lang.Thread.run(Thread.java:748)

ZooKeeper_branch35_jdk8 - Build # 1855 - Still Failing

Posted by Apache Jenkins Server <je...@builds.apache.org>.
See https://builds.apache.org/job/ZooKeeper_branch35_jdk8/1855/

###################################################################################
########################## LAST 60 LINES OF THE CONSOLE ###########################
[...truncated 12.54 KB...]
Cloning repository https://gitbox.apache.org/repos/asf/zookeeper.git
 > git init /home/jenkins/jenkins-slave/workspace/ZooKeeper_branch35_jdk8 # timeout=10
ERROR: Error cloning remote repo 'origin'
hudson.plugins.git.GitException: Could not init /home/jenkins/jenkins-slave/workspace/ZooKeeper_branch35_jdk8
	at org.jenkinsci.plugins.gitclient.CliGitAPIImpl$5.execute(CliGitAPIImpl.java:916)
	at org.jenkinsci.plugins.gitclient.CliGitAPIImpl$2.execute(CliGitAPIImpl.java:708)
	at org.jenkinsci.plugins.gitclient.RemoteGitImpl$CommandInvocationHandler$1.call(RemoteGitImpl.java:153)
	at org.jenkinsci.plugins.gitclient.RemoteGitImpl$CommandInvocationHandler$1.call(RemoteGitImpl.java:146)
	at hudson.remoting.UserRequest.perform(UserRequest.java:212)
	at hudson.remoting.UserRequest.perform(UserRequest.java:54)
	at hudson.remoting.Request$2.run(Request.java:369)
	at hudson.remoting.InterceptingExecutorService$1.call(InterceptingExecutorService.java:72)
	at java.util.concurrent.FutureTask.run(FutureTask.java:266)
	at java.util.concurrent.ThreadPoolExecutor.runWorker(ThreadPoolExecutor.java:1149)
	at java.util.concurrent.ThreadPoolExecutor$Worker.run(ThreadPoolExecutor.java:624)
	at java.lang.Thread.run(Thread.java:748)
	Suppressed: hudson.remoting.Channel$CallSiteStackTrace: Remote call to H23
		at hudson.remoting.Channel.attachCallSiteStackTrace(Channel.java:1743)
		at hudson.remoting.UserRequest$ExceptionResponse.retrieve(UserRequest.java:357)
		at hudson.remoting.Channel.call(Channel.java:957)
		at org.jenkinsci.plugins.gitclient.RemoteGitImpl$CommandInvocationHandler.execute(RemoteGitImpl.java:146)
		at sun.reflect.GeneratedMethodAccessor1196.invoke(Unknown Source)
		at sun.reflect.DelegatingMethodAccessorImpl.invoke(DelegatingMethodAccessorImpl.java:43)
		at java.lang.reflect.Method.invoke(Method.java:498)
		at org.jenkinsci.plugins.gitclient.RemoteGitImpl$CommandInvocationHandler.invoke(RemoteGitImpl.java:132)
		at com.sun.proxy.$Proxy137.execute(Unknown Source)
		at hudson.plugins.git.GitSCM.retrieveChanges(GitSCM.java:1152)
		at hudson.plugins.git.GitSCM.checkout(GitSCM.java:1192)
		at hudson.scm.SCM.checkout(SCM.java:504)
		at hudson.model.AbstractProject.checkout(AbstractProject.java:1208)
		at hudson.model.AbstractBuild$AbstractBuildExecution.defaultCheckout(AbstractBuild.java:574)
		at jenkins.scm.SCMCheckoutStrategy.checkout(SCMCheckoutStrategy.java:86)
		at hudson.model.AbstractBuild$AbstractBuildExecution.run(AbstractBuild.java:499)
		at hudson.model.Run.execute(Run.java:1815)
		at hudson.model.FreeStyleBuild.run(FreeStyleBuild.java:43)
		at hudson.model.ResourceController.execute(ResourceController.java:97)
		at hudson.model.Executor.run(Executor.java:429)
Caused by: hudson.plugins.git.GitException: Error performing git command
	at org.jenkinsci.plugins.gitclient.CliGitAPIImpl.launchCommandIn(CliGitAPIImpl.java:2181)
	at org.jenkinsci.plugins.gitclient.CliGitAPIImpl.launchCommandIn(CliGitAPIImpl.java:2140)
	at org.jenkinsci.plugins.gitclient.CliGitAPIImpl.launchCommandIn(CliGitAPIImpl.java:2136)
	at org.jenkinsci.plugins.gitclient.CliGitAPIImpl.launchCommand(CliGitAPIImpl.java:1741)
	at org.jenkinsci.plugins.gitclient.CliGitAPIImpl$5.execute(CliGitAPIImpl.java:914)
	... 11 more
Caused by: java.lang.OutOfMemoryError: unable to create new native thread
	at java.lang.Thread.start0(Native Method)
	at java.lang.Thread.start(Thread.java:717)
	at hudson.Proc$LocalProc.<init>(Proc.java:258)
	at hudson.Proc$LocalProc.<init>(Proc.java:219)
	at hudson.Launcher$LocalLauncher.launch(Launcher.java:937)
	at hudson.Launcher$ProcStarter.start(Launcher.java:455)
	at org.jenkinsci.plugins.gitclient.CliGitAPIImpl.launchCommandIn(CliGitAPIImpl.java:2168)
	... 15 more
ERROR: Error cloning remote repo 'origin'
Archiving artifacts
Recording test results
ERROR: Step ?Publish JUnit test result report? failed: No test report files were found. Configuration error?
Email was triggered for: Failure - Any
Sending email for trigger: Failure - Any



###################################################################################
############################## FAILED TESTS (if any) ##############################
No tests ran.

ZooKeeper_branch35_jdk8 - Build # 1854 - Still Failing

Posted by Apache Jenkins Server <je...@builds.apache.org>.
See https://builds.apache.org/job/ZooKeeper_branch35_jdk8/1854/

###################################################################################
########################## LAST 60 LINES OF THE CONSOLE ###########################
[...truncated 9.42 KB...]
[ivy:retrieve] 	found io.netty#netty-transport-native-epoll;4.1.48.Final in maven2
[ivy:retrieve] 	found io.netty#netty-transport-native-unix-common;4.1.48.Final in maven2
[ivy:retrieve] :: resolution report :: resolve 1021ms :: artifacts dl 43ms
	---------------------------------------------------------------------
	|                  |            modules            ||   artifacts   |
	|       conf       | number| search|dwnlded|evicted|| number|dwnlded|
	---------------------------------------------------------------------
	|      default     |   26  |   0   |   0   |   0   ||   26  |   0   |
	---------------------------------------------------------------------
[ivy:retrieve] :: retrieving :: org.apache.zookeeper#zookeeper
[ivy:retrieve] 	confs: [default]
[ivy:retrieve] 	26 artifacts copied, 0 already retrieved (6712kB/50ms)

ivy-retrieve-clover:

clover.check:

clover.setup:

clover:

ivy-retrieve-javacc:
    [mkdir] Created dir: /home/jenkins/jenkins-slave/workspace/ZooKeeper_branch35_jdk8/build/javacc/lib
[ivy:retrieve] :: resolving dependencies :: org.apache.zookeeper#zookeeper;3.5.9-SNAPSHOT
[ivy:retrieve] 	confs: [javacc]
[ivy:retrieve] 	found net.java.dev.javacc#javacc;5.0 in maven2
[ivy:retrieve] :: resolution report :: resolve 36ms :: artifacts dl 2ms
	---------------------------------------------------------------------
	|                  |            modules            ||   artifacts   |
	|       conf       | number| search|dwnlded|evicted|| number|dwnlded|
	---------------------------------------------------------------------
	|      javacc      |   1   |   0   |   0   |   0   ||   1   |   0   |
	---------------------------------------------------------------------
[ivy:retrieve] :: retrieving :: org.apache.zookeeper#zookeeper
[ivy:retrieve] 	confs: [javacc]
[ivy:retrieve] 	1 artifacts copied, 0 already retrieved (291kB/4ms)

generate_jute_parser:
    [mkdir] Created dir: /home/jenkins/jenkins-slave/workspace/ZooKeeper_branch35_jdk8/build/jute_compiler/org/apache/jute/compiler/generated
[ivy:artifactproperty] DEPRECATED: 'ivy.conf.file' is deprecated, use 'ivy.settings.file' instead
[ivy:artifactproperty] :: loading settings :: file = /home/jenkins/jenkins-slave/workspace/ZooKeeper_branch35_jdk8/ivysettings.xml
     [move] Moving 1 file to /home/jenkins/jenkins-slave/workspace/ZooKeeper_branch35_jdk8/build/javacc/lib
   [javacc] #
   [javacc] # There is insufficient memory for the Java Runtime Environment to continue.
   [javacc] # Cannot create GC thread. Out of system resources.
   [javacc] # An error report file with more information is saved as:
   [javacc] # /home/jenkins/jenkins-slave/workspace/ZooKeeper_branch35_jdk8/hs_err_pid3360.log

BUILD FAILED
/home/jenkins/jenkins-slave/workspace/ZooKeeper_branch35_jdk8/build.xml:1480: The following error occurred while executing this line:
/home/jenkins/jenkins-slave/workspace/ZooKeeper_branch35_jdk8/build.xml:322: /usr/local/asfpackages/java/jdk1.8.0_241/jre/bin/java failed with return code 1

Total time: 4 seconds
Build step 'Invoke Ant' marked build as failure
Archiving artifacts
Recording test results
ERROR: Step ?Publish JUnit test result report? failed: No test report files were found. Configuration error?
Email was triggered for: Failure - Any
Sending email for trigger: Failure - Any



###################################################################################
############################## FAILED TESTS (if any) ##############################
No tests ran.