You are viewing a plain text version of this content. The canonical link for it is here.
Posted to notifications@maven.apache.org by Apache Jenkins Server <je...@builds.apache.org> on 2015/09/20 20:06:25 UTC

Build failed in Jenkins: doxia-sitetools » JDK 1.6 (latest),Windows #185

See <https://builds.apache.org/job/doxia-sitetools/jdk=JDK%201.6%20(latest),label=Windows/185/>

------------------------------------------
[...truncated 247 lines...]
	at hudson.scm.SubversionSCM.checkout(SubversionSCM.java:871)
	at hudson.model.AbstractProject.checkout(AbstractProject.java:1252)
	at hudson.model.AbstractBuild$AbstractBuildExecution.defaultCheckout(AbstractBuild.java:615)
	at jenkins.scm.SCMCheckoutStrategy.checkout(SCMCheckoutStrategy.java:86)
	at hudson.model.AbstractBuild$AbstractBuildExecution.run(AbstractBuild.java:524)
	at hudson.model.Run.execute(Run.java:1706)
	at hudson.matrix.MatrixRun.run(MatrixRun.java:146)
	at hudson.model.ResourceController.execute(ResourceController.java:88)
	at hudson.model.Executor.run(Executor.java:232)
Caused by: java.io.IOException
	at hudson.scm.subversion.UpdateUpdater$TaskImpl.perform(UpdateUpdater.java:211)
	at hudson.scm.subversion.WorkspaceUpdater$UpdateTask.delegateTo(WorkspaceUpdater.java:161)
	at hudson.scm.SubversionSCM$CheckOutTask.perform(SubversionSCM.java:1030)
	at hudson.scm.SubversionSCM$CheckOutTask.invoke(SubversionSCM.java:1011)
	at hudson.scm.SubversionSCM$CheckOutTask.invoke(SubversionSCM.java:987)
	at hudson.FilePath$FileCallableWrapper.call(FilePath.java:2474)
	at hudson.remoting.UserRequest.perform(UserRequest.java:118)
	at hudson.remoting.UserRequest.perform(UserRequest.java:48)
	at hudson.remoting.Request$2.run(Request.java:328)
	at hudson.remoting.InterceptingExecutorService$1.call(InterceptingExecutorService.java:72)
	at java.util.concurrent.FutureTask.run(Unknown Source)
	at java.util.concurrent.ThreadPoolExecutor.runWorker(Unknown Source)
	at java.util.concurrent.ThreadPoolExecutor$Worker.run(Unknown Source)
	at hudson.remoting.Engine$1$1.run(Engine.java:63)
	at java.lang.Thread.run(Unknown Source)
Caused by: hudson.scm.subversion.UpdaterException: failed to perform svn update
	... 15 more
Caused by: org.tmatesoft.svn.core.SVNException: svn: E175002: OPTIONS /repos/asf/maven/doxia/doxia-sitetools/trunk failed
	at org.tmatesoft.svn.core.internal.io.dav.http.HTTPConnection.request(HTTPConnection.java:388)
	at org.tmatesoft.svn.core.internal.io.dav.http.HTTPConnection.request(HTTPConnection.java:373)
	at org.tmatesoft.svn.core.internal.io.dav.http.HTTPConnection.request(HTTPConnection.java:361)
	at org.tmatesoft.svn.core.internal.io.dav.DAVConnection.performHttpRequest(DAVConnection.java:707)
	at org.tmatesoft.svn.core.internal.io.dav.DAVConnection.exchangeCapabilities(DAVConnection.java:627)
	at org.tmatesoft.svn.core.internal.io.dav.DAVConnection.open(DAVConnection.java:102)
	at org.tmatesoft.svn.core.internal.io.dav.DAVRepository.openConnection(DAVRepository.java:1020)
	at org.tmatesoft.svn.core.internal.io.dav.DAVRepository.getRepositoryUUID(DAVRepository.java:148)
	at org.tmatesoft.svn.core.internal.wc16.SVNBasicDelegate.createRepository(SVNBasicDelegate.java:339)
	at org.tmatesoft.svn.core.internal.wc16.SVNBasicDelegate.createRepository(SVNBasicDelegate.java:328)
	at org.tmatesoft.svn.core.internal.wc16.SVNUpdateClient16.update(SVNUpdateClient16.java:482)
	at org.tmatesoft.svn.core.internal.wc16.SVNUpdateClient16.doUpdate(SVNUpdateClient16.java:364)
	at org.tmatesoft.svn.core.internal.wc16.SVNUpdateClient16.doUpdate(SVNUpdateClient16.java:274)
	at org.tmatesoft.svn.core.internal.wc2.old.SvnOldUpdate.run(SvnOldUpdate.java:27)
	at org.tmatesoft.svn.core.internal.wc2.old.SvnOldUpdate.run(SvnOldUpdate.java:11)
	at org.tmatesoft.svn.core.internal.wc2.SvnOperationRunner.run(SvnOperationRunner.java:20)
	at org.tmatesoft.svn.core.wc2.SvnOperationFactory.run(SvnOperationFactory.java:1238)
	at org.tmatesoft.svn.core.wc2.SvnOperation.run(SvnOperation.java:294)
	at org.tmatesoft.svn.core.wc.SVNUpdateClient.doUpdate(SVNUpdateClient.java:311)
	at org.tmatesoft.svn.core.wc.SVNUpdateClient.doUpdate(SVNUpdateClient.java:291)
	at org.tmatesoft.svn.core.wc.SVNUpdateClient.doUpdate(SVNUpdateClient.java:387)
	at hudson.scm.subversion.UpdateUpdater$TaskImpl.perform(UpdateUpdater.java:157)
	... 14 more
Caused by: svn: E175002: OPTIONS /repos/asf/maven/doxia/doxia-sitetools/trunk failed
	at org.tmatesoft.svn.core.SVNErrorMessage.create(SVNErrorMessage.java:208)
	at org.tmatesoft.svn.core.SVNErrorMessage.create(SVNErrorMessage.java:154)
	at org.tmatesoft.svn.core.SVNErrorMessage.create(SVNErrorMessage.java:97)
	... 36 more
Caused by: org.tmatesoft.svn.core.SVNException: svn: E175002: OPTIONS request failed on '/repos/asf/maven/doxia/doxia-sitetools/trunk'
svn: E175002: connection refused by the server
	at org.tmatesoft.svn.core.internal.wc.SVNErrorManager.error(SVNErrorManager.java:64)
	at org.tmatesoft.svn.core.internal.wc.SVNErrorManager.error(SVNErrorManager.java:51)
	at org.tmatesoft.svn.core.internal.io.dav.http.HTTPConnection._request(HTTPConnection.java:777)
	at org.tmatesoft.svn.core.internal.io.dav.http.HTTPConnection.request(HTTPConnection.java:382)
	... 35 more
Caused by: svn: E175002: OPTIONS request failed on '/repos/asf/maven/doxia/doxia-sitetools/trunk'
	at org.tmatesoft.svn.core.SVNErrorMessage.create(SVNErrorMessage.java:208)
	at org.tmatesoft.svn.core.internal.io.dav.http.HTTPConnection._request(HTTPConnection.java:775)
	... 36 more
Caused by: svn: E175002: connection refused by the server
	at org.tmatesoft.svn.core.SVNErrorMessage.create(SVNErrorMessage.java:208)
	at org.tmatesoft.svn.core.internal.io.dav.http.HTTPConnection._request(HTTPConnection.java:520)
	... 36 more
Caused by: java.net.ConnectException: Connection refused: connect
	at java.net.DualStackPlainSocketImpl.waitForConnect(Native Method)
	at java.net.DualStackPlainSocketImpl.socketConnect(Unknown Source)
	at java.net.AbstractPlainSocketImpl.doConnect(Unknown Source)
	at java.net.AbstractPlainSocketImpl.connectToAddress(Unknown Source)
	at java.net.AbstractPlainSocketImpl.connect(Unknown Source)
	at java.net.PlainSocketImpl.connect(Unknown Source)
	at java.net.SocksSocketImpl.connect(Unknown Source)
	at java.net.Socket.connect(Unknown Source)
	at org.tmatesoft.svn.core.internal.util.SVNSocketFactory.connect(SVNSocketFactory.java:146)
	at org.tmatesoft.svn.core.internal.util.SVNSocketFactory.createPlainSocket(SVNSocketFactory.java:73)
	at org.tmatesoft.svn.core.internal.io.dav.http.HTTPConnection.connect(HTTPConnection.java:280)
	at org.tmatesoft.svn.core.internal.io.dav.http.HTTPConnection._request(HTTPConnection.java:451)
	... 36 more
Retrying after 10 seconds
Updating http://svn.apache.org/repos/asf/maven/doxia/doxia-sitetools/trunk at revision '2015-09-20T19:05:11.705 +0100'
ERROR: Failed to update http://svn.apache.org/repos/asf/maven/doxia/doxia-sitetools/trunk
org.tmatesoft.svn.core.SVNException: svn: E175002: OPTIONS /repos/asf/maven/doxia/doxia-sitetools/trunk failed
	at org.tmatesoft.svn.core.internal.io.dav.http.HTTPConnection.request(HTTPConnection.java:388)
	at org.tmatesoft.svn.core.internal.io.dav.http.HTTPConnection.request(HTTPConnection.java:373)
	at org.tmatesoft.svn.core.internal.io.dav.http.HTTPConnection.request(HTTPConnection.java:361)
	at org.tmatesoft.svn.core.internal.io.dav.DAVConnection.performHttpRequest(DAVConnection.java:707)
	at org.tmatesoft.svn.core.internal.io.dav.DAVConnection.exchangeCapabilities(DAVConnection.java:627)
	at org.tmatesoft.svn.core.internal.io.dav.DAVConnection.open(DAVConnection.java:102)
	at org.tmatesoft.svn.core.internal.io.dav.DAVRepository.openConnection(DAVRepository.java:1020)
	at org.tmatesoft.svn.core.internal.io.dav.DAVRepository.getRepositoryUUID(DAVRepository.java:148)
	at org.tmatesoft.svn.core.internal.wc16.SVNBasicDelegate.createRepository(SVNBasicDelegate.java:339)
	at org.tmatesoft.svn.core.internal.wc16.SVNBasicDelegate.createRepository(SVNBasicDelegate.java:328)
	at org.tmatesoft.svn.core.internal.wc16.SVNUpdateClient16.update(SVNUpdateClient16.java:482)
	at org.tmatesoft.svn.core.internal.wc16.SVNUpdateClient16.doUpdate(SVNUpdateClient16.java:364)
	at org.tmatesoft.svn.core.internal.wc16.SVNUpdateClient16.doUpdate(SVNUpdateClient16.java:274)
	at org.tmatesoft.svn.core.internal.wc2.old.SvnOldUpdate.run(SvnOldUpdate.java:27)
	at org.tmatesoft.svn.core.internal.wc2.old.SvnOldUpdate.run(SvnOldUpdate.java:11)
	at org.tmatesoft.svn.core.internal.wc2.SvnOperationRunner.run(SvnOperationRunner.java:20)
	at org.tmatesoft.svn.core.wc2.SvnOperationFactory.run(SvnOperationFactory.java:1238)
	at org.tmatesoft.svn.core.wc2.SvnOperation.run(SvnOperation.java:294)
	at org.tmatesoft.svn.core.wc.SVNUpdateClient.doUpdate(SVNUpdateClient.java:311)
	at org.tmatesoft.svn.core.wc.SVNUpdateClient.doUpdate(SVNUpdateClient.java:291)
	at org.tmatesoft.svn.core.wc.SVNUpdateClient.doUpdate(SVNUpdateClient.java:387)
	at hudson.scm.subversion.UpdateUpdater$TaskImpl.perform(UpdateUpdater.java:157)
	at hudson.scm.subversion.WorkspaceUpdater$UpdateTask.delegateTo(WorkspaceUpdater.java:161)
	at hudson.scm.SubversionSCM$CheckOutTask.perform(SubversionSCM.java:1030)
	at hudson.scm.SubversionSCM$CheckOutTask.invoke(SubversionSCM.java:1011)
	at hudson.scm.SubversionSCM$CheckOutTask.invoke(SubversionSCM.java:987)
	at hudson.FilePath$FileCallableWrapper.call(FilePath.java:2474)
	at hudson.remoting.UserRequest.perform(UserRequest.java:118)
	at hudson.remoting.UserRequest.perform(UserRequest.java:48)
	at hudson.remoting.Request$2.run(Request.java:328)
	at hudson.remoting.InterceptingExecutorService$1.call(InterceptingExecutorService.java:72)
	at java.util.concurrent.FutureTask.run(Unknown Source)
	at java.util.concurrent.ThreadPoolExecutor.runWorker(Unknown Source)
	at java.util.concurrent.ThreadPoolExecutor$Worker.run(Unknown Source)
	at hudson.remoting.Engine$1$1.run(Engine.java:63)
	at java.lang.Thread.run(Unknown Source)
Caused by: svn: E175002: OPTIONS /repos/asf/maven/doxia/doxia-sitetools/trunk failed
	at org.tmatesoft.svn.core.SVNErrorMessage.create(SVNErrorMessage.java:208)
	at org.tmatesoft.svn.core.SVNErrorMessage.create(SVNErrorMessage.java:154)
	at org.tmatesoft.svn.core.SVNErrorMessage.create(SVNErrorMessage.java:97)
	... 36 more
Caused by: org.tmatesoft.svn.core.SVNException: svn: E175002: OPTIONS request failed on '/repos/asf/maven/doxia/doxia-sitetools/trunk'
svn: E175002: connection refused by the server
	at org.tmatesoft.svn.core.internal.wc.SVNErrorManager.error(SVNErrorManager.java:64)
	at org.tmatesoft.svn.core.internal.wc.SVNErrorManager.error(SVNErrorManager.java:51)
	at org.tmatesoft.svn.core.internal.io.dav.http.HTTPConnection._request(HTTPConnection.java:777)
	at org.tmatesoft.svn.core.internal.io.dav.http.HTTPConnection.request(HTTPConnection.java:382)
	... 35 more
Caused by: svn: E175002: OPTIONS request failed on '/repos/asf/maven/doxia/doxia-sitetools/trunk'
	at org.tmatesoft.svn.core.SVNErrorMessage.create(SVNErrorMessage.java:208)
	at org.tmatesoft.svn.core.internal.io.dav.http.HTTPConnection._request(HTTPConnection.java:775)
	... 36 more
Caused by: svn: E175002: connection refused by the server
	at org.tmatesoft.svn.core.SVNErrorMessage.create(SVNErrorMessage.java:208)
	at org.tmatesoft.svn.core.internal.io.dav.http.HTTPConnection._request(HTTPConnection.java:520)
	... 36 more
Caused by: java.net.ConnectException: Connection refused: connect
	at java.net.DualStackPlainSocketImpl.waitForConnect(Native Method)
	at java.net.DualStackPlainSocketImpl.socketConnect(Unknown Source)
	at java.net.AbstractPlainSocketImpl.doConnect(Unknown Source)
	at java.net.AbstractPlainSocketImpl.connectToAddress(Unknown Source)
	at java.net.AbstractPlainSocketImpl.connect(Unknown Source)
	at java.net.PlainSocketImpl.connect(Unknown Source)
	at java.net.SocksSocketImpl.connect(Unknown Source)
	at java.net.Socket.connect(Unknown Source)
	at org.tmatesoft.svn.core.internal.util.SVNSocketFactory.connect(SVNSocketFactory.java:146)
	at org.tmatesoft.svn.core.internal.util.SVNSocketFactory.createPlainSocket(SVNSocketFactory.java:73)
	at org.tmatesoft.svn.core.internal.io.dav.http.HTTPConnection.connect(HTTPConnection.java:280)
	at org.tmatesoft.svn.core.internal.io.dav.http.HTTPConnection._request(HTTPConnection.java:451)
	... 36 more
ERROR: Subversion update failed
java.io.IOException: remote file operation failed: <https://builds.apache.org/job/doxia-sitetools/jdk=JDK%201.6%20(latest),label=Windows/ws/> at hudson.remoting.Channel@15a9051d:windows1
	at hudson.FilePath.act(FilePath.java:916)
	at hudson.FilePath.act(FilePath.java:893)
	at hudson.scm.SubversionSCM.checkout(SubversionSCM.java:936)
	at hudson.scm.SubversionSCM.checkout(SubversionSCM.java:871)
	at hudson.model.AbstractProject.checkout(AbstractProject.java:1252)
	at hudson.model.AbstractBuild$AbstractBuildExecution.defaultCheckout(AbstractBuild.java:615)
	at jenkins.scm.SCMCheckoutStrategy.checkout(SCMCheckoutStrategy.java:86)
	at hudson.model.AbstractBuild$AbstractBuildExecution.run(AbstractBuild.java:524)
	at hudson.model.Run.execute(Run.java:1706)
	at hudson.matrix.MatrixRun.run(MatrixRun.java:146)
	at hudson.model.ResourceController.execute(ResourceController.java:88)
	at hudson.model.Executor.run(Executor.java:232)
Caused by: java.io.IOException
	at hudson.scm.subversion.UpdateUpdater$TaskImpl.perform(UpdateUpdater.java:211)
	at hudson.scm.subversion.WorkspaceUpdater$UpdateTask.delegateTo(WorkspaceUpdater.java:161)
	at hudson.scm.SubversionSCM$CheckOutTask.perform(SubversionSCM.java:1030)
	at hudson.scm.SubversionSCM$CheckOutTask.invoke(SubversionSCM.java:1011)
	at hudson.scm.SubversionSCM$CheckOutTask.invoke(SubversionSCM.java:987)
	at hudson.FilePath$FileCallableWrapper.call(FilePath.java:2474)
	at hudson.remoting.UserRequest.perform(UserRequest.java:118)
	at hudson.remoting.UserRequest.perform(UserRequest.java:48)
	at hudson.remoting.Request$2.run(Request.java:328)
	at hudson.remoting.InterceptingExecutorService$1.call(InterceptingExecutorService.java:72)
	at java.util.concurrent.FutureTask.run(Unknown Source)
	at java.util.concurrent.ThreadPoolExecutor.runWorker(Unknown Source)
	at java.util.concurrent.ThreadPoolExecutor$Worker.run(Unknown Source)
	at hudson.remoting.Engine$1$1.run(Engine.java:63)
	at java.lang.Thread.run(Unknown Source)
Caused by: hudson.scm.subversion.UpdaterException: failed to perform svn update
	... 15 more
Caused by: org.tmatesoft.svn.core.SVNException: svn: E175002: OPTIONS /repos/asf/maven/doxia/doxia-sitetools/trunk failed
	at org.tmatesoft.svn.core.internal.io.dav.http.HTTPConnection.request(HTTPConnection.java:388)
	at org.tmatesoft.svn.core.internal.io.dav.http.HTTPConnection.request(HTTPConnection.java:373)
	at org.tmatesoft.svn.core.internal.io.dav.http.HTTPConnection.request(HTTPConnection.java:361)
	at org.tmatesoft.svn.core.internal.io.dav.DAVConnection.performHttpRequest(DAVConnection.java:707)
	at org.tmatesoft.svn.core.internal.io.dav.DAVConnection.exchangeCapabilities(DAVConnection.java:627)
	at org.tmatesoft.svn.core.internal.io.dav.DAVConnection.open(DAVConnection.java:102)
	at org.tmatesoft.svn.core.internal.io.dav.DAVRepository.openConnection(DAVRepository.java:1020)
	at org.tmatesoft.svn.core.internal.io.dav.DAVRepository.getRepositoryUUID(DAVRepository.java:148)
	at org.tmatesoft.svn.core.internal.wc16.SVNBasicDelegate.createRepository(SVNBasicDelegate.java:339)
	at org.tmatesoft.svn.core.internal.wc16.SVNBasicDelegate.createRepository(SVNBasicDelegate.java:328)
	at org.tmatesoft.svn.core.internal.wc16.SVNUpdateClient16.update(SVNUpdateClient16.java:482)
	at org.tmatesoft.svn.core.internal.wc16.SVNUpdateClient16.doUpdate(SVNUpdateClient16.java:364)
	at org.tmatesoft.svn.core.internal.wc16.SVNUpdateClient16.doUpdate(SVNUpdateClient16.java:274)
	at org.tmatesoft.svn.core.internal.wc2.old.SvnOldUpdate.run(SvnOldUpdate.java:27)
	at org.tmatesoft.svn.core.internal.wc2.old.SvnOldUpdate.run(SvnOldUpdate.java:11)
	at org.tmatesoft.svn.core.internal.wc2.SvnOperationRunner.run(SvnOperationRunner.java:20)
	at org.tmatesoft.svn.core.wc2.SvnOperationFactory.run(SvnOperationFactory.java:1238)
	at org.tmatesoft.svn.core.wc2.SvnOperation.run(SvnOperation.java:294)
	at org.tmatesoft.svn.core.wc.SVNUpdateClient.doUpdate(SVNUpdateClient.java:311)
	at org.tmatesoft.svn.core.wc.SVNUpdateClient.doUpdate(SVNUpdateClient.java:291)
	at org.tmatesoft.svn.core.wc.SVNUpdateClient.doUpdate(SVNUpdateClient.java:387)
	at hudson.scm.subversion.UpdateUpdater$TaskImpl.perform(UpdateUpdater.java:157)
	... 14 more
Caused by: svn: E175002: OPTIONS /repos/asf/maven/doxia/doxia-sitetools/trunk failed
	at org.tmatesoft.svn.core.SVNErrorMessage.create(SVNErrorMessage.java:208)
	at org.tmatesoft.svn.core.SVNErrorMessage.create(SVNErrorMessage.java:154)
	at org.tmatesoft.svn.core.SVNErrorMessage.create(SVNErrorMessage.java:97)
	... 36 more
Caused by: org.tmatesoft.svn.core.SVNException: svn: E175002: OPTIONS request failed on '/repos/asf/maven/doxia/doxia-sitetools/trunk'
svn: E175002: connection refused by the server
	at org.tmatesoft.svn.core.internal.wc.SVNErrorManager.error(SVNErrorManager.java:64)
	at org.tmatesoft.svn.core.internal.wc.SVNErrorManager.error(SVNErrorManager.java:51)
	at org.tmatesoft.svn.core.internal.io.dav.http.HTTPConnection._request(HTTPConnection.java:777)
	at org.tmatesoft.svn.core.internal.io.dav.http.HTTPConnection.request(HTTPConnection.java:382)
	... 35 more
Caused by: svn: E175002: OPTIONS request failed on '/repos/asf/maven/doxia/doxia-sitetools/trunk'
	at org.tmatesoft.svn.core.SVNErrorMessage.create(SVNErrorMessage.java:208)
	at org.tmatesoft.svn.core.internal.io.dav.http.HTTPConnection._request(HTTPConnection.java:775)
	... 36 more
Caused by: svn: E175002: connection refused by the server
	at org.tmatesoft.svn.core.SVNErrorMessage.create(SVNErrorMessage.java:208)
	at org.tmatesoft.svn.core.internal.io.dav.http.HTTPConnection._request(HTTPConnection.java:520)
	... 36 more
Caused by: java.net.ConnectException: Connection refused: connect
	at java.net.DualStackPlainSocketImpl.waitForConnect(Native Method)
	at java.net.DualStackPlainSocketImpl.socketConnect(Unknown Source)
	at java.net.AbstractPlainSocketImpl.doConnect(Unknown Source)
	at java.net.AbstractPlainSocketImpl.connectToAddress(Unknown Source)
	at java.net.AbstractPlainSocketImpl.connect(Unknown Source)
	at java.net.PlainSocketImpl.connect(Unknown Source)
	at java.net.SocksSocketImpl.connect(Unknown Source)
	at java.net.Socket.connect(Unknown Source)
	at org.tmatesoft.svn.core.internal.util.SVNSocketFactory.connect(SVNSocketFactory.java:146)
	at org.tmatesoft.svn.core.internal.util.SVNSocketFactory.createPlainSocket(SVNSocketFactory.java:73)
	at org.tmatesoft.svn.core.internal.io.dav.http.HTTPConnection.connect(HTTPConnection.java:280)
	at org.tmatesoft.svn.core.internal.io.dav.http.HTTPConnection._request(HTTPConnection.java:451)
	... 36 more

Jenkins build is back to normal : doxia-sitetools » JDK 1.6 (latest),Windows #187

Posted by Apache Jenkins Server <je...@builds.apache.org>.
See <https://builds.apache.org/job/doxia-sitetools/jdk=JDK%201.6%20(latest),label=Windows/187/changes>


Build failed in Jenkins: doxia-sitetools » JDK 1.6 (latest),Windows #186

Posted by Apache Jenkins Server <je...@builds.apache.org>.
See <https://builds.apache.org/job/doxia-sitetools/jdk=JDK%201.6%20(latest),label=Windows/186/>

------------------------------------------
[...truncated 510 lines...]
[INFO] 
[INFO] --- maven-enforcer-plugin:1.3.1:enforce (enforce-bytecode-version) @ doxia-decoration-model ---
[INFO] 
[INFO] --- maven-enforcer-plugin:1.3.1:enforce (ban-known-bad-maven-versions) @ doxia-decoration-model ---
[INFO] 
[INFO] --- apache-rat-plugin:0.11:check (rat-check) @ doxia-decoration-model ---
[INFO] 51 implicit excludes (use -debug for more details).
[INFO] Exclude: src/test/resources/site/confluence/confluence/*.confluence
[INFO] Exclude: src/test/resources/org/apache/maven/doxia/siterenderer/velocity-toolmanager.vm
[INFO] Exclude: src/test/resources/org/apache/maven/doxia/siterenderer/velocity-toolmanager.expected.txt
[INFO] Exclude: src/test/resources/dtd/xhtml-*.ent
[INFO] Exclude: src/test/resources/dtd/xhtml1-transitional.dtd
[INFO] Exclude: src/test/resources/xhtml-lat1.ent
[INFO] Exclude: DEPENDENCIES
[INFO] 29 resources included (use -debug for more details)
[INFO] Rat check: Summary of files. Unapproved: 0 unknown: 0 generated: 0 approved: 29 licence.
[INFO] 
[INFO] --- apache-rat-plugin:0.11:check (check) @ doxia-decoration-model ---
[INFO] 51 implicit excludes (use -debug for more details).
[INFO] Exclude: src/test/resources/site/confluence/confluence/*.confluence
[INFO] Exclude: src/test/resources/org/apache/maven/doxia/siterenderer/velocity-toolmanager.vm
[INFO] Exclude: src/test/resources/org/apache/maven/doxia/siterenderer/velocity-toolmanager.expected.txt
[INFO] Exclude: src/test/resources/dtd/xhtml-*.ent
[INFO] Exclude: src/test/resources/dtd/xhtml1-transitional.dtd
[INFO] Exclude: src/test/resources/xhtml-lat1.ent
[INFO] 29 resources included (use -debug for more details)
[INFO] Rat check: Summary of files. Unapproved: 0 unknown: 0 generated: 0 approved: 29 licence.
[INFO] 
[INFO] --- modello-maven-plugin:1.8.1:xpp3-writer (descriptor) @ doxia-decoration-model ---
[INFO] outputDirectory: F:\hudson\hudson-slave\workspace\doxia-sitetools\jdk\JDK 1.6 (latest)\label\Windows\doxia-decoration-model\target\generated-sources\modello
[INFO] Working on model: src/main/mdo/decoration.mdo
[INFO] Generating current version: 1.7.0
[INFO] 
[INFO] --- modello-maven-plugin:1.8.1:java (descriptor) @ doxia-decoration-model ---
[INFO] outputDirectory: F:\hudson\hudson-slave\workspace\doxia-sitetools\jdk\JDK 1.6 (latest)\label\Windows\doxia-decoration-model\target\generated-sources\modello
[INFO] Working on model: src/main/mdo/decoration.mdo
[INFO] Generating current version: 1.7.0
[INFO] 
[INFO] --- modello-maven-plugin:1.8.1:xpp3-reader (descriptor) @ doxia-decoration-model ---
[INFO] outputDirectory: F:\hudson\hudson-slave\workspace\doxia-sitetools\jdk\JDK 1.6 (latest)\label\Windows\doxia-decoration-model\target\generated-sources\modello
[INFO] Working on model: src/main/mdo/decoration.mdo
[INFO] Generating current version: 1.7.0
[INFO] 
[INFO] --- modello-maven-plugin:1.8.1:xsd (descriptor) @ doxia-decoration-model ---
[INFO] outputDirectory: F:\hudson\hudson-slave\workspace\doxia-sitetools\jdk\JDK 1.6 (latest)\label\Windows\doxia-decoration-model\target\generated-site\xsd
[INFO] Working on model: src/main/mdo/decoration.mdo
[INFO] Generating current version: 1.7.0
[INFO] 
[INFO] --- maven-remote-resources-plugin:1.5:process (default) @ doxia-decoration-model ---
[INFO] 
[INFO] --- maven-resources-plugin:2.6:resources (default-resources) @ doxia-decoration-model ---
[INFO] Using 'UTF-8' encoding to copy filtered resources.
[INFO] skip non existing resourceDirectory F:\hudson\hudson-slave\workspace\doxia-sitetools\jdk\JDK 1.6 (latest)\label\Windows\doxia-decoration-model\src\main\resources
[INFO] Copying 1 resource
[INFO] Copying 3 resources
[INFO] Copying 3 resources
[INFO] 
[INFO] --- maven-compiler-plugin:3.1:compile (default-compile) @ doxia-decoration-model ---
[INFO] Changes detected - recompiling the module!
[INFO] Compiling 17 source files to F:\hudson\hudson-slave\workspace\doxia-sitetools\jdk\JDK 1.6 (latest)\label\Windows\doxia-decoration-model\target\classes
[WARNING] Note: F:\hudson\hudson-slave\workspace\doxia-sitetools\jdk\JDK 1.6 (latest)\label\Windows\doxia-decoration-model\src\main\java\org\apache\maven\doxia\site\decoration\inheritance\PathUtils.java uses or overrides a deprecated API.
[WARNING] Note: Recompile with -Xlint:deprecation for details.
[WARNING] Note: Some input files use unchecked or unsafe operations.
[WARNING] Note: Recompile with -Xlint:unchecked for details.
[INFO] 
[INFO] <<< clirr-maven-plugin:2.6.1:check (default) @ doxia-decoration-model <<<
[INFO] 
[INFO] --- clirr-maven-plugin:2.6.1:check (default) @ doxia-decoration-model ---
[INFO] Comparing to version: 1.1
[INFO] Succeeded with 0 errors; 0 warnings; and 0 other changes.
[INFO] 
[INFO] --- maven-install-plugin:2.5.2:install (default-install) @ doxia-decoration-model ---
[INFO] Installing F:\hudson\hudson-slave\workspace\doxia-sitetools\jdk\JDK 1.6 (latest)\label\Windows\doxia-decoration-model\target\doxia-decoration-model-1.7-SNAPSHOT.jar to C:\.m2\repository\org\apache\maven\doxia\doxia-decoration-model\1.7-SNAPSHOT\doxia-decoration-model-1.7-SNAPSHOT.jar
[INFO] Installing F:\hudson\hudson-slave\workspace\doxia-sitetools\jdk\JDK 1.6 (latest)\label\Windows\doxia-decoration-model\pom.xml to C:\.m2\repository\org\apache\maven\doxia\doxia-decoration-model\1.7-SNAPSHOT\doxia-decoration-model-1.7-SNAPSHOT.pom
[INFO]                                                                         
[INFO] ------------------------------------------------------------------------
[INFO] Building Doxia :: Document Renderer 1.7-SNAPSHOT
[INFO] ------------------------------------------------------------------------
Downloading: http://repository.apache.org/snapshots/org/apache/maven/doxia/doxia-core/1.7-SNAPSHOT/maven-metadata.xml
Downloaded: http://repository.apache.org/snapshots/org/apache/maven/doxia/doxia-core/1.7-SNAPSHOT/maven-metadata.xml (990 B at 0.3 KB/sec)
Downloading: http://repository.apache.org/snapshots/org/apache/maven/doxia/doxia/1.7-SNAPSHOT/maven-metadata.xml
Downloaded: http://repository.apache.org/snapshots/org/apache/maven/doxia/doxia/1.7-SNAPSHOT/maven-metadata.xml (812 B at 1.0 KB/sec)
Downloading: http://repository.apache.org/snapshots/org/apache/maven/doxia/doxia-sink-api/1.7-SNAPSHOT/maven-metadata.xml
Downloaded: http://repository.apache.org/snapshots/org/apache/maven/doxia/doxia-sink-api/1.7-SNAPSHOT/maven-metadata.xml (783 B at 0.6 KB/sec)
Downloading: http://repository.apache.org/snapshots/org/apache/maven/doxia/doxia-logging-api/1.7-SNAPSHOT/maven-metadata.xml
Downloaded: http://repository.apache.org/snapshots/org/apache/maven/doxia/doxia-logging-api/1.7-SNAPSHOT/maven-metadata.xml (786 B at 1.5 KB/sec)
Downloading: http://repository.apache.org/snapshots/org/apache/maven/doxia/doxia-module-itext/1.7-SNAPSHOT/maven-metadata.xml
Downloaded: http://repository.apache.org/snapshots/org/apache/maven/doxia/doxia-module-itext/1.7-SNAPSHOT/maven-metadata.xml (787 B at 0.6 KB/sec)
Downloading: http://repository.apache.org/snapshots/org/apache/maven/doxia/doxia-modules/1.7-SNAPSHOT/maven-metadata.xml
Downloaded: http://repository.apache.org/snapshots/org/apache/maven/doxia/doxia-modules/1.7-SNAPSHOT/maven-metadata.xml (820 B at 0.7 KB/sec)
Downloading: http://repository.apache.org/snapshots/org/apache/maven/doxia/doxia-module-fo/1.7-SNAPSHOT/maven-metadata.xml
Downloaded: http://repository.apache.org/snapshots/org/apache/maven/doxia/doxia-module-fo/1.7-SNAPSHOT/maven-metadata.xml (784 B at 1.4 KB/sec)
Downloading: http://repository.apache.org/snapshots/org/apache/maven/doxia/doxia-module-apt/1.7-SNAPSHOT/maven-metadata.xml
Downloaded: http://repository.apache.org/snapshots/org/apache/maven/doxia/doxia-module-apt/1.7-SNAPSHOT/maven-metadata.xml (785 B at 0.1 KB/sec)
Downloading: http://repository.apache.org/snapshots/org/apache/maven/doxia/doxia-module-fml/1.7-SNAPSHOT/maven-metadata.xml
Downloaded: http://repository.apache.org/snapshots/org/apache/maven/doxia/doxia-module-fml/1.7-SNAPSHOT/maven-metadata.xml (785 B at 0.9 KB/sec)
Downloading: http://repository.apache.org/snapshots/org/apache/maven/doxia/doxia-module-xdoc/1.7-SNAPSHOT/maven-metadata.xml
Downloaded: http://repository.apache.org/snapshots/org/apache/maven/doxia/doxia-module-xdoc/1.7-SNAPSHOT/maven-metadata.xml (786 B at 0.5 KB/sec)
Downloading: http://repository.apache.org/snapshots/org/apache/maven/doxia/doxia-module-xhtml/1.7-SNAPSHOT/maven-metadata.xml
Downloaded: http://repository.apache.org/snapshots/org/apache/maven/doxia/doxia-module-xhtml/1.7-SNAPSHOT/maven-metadata.xml (787 B at 0.6 KB/sec)
Downloading: http://repository.apache.org/snapshots/org/apache/maven/doxia/doxia-module-markdown/1.7-SNAPSHOT/maven-metadata.xml
Downloaded: http://repository.apache.org/snapshots/org/apache/maven/doxia/doxia-module-markdown/1.7-SNAPSHOT/maven-metadata.xml (790 B at 0.3 KB/sec)
[INFO] 
[INFO] --- maven-clean-plugin:2.5:clean (default-clean) @ doxia-doc-renderer ---
[INFO] 
[INFO] --- maven-enforcer-plugin:1.3.1:enforce (enforce-bytecode-version) @ doxia-doc-renderer ---
[INFO] Restricted to JDK 1.5 yet org.apache.maven.doxia:doxia-module-xdoc:jar:1.7-SNAPSHOT:runtime contains org/apache/maven/doxia/module/xdoc/XdocMarkup$1.class targeted to JDK 1.6
[INFO] Restricted to JDK 1.5 yet org.apache.maven.doxia:doxia-module-itext:jar:1.7-SNAPSHOT:compile contains org/apache/maven/doxia/module/itext/ITextFont.class targeted to JDK 1.6
[INFO] Restricted to JDK 1.5 yet org.apache.maven.doxia:doxia-module-fml:jar:1.7-SNAPSHOT:runtime contains org/apache/maven/doxia/module/fml/FmlContentParser.class targeted to JDK 1.6
[INFO] Restricted to JDK 1.5 yet org.apache.maven.doxia:doxia-core:jar:1.7-SNAPSHOT:compile contains org/apache/maven/doxia/DefaultDoxia.class targeted to JDK 1.6
[INFO] Restricted to JDK 1.5 yet org.apache.maven.doxia:doxia-module-markdown:jar:1.7-SNAPSHOT:runtime contains org/apache/maven/doxia/module/markdown/MarkdownParser$PegDownHtmlParser.class targeted to JDK 1.6
[INFO] Restricted to JDK 1.5 yet org.apache.maven.doxia:doxia-module-xhtml:jar:1.7-SNAPSHOT:runtime contains org/apache/maven/doxia/module/xhtml/AbstractXhtmlSink.class targeted to JDK 1.6
[INFO] Restricted to JDK 1.5 yet org.apache.maven.doxia:doxia-logging-api:jar:1.7-SNAPSHOT:compile contains org/apache/maven/doxia/logging/Log.class targeted to JDK 1.6
[INFO] Restricted to JDK 1.5 yet org.apache.maven.doxia:doxia-module-apt:jar:1.7-SNAPSHOT:runtime contains org/apache/maven/doxia/module/apt/AptMarkup.class targeted to JDK 1.6
[INFO] Restricted to JDK 1.5 yet org.apache.maven.doxia:doxia-module-fo:jar:1.7-SNAPSHOT:compile contains org/apache/maven/doxia/module/fo/FoAggregateSink.class targeted to JDK 1.6
[INFO] Restricted to JDK 1.5 yet org.apache.maven.doxia:doxia-sink-api:jar:1.7-SNAPSHOT:compile contains org/apache/maven/doxia/sink/Sink.class targeted to JDK 1.6
[WARNING] Rule 0: org.apache.maven.plugins.enforcer.EnforceBytecodeVersion failed with message:
Found Banned Dependency: org.apache.maven.doxia:doxia-module-xdoc:jar:1.7-SNAPSHOT
Found Banned Dependency: org.apache.maven.doxia:doxia-module-itext:jar:1.7-SNAPSHOT
Found Banned Dependency: org.apache.maven.doxia:doxia-module-fml:jar:1.7-SNAPSHOT
Found Banned Dependency: org.apache.maven.doxia:doxia-core:jar:1.7-SNAPSHOT
Found Banned Dependency: org.apache.maven.doxia:doxia-module-markdown:jar:1.7-SNAPSHOT
Found Banned Dependency: org.apache.maven.doxia:doxia-module-xhtml:jar:1.7-SNAPSHOT
Found Banned Dependency: org.apache.maven.doxia:doxia-logging-api:jar:1.7-SNAPSHOT
Found Banned Dependency: org.apache.maven.doxia:doxia-module-apt:jar:1.7-SNAPSHOT
Found Banned Dependency: org.apache.maven.doxia:doxia-module-fo:jar:1.7-SNAPSHOT
Found Banned Dependency: org.apache.maven.doxia:doxia-sink-api:jar:1.7-SNAPSHOT
Use 'mvn dependency:tree' to locate the source of the banned dependencies.
[INFO]                                                                         
[INFO] ------------------------------------------------------------------------
[INFO] Building Doxia :: Site Renderer 1.7-SNAPSHOT
[INFO] ------------------------------------------------------------------------
Downloading: http://repository.apache.org/snapshots/org/apache/maven/doxia/doxia-module-confluence/1.7-SNAPSHOT/maven-metadata.xml
Downloaded: http://repository.apache.org/snapshots/org/apache/maven/doxia/doxia-module-confluence/1.7-SNAPSHOT/maven-metadata.xml (792 B at 0.6 KB/sec)
Downloading: http://repository.apache.org/snapshots/org/apache/maven/doxia/doxia-module-docbook-simple/1.7-SNAPSHOT/maven-metadata.xml
Downloaded: http://repository.apache.org/snapshots/org/apache/maven/doxia/doxia-module-docbook-simple/1.7-SNAPSHOT/maven-metadata.xml (796 B at 0.3 KB/sec)
Downloading: http://repo.maven.apache.org/maven2/org/mockito/mockito-core/1.10.19/mockito-core-1.10.19.pom
Downloaded: http://repo.maven.apache.org/maven2/org/mockito/mockito-core/1.10.19/mockito-core-1.10.19.pom (2 KB at 1.1 KB/sec)
Downloading: http://repo.maven.apache.org/maven2/org/objenesis/objenesis/2.1/objenesis-2.1.pom
Downloaded: http://repo.maven.apache.org/maven2/org/objenesis/objenesis/2.1/objenesis-2.1.pom (3 KB at 41.3 KB/sec)
Downloading: http://repo.maven.apache.org/maven2/org/objenesis/objenesis-parent/2.1/objenesis-parent-2.1.pom
Downloaded: http://repo.maven.apache.org/maven2/org/objenesis/objenesis-parent/2.1/objenesis-parent-2.1.pom (17 KB at 175.4 KB/sec)
Downloading: http://repo.maven.apache.org/maven2/org/mockito/mockito-core/1.10.19/mockito-core-1.10.19.jar
Downloading: http://repo.maven.apache.org/maven2/org/objenesis/objenesis/2.1/objenesis-2.1.jar
Downloaded: http://repo.maven.apache.org/maven2/org/objenesis/objenesis/2.1/objenesis-2.1.jar (41 KB at 384.7 KB/sec)
Downloaded: http://repo.maven.apache.org/maven2/org/mockito/mockito-core/1.10.19/mockito-core-1.10.19.jar (1146 KB at 1722.5 KB/sec)
[INFO] 
[INFO] --- maven-clean-plugin:2.5:clean (default-clean) @ doxia-site-renderer ---
[INFO] 
[INFO] --- maven-enforcer-plugin:1.3.1:enforce (enforce-bytecode-version) @ doxia-site-renderer ---
[INFO] Restricted to JDK 1.5 yet org.apache.maven.doxia:doxia-module-xdoc:jar:1.7-SNAPSHOT:test contains org/apache/maven/doxia/module/xdoc/XdocMarkup$1.class targeted to JDK 1.6
[INFO] Restricted to JDK 1.5 yet org.apache.maven.doxia:doxia-module-fml:jar:1.7-SNAPSHOT:compile contains org/apache/maven/doxia/module/fml/FmlContentParser.class targeted to JDK 1.6
[INFO] Restricted to JDK 1.5 yet org.apache.maven.doxia:doxia-core:jar:1.7-SNAPSHOT:compile contains org/apache/maven/doxia/DefaultDoxia.class targeted to JDK 1.6
[INFO] Restricted to JDK 1.5 yet org.apache.maven.doxia:doxia-module-docbook-simple:jar:1.7-SNAPSHOT:test contains org/apache/maven/doxia/module/docbook/DocbookMarkup$1.class targeted to JDK 1.6
[INFO] Restricted to JDK 1.5 yet org.apache.maven.doxia:doxia-core:test-jar:tests:1.7-SNAPSHOT:test contains org/apache/maven/doxia/AbstractModuleTest.class targeted to JDK 1.6
[INFO] Restricted to JDK 1.5 yet org.apache.maven.doxia:doxia-module-xhtml:jar:1.7-SNAPSHOT:compile contains org/apache/maven/doxia/module/xhtml/AbstractXhtmlSink.class targeted to JDK 1.6
[INFO] Restricted to JDK 1.5 yet org.apache.maven.doxia:doxia-logging-api:jar:1.7-SNAPSHOT:compile contains org/apache/maven/doxia/logging/Log.class targeted to JDK 1.6
[INFO] Restricted to JDK 1.5 yet org.apache.maven.doxia:doxia-module-apt:jar:1.7-SNAPSHOT:test contains org/apache/maven/doxia/module/apt/AptMarkup.class targeted to JDK 1.6
[INFO] Restricted to JDK 1.5 yet org.apache.maven.doxia:doxia-module-confluence:jar:1.7-SNAPSHOT:test contains org/apache/maven/doxia/module/confluence/ConfluenceMarkup.class targeted to JDK 1.6
[INFO] Restricted to JDK 1.5 yet org.apache.maven.doxia:doxia-sink-api:jar:1.7-SNAPSHOT:compile contains org/apache/maven/doxia/sink/Sink.class targeted to JDK 1.6
[WARNING] Rule 0: org.apache.maven.plugins.enforcer.EnforceBytecodeVersion failed with message:
Found Banned Dependency: org.apache.maven.doxia:doxia-module-xdoc:jar:1.7-SNAPSHOT
Found Banned Dependency: org.apache.maven.doxia:doxia-module-fml:jar:1.7-SNAPSHOT
Found Banned Dependency: org.apache.maven.doxia:doxia-core:jar:1.7-SNAPSHOT
Found Banned Dependency: org.apache.maven.doxia:doxia-module-docbook-simple:jar:1.7-SNAPSHOT
Found Banned Dependency: org.apache.maven.doxia:doxia-core:test-jar:tests:1.7-SNAPSHOT
Found Banned Dependency: org.apache.maven.doxia:doxia-module-xhtml:jar:1.7-SNAPSHOT
Found Banned Dependency: org.apache.maven.doxia:doxia-logging-api:jar:1.7-SNAPSHOT
Found Banned Dependency: org.apache.maven.doxia:doxia-module-apt:jar:1.7-SNAPSHOT
Found Banned Dependency: org.apache.maven.doxia:doxia-module-confluence:jar:1.7-SNAPSHOT
Found Banned Dependency: org.apache.maven.doxia:doxia-sink-api:jar:1.7-SNAPSHOT
Use 'mvn dependency:tree' to locate the source of the banned dependencies.
[INFO] ------------------------------------------------------------------------
[INFO] Reactor Summary:
[INFO] 
[INFO] Doxia :: Sitetools ................................ SUCCESS [22.166s]
[INFO] Doxia :: Decoration Model ......................... SUCCESS [12.400s]
[INFO] Doxia :: Document Renderer ........................ FAILURE [36.860s]
[INFO] Doxia :: Site Renderer ............................ FAILURE [9.687s]
[INFO] ------------------------------------------------------------------------
[INFO] BUILD FAILURE
[INFO] ------------------------------------------------------------------------
[INFO] Total time: 1:22.152s
[INFO] Finished at: Thu Oct 22 08:28:05 BST 2015
[INFO] Final Memory: 25M/325M
[INFO] ------------------------------------------------------------------------
[ERROR] Failed to execute goal org.apache.maven.plugins:maven-enforcer-plugin:1.3.1:enforce (enforce-bytecode-version) on project doxia-doc-renderer: Some Enforcer rules have failed. Look above for specific messages explaining why the rule failed. -> [Help 1]
org.apache.maven.lifecycle.LifecycleExecutionException: Failed to execute goal org.apache.maven.plugins:maven-enforcer-plugin:1.3.1:enforce (enforce-bytecode-version) on project doxia-doc-renderer: Some Enforcer rules have failed. Look above for specific messages explaining why the rule failed.
	at org.apache.maven.lifecycle.internal.MojoExecutor.execute(MojoExecutor.java:217)
	at org.apache.maven.lifecycle.internal.MojoExecutor.execute(MojoExecutor.java:153)
	at org.apache.maven.lifecycle.internal.MojoExecutor.execute(MojoExecutor.java:145)
	at org.apache.maven.lifecycle.internal.LifecycleModuleBuilder.buildProject(LifecycleModuleBuilder.java:84)
	at org.apache.maven.lifecycle.internal.LifecycleModuleBuilder.buildProject(LifecycleModuleBuilder.java:59)
	at org.apache.maven.lifecycle.internal.LifecycleStarter.singleThreadedBuild(LifecycleStarter.java:183)
	at org.apache.maven.lifecycle.internal.LifecycleStarter.execute(LifecycleStarter.java:161)
	at org.apache.maven.DefaultMaven.doExecute(DefaultMaven.java:320)
	at org.apache.maven.DefaultMaven.execute(DefaultMaven.java:156)
	at org.apache.maven.cli.MavenCli.execute(MavenCli.java:537)
	at org.apache.maven.cli.MavenCli.doMain(MavenCli.java:196)
	at org.apache.maven.cli.MavenCli.main(MavenCli.java:141)
	at sun.reflect.NativeMethodAccessorImpl.invoke0(Native Method)
	at sun.reflect.NativeMethodAccessorImpl.invoke(NativeMethodAccessorImpl.java:39)
	at sun.reflect.DelegatingMethodAccessorImpl.invoke(DelegatingMethodAccessorImpl.java:25)
	at java.lang.reflect.Method.invoke(Method.java:597)
	at org.codehaus.plexus.classworlds.launcher.Launcher.launchEnhanced(Launcher.java:290)
	at org.codehaus.plexus.classworlds.launcher.Launcher.launch(Launcher.java:230)
	at org.codehaus.plexus.classworlds.launcher.Launcher.mainWithExitCode(Launcher.java:409)
	at org.codehaus.plexus.classworlds.launcher.Launcher.main(Launcher.java:352)
Caused by: org.apache.maven.plugin.MojoExecutionException: Some Enforcer rules have failed. Look above for specific messages explaining why the rule failed.
	at org.apache.maven.plugins.enforcer.EnforceMojo.execute(EnforceMojo.java:209)
	at org.apache.maven.plugin.DefaultBuildPluginManager.executeMojo(DefaultBuildPluginManager.java:101)
	at org.apache.maven.lifecycle.internal.MojoExecutor.execute(MojoExecutor.java:209)
	... 19 more
[ERROR] Failed to execute goal org.apache.maven.plugins:maven-enforcer-plugin:1.3.1:enforce (enforce-bytecode-version) on project doxia-site-renderer: Some Enforcer rules have failed. Look above for specific messages explaining why the rule failed. -> [Help 1]
org.apache.maven.lifecycle.LifecycleExecutionException: Failed to execute goal org.apache.maven.plugins:maven-enforcer-plugin:1.3.1:enforce (enforce-bytecode-version) on project doxia-site-renderer: Some Enforcer rules have failed. Look above for specific messages explaining why the rule failed.
	at org.apache.maven.lifecycle.internal.MojoExecutor.execute(MojoExecutor.java:217)
	at org.apache.maven.lifecycle.internal.MojoExecutor.execute(MojoExecutor.java:153)
	at org.apache.maven.lifecycle.internal.MojoExecutor.execute(MojoExecutor.java:145)
	at org.apache.maven.lifecycle.internal.LifecycleModuleBuilder.buildProject(LifecycleModuleBuilder.java:84)
	at org.apache.maven.lifecycle.internal.LifecycleModuleBuilder.buildProject(LifecycleModuleBuilder.java:59)
	at org.apache.maven.lifecycle.internal.LifecycleStarter.singleThreadedBuild(LifecycleStarter.java:183)
	at org.apache.maven.lifecycle.internal.LifecycleStarter.execute(LifecycleStarter.java:161)
	at org.apache.maven.DefaultMaven.doExecute(DefaultMaven.java:320)
	at org.apache.maven.DefaultMaven.execute(DefaultMaven.java:156)
	at org.apache.maven.cli.MavenCli.execute(MavenCli.java:537)
	at org.apache.maven.cli.MavenCli.doMain(MavenCli.java:196)
	at org.apache.maven.cli.MavenCli.main(MavenCli.java:141)
	at sun.reflect.NativeMethodAccessorImpl.invoke0(Native Method)
	at sun.reflect.NativeMethodAccessorImpl.invoke(NativeMethodAccessorImpl.java:39)
	at sun.reflect.DelegatingMethodAccessorImpl.invoke(DelegatingMethodAccessorImpl.java:25)
	at java.lang.reflect.Method.invoke(Method.java:597)
	at org.codehaus.plexus.classworlds.launcher.Launcher.launchEnhanced(Launcher.java:290)
	at org.codehaus.plexus.classworlds.launcher.Launcher.launch(Launcher.java:230)
	at org.codehaus.plexus.classworlds.launcher.Launcher.mainWithExitCode(Launcher.java:409)
	at org.codehaus.plexus.classworlds.launcher.Launcher.main(Launcher.java:352)
Caused by: org.apache.maven.plugin.MojoExecutionException: Some Enforcer rules have failed. Look above for specific messages explaining why the rule failed.
	at org.apache.maven.plugins.enforcer.EnforceMojo.execute(EnforceMojo.java:209)
	at org.apache.maven.plugin.DefaultBuildPluginManager.executeMojo(DefaultBuildPluginManager.java:101)
	at org.apache.maven.lifecycle.internal.MojoExecutor.execute(MojoExecutor.java:209)
	... 19 more
[ERROR] 
[ERROR] Re-run Maven using the -X switch to enable full debug logging.
[ERROR] 
[ERROR] For more information about the errors and possible solutions, please read the following articles:
[ERROR] [Help 1] http://cwiki.apache.org/confluence/display/MAVEN/MojoExecutionException
[ERROR] 
[ERROR] After correcting the problems, you can resume the build with the command
[ERROR]   mvn <goals> -rf :doxia-doc-renderer
Build step 'Invoke top-level Maven targets' marked build as failure