You are viewing a plain text version of this content. The canonical link for it is here.
Posted to commits@karaf.apache.org by Apache Jenkins Server <je...@builds.apache.org> on 2013/05/31 12:10:54 UTC

Build failed in Jenkins: Karaf-2.2.x #1035

See <https://builds.apache.org/job/Karaf-2.2.x/1035/>

------------------------------------------
[...truncated 2237 lines...]
A         jaas/jasypt/src/test/java/org/apache/karaf/jaas/jasypt/impl
AU        jaas/jasypt/src/test/java/org/apache/karaf/jaas/jasypt/impl/JasyptEncryptionTest.java
A         jaas/jasypt/src/test/java/org/apache/karaf/jaas/jasypt/handler
A         jaas/jasypt/src/test/java/org/apache/karaf/jaas/jasypt/handler/EncryptablePropertyPlaceholderTest.java
A         jaas/jasypt/src/test/resources
A         jaas/jasypt/src/test/resources/org
A         jaas/jasypt/src/test/resources/org/apache
A         jaas/jasypt/src/test/resources/org/apache/karaf
A         jaas/jasypt/src/test/resources/org/apache/karaf/jaas
A         jaas/jasypt/src/test/resources/org/apache/karaf/jaas/jasypt
A         jaas/jasypt/src/test/resources/org/apache/karaf/jaas/jasypt/handler
A         jaas/jasypt/src/test/resources/org/apache/karaf/jaas/jasypt/handler/test.xml
A         jaas/jasypt/src/test/resources/log4j.properties
A         jaas/jasypt/src/main
A         jaas/jasypt/src/main/java
A         jaas/jasypt/src/main/java/org
A         jaas/jasypt/src/main/java/org/apache
A         jaas/jasypt/src/main/java/org/apache/karaf
A         jaas/jasypt/src/main/java/org/apache/karaf/jaas
A         jaas/jasypt/src/main/java/org/apache/karaf/jaas/jasypt
A         jaas/jasypt/src/main/java/org/apache/karaf/jaas/jasypt/impl
AU        jaas/jasypt/src/main/java/org/apache/karaf/jaas/jasypt/impl/JasyptEncryption.java
A         jaas/jasypt/src/main/java/org/apache/karaf/jaas/jasypt/impl/JasyptEncryptionService.java
A         jaas/jasypt/src/main/java/org/apache/karaf/jaas/jasypt/handler
A         jaas/jasypt/src/main/java/org/apache/karaf/jaas/jasypt/handler/EncryptablePropertyPlaceholder.java
A         jaas/jasypt/src/main/java/org/apache/karaf/jaas/jasypt/handler/NamespaceHandler.java
A         jaas/jasypt/src/main/resources
A         jaas/jasypt/src/main/resources/org
A         jaas/jasypt/src/main/resources/org/apache
A         jaas/jasypt/src/main/resources/org/apache/karaf
A         jaas/jasypt/src/main/resources/org/apache/karaf/jaas
A         jaas/jasypt/src/main/resources/org/apache/karaf/jaas/jasypt
A         jaas/jasypt/src/main/resources/org/apache/karaf/jaas/jasypt/handler
A         jaas/jasypt/src/main/resources/org/apache/karaf/jaas/jasypt/handler/karaf-jasypt-1.0.0.xsd
A         jaas/jasypt/src/main/resources/OSGI-INF
A         jaas/jasypt/src/main/resources/OSGI-INF/bundle.info
A         jaas/jasypt/src/main/resources/OSGI-INF/blueprint
AU        jaas/jasypt/src/main/resources/OSGI-INF/blueprint/karaf-jaas-jasypt.xml
AU        jaas/jasypt/pom.xml
A         jaas/pom.xml
A         jaas/command
A         jaas/command/NOTICE
A         jaas/command/src
A         jaas/command/src/main
A         jaas/command/src/main/java
A         jaas/command/src/main/java/org
A         jaas/command/src/main/java/org/apache
A         jaas/command/src/main/java/org/apache/karaf
A         jaas/command/src/main/java/org/apache/karaf/jaas
A         jaas/command/src/main/java/org/apache/karaf/jaas/command
A         jaas/command/src/main/java/org/apache/karaf/jaas/command/ListPendingCommand.java
A         jaas/command/src/main/java/org/apache/karaf/jaas/command/UserDeleteCommand.java
A         jaas/command/src/main/java/org/apache/karaf/jaas/command/UpdateCommand.java
A         jaas/command/src/main/java/org/apache/karaf/jaas/command/RoleDeleteCommand.java
A         jaas/command/src/main/java/org/apache/karaf/jaas/command/CancelCommand.java
A         jaas/command/src/main/java/org/apache/karaf/jaas/command/UserAddCommand.java
A         jaas/command/src/main/java/org/apache/karaf/jaas/command/ManageRealmCommand.java
A         jaas/command/src/main/java/org/apache/karaf/jaas/command/RoleAddCommand.java
A         jaas/command/src/main/java/org/apache/karaf/jaas/command/JaasCommandSupport.java
A         jaas/command/src/main/java/org/apache/karaf/jaas/command/ListUsersCommand.java
A         jaas/command/src/main/java/org/apache/karaf/jaas/command/completers
A         jaas/command/src/main/java/org/apache/karaf/jaas/command/completers/LoginModuleNameCompleter.java
A         jaas/command/src/main/java/org/apache/karaf/jaas/command/completers/RealmCompleter.java
A         jaas/command/src/main/java/org/apache/karaf/jaas/command/ListRealmsCommand.java
A         jaas/command/src/main/resources
A         jaas/command/src/main/resources/OSGI-INF
A         jaas/command/src/main/resources/OSGI-INF/bundle.info
A         jaas/command/src/main/resources/OSGI-INF/blueprint
A         jaas/command/src/main/resources/OSGI-INF/blueprint/jaas-command.xml
A         jaas/command/pom.xml
 U        .
At revision 1488137
no change for https://svn.apache.org/repos/asf/karaf/branches/karaf-2.2.x since the previous build
Parsing POMs
Modules changed, recalculating dependency graph
[karaf] $ /home/hudson/tools/java/latest1.5/bin/java -cp /home/jenkins/jenkins-slave/maven-agent.jar:/home/jenkins/jenkins-slave/classworlds.jar hudson.maven.agent.Main /home/hudson/tools/maven/apache-maven-2.2.1 /home/jenkins/jenkins-slave/slave.jar /home/jenkins/jenkins-slave/maven-interceptor.jar 43525 /home/jenkins/jenkins-slave/maven2.1-interceptor.jar
<===[JENKINS REMOTING CAPACITY]===>channel started
   log4j:WARN No appenders could be found for logger (org.apache.commons.beanutils.converters.BooleanConverter).
log4j:WARN Please initialize the log4j system properly.
Executing Maven:  -B -f <https://builds.apache.org/job/Karaf-2.2.x/ws/karaf/pom.xml> -Dmaven.repo.local=<https://builds.apache.org/job/Karaf-2.2.x/ws/.repository> -B -e clean install deploy+ Error stacktraces are turned on.

[INFO] Scanning for projects...
[INFO] Reactor build order: 
[INFO]   Apache Karaf
[INFO]   Apache Karaf :: Util
[INFO]   Apache Karaf :: Main
[INFO]   Apache Karaf :: JAAS
[INFO]   Apache Karaf :: JAAS :: Boot
[INFO]   Apache Karaf :: JAAS :: Config
[INFO]   Apache Karaf :: JAAS :: Modules
[INFO]   Apache Karaf :: Shell
[INFO]   Apache Karaf :: Shell :: Console
[INFO]   Apache Karaf :: Shell :: OBR Commands
[INFO]   Apache Karaf :: Features
[INFO]   Apache Karaf :: Features :: Core
[INFO]   Apache Karaf :: Features :: Command
[INFO]   Apache Karaf :: Management
[INFO]   Apache Karaf :: Management
[INFO]   Apache Karaf :: Features :: Management
[INFO]   Apache Karaf :: Features :: OBR Resolver
[INFO]   Apache Karaf :: Admin
[INFO]   Apache Karaf :: Admin :: Core
[INFO]   Apache Karaf :: Admin :: Command
[INFO]   Apache Karaf :: Admin :: Management
[INFO]   Apache Karaf :: Deployer
[INFO]   Apache Karaf :: Deployer :: Spring
[INFO]   Apache Karaf :: Deployer :: Blueprint
[INFO]   Apache Karaf :: Deployer :: Features
[INFO]   Apache Karaf :: Deployer :: Karaf Archive (.kar)
[INFO]   Apache Karaf :: Deployer :: Wrap Non OSGi Jar
[INFO]   Apache Karaf :: Shell :: Various Commands
[INFO]   Apache Karaf :: Shell :: ConfigAdmin Commands
[INFO]   Apache Karaf :: Shell :: Log Commands
[INFO]   Apache Karaf :: Shell :: OSGi Commands
[INFO]   Apache Karaf :: Shell :: PackageAdmin Commands
[INFO]   Apache Karaf :: Shell :: SSH
[INFO]   Apache Karaf :: Shell :: Service Wrapper
[INFO]   Apache Karaf :: Shell :: Development Commands
[INFO]   Apache Karaf :: Shell :: Web Commands
[INFO]   Apache Karaf :: JAAS :: Jasypt Encryption
[INFO]   Apache Karaf :: Jaas :: Command
[INFO]   Apache Karaf :: Client
[INFO]   Apache Karaf :: Management :: MBeans
[INFO]   Apache Karaf :: Management :: MBeans :: Bundles
[INFO]   Apache Karaf :: Management :: MBeans :: Services
[INFO]   Apache Karaf :: Management :: MBeans :: System
[INFO]   Apache Karaf :: Management :: MBeans :: Packages
[INFO]   Apache Karaf :: Management :: MBeans :: Config
[INFO]   Apache Karaf :: Management :: MBeans :: Dev
[INFO]   Apache Karaf :: Management :: MBeans :: Log
[INFO]   Apache Karaf :: Management :: MBeans :: OBR
[INFO]   Apache Karaf :: Management :: MBeans :: Web
[INFO]   Apache Karaf :: Web Console
[INFO]   Apache Karaf :: Web Console :: Console
[INFO]   Apache Karaf :: Web Console :: Branding
[INFO]   Apache Karaf :: Web Console :: Features Plugin
[INFO]   Apache Karaf :: Web Console :: Gogo Plugin
[INFO]   Apache Karaf :: Web Console :: Admin Plugin
[INFO]   Apache Karaf :: Exception
[INFO]   Apache Karaf :: Assemblies
[INFO]   Apache Karaf :: Assemblies :: Features
[INFO]   Apache Karaf :: Assemblies :: Features :: Standard
[INFO]   Apache Karaf :: Assemblies :: Features :: Enterprise
[INFO]   Apache Karaf :: Diagnostic
[INFO]   Apache Karaf :: Diagnostic :: Core
[INFO]   Apache Karaf :: Diagnostic :: Common
[INFO]   Apache Karaf :: Diagnostic :: Command
[INFO]   Apache Karaf :: Diagnostic :: Management
[INFO]   Apache Karaf :: Tooling
[INFO]   Apache Karaf :: Tooling :: Maven2 Features plugin
[INFO]   Apache Karaf :: Assembly
[INFO]   Apache Karaf :: Demos
[INFO]   Apache Karaf :: Demos :: Web
[INFO]   Apache Karaf :: Demos :: Branding
[INFO]   Apache Karaf :: Demos :: Branding :: Shell
[INFO]   Apache Karaf :: Demos :: Demo Dump provider
[INFO]   Apache Karaf :: Demos :: Extend Console Command
[INFO]   Apache Karaf :: Demos :: Deployer
[INFO]   Apache Karaf :: Demos :: Deployer :: Kar
[INFO]   Apache Karaf :: Demos :: Deployer :: Wrap Bundle osgi.commons-lang
[INFO]   Apache Karaf :: Demos :: Deployer :: Bundle
[INFO]   Apache Karaf :: Demos :: Deployer :: Feature
[INFO]   Apache Karaf :: Integration Tests
[INFO]   Apache Karaf :: Integration Tests :: Dependencies
[INFO]   Apache Karaf :: Tooling :: Testing environment
[INFO]   Apache Karaf :: Integration Tests :: ITests
[INFO]   Apache Karaf :: Integration Tests :: Kit Tests
[INFO]   Apache Karaf :: Tooling :: Maven2 Command Help plugin
[INFO]   Apache Karaf :: Archetypes
[INFO]   Apache Karaf :: Archetypes :: Assembly Archetype
[INFO]   Apache Karaf :: Archetypes :: Blueprint Archetype
[INFO]   Apache Karaf :: Archetypes :: Bundle Archetype
[INFO]   Apache Karaf :: Archetypes :: Command Archetype
[INFO]   Apache Karaf :: Archetypes :: Feature Archetype
[INFO]   Apache Karaf :: Archetypes :: Kar Archetype
[WARNING] POM for 'biz.aQute:bndlib:pom:1.50.0:runtime' is invalid.

Its dependencies (if any) will NOT be available to the current build.
[WARNING] POM for 'biz.aQute:bndlib:pom:1.15.0:runtime' is invalid.

Its dependencies (if any) will NOT be available to the current build.
[INFO] ------------------------------------------------------------------------
[INFO] Building Apache Karaf
[INFO]    task-segment: [clean, install, deploy]
[INFO] ------------------------------------------------------------------------
May 31, 2013 10:05:22 AM hudson.remoting.SynchronousCommandTransport$ReaderThread run
SEVERE: I/O error in channel channel
java.io.StreamCorruptedException
	at java.io.ObjectInputStream.readObject0(ObjectInputStream.java:1332)
	at java.io.ObjectInputStream.readObject(ObjectInputStream.java:348)
	at hudson.remoting.Command.readFrom(Command.java:92)
	at hudson.remoting.ClassicCommandTransport.read(ClassicCommandTransport.java:59)
	at hudson.remoting.SynchronousCommandTransport$ReaderThread.run(SynchronousCommandTransport.java:48)
channel stopped
[INFO] ------------------------------------------------------------------------
[ERROR] FATAL ERROR
[INFO] ------------------------------------------------------------------------
[INFO] null
[INFO] ------------------------------------------------------------------------
[INFO] Trace
java.lang.reflect.UndeclaredThrowableException
	at $Proxy1.fetch2(Unknown Source)
	at hudson.remoting.RemoteClassLoader.findClass(RemoteClassLoader.java:127)
	at java.lang.ClassLoader.loadClass(ClassLoader.java:307)
	at java.lang.ClassLoader.loadClass(ClassLoader.java:252)
	at java.lang.ClassLoader.loadClassInternal(ClassLoader.java:320)
	at hudson.maven.reporters.MavenArtifactArchiver.postBuild(MavenArtifactArchiver.java:101)
	at hudson.maven.Maven2Builder.postModule(Maven2Builder.java:129)
	at hudson.maven.MavenBuilder$Adapter.fireLeaveModule(MavenBuilder.java:354)
	at hudson.maven.MavenBuilder$Adapter.postBuild(MavenBuilder.java:308)
	at org.apache.maven.lifecycle.LifecycleExecutorInterceptor.execute(LifecycleExecutorInterceptor.java:68)
	at org.apache.maven.DefaultMaven.doExecute(DefaultMaven.java:328)
	at org.apache.maven.DefaultMaven.execute(DefaultMaven.java:138)
	at org.apache.maven.cli.MavenCli.main(MavenCli.java:362)
	at sun.reflect.NativeMethodAccessorImpl.invoke0(Native Method)
	at sun.reflect.NativeMethodAccessorImpl.invoke(NativeMethodAccessorImpl.java:39)
	at sun.reflect.DelegatingMethodAccessorImpl.invoke(DelegatingMethodAccessorImpl.java:25)
	at java.lang.reflect.Method.invoke(Method.java:592)
	at org.codehaus.classworlds.Launcher.launchEnhanced(Launcher.java:315)
	at org.codehaus.classworlds.Launcher.launch(Launcher.java:255)
	at hudson.maven.agent.Main.launch(Main.java:185)
	at hudson.maven.MavenBuilder.call(MavenBuilder.java:154)
	at hudson.maven.Maven2Builder.call(Maven2Builder.java:79)
	at hudson.maven.Maven2Builder.call(Maven2Builder.java:55)
	at hudson.remoting.UserRequest.perform(UserRequest.java:118)
	at hudson.remoting.UserRequest.perform(UserRequest.java:48)
	at hudson.remoting.Request$2.run(Request.java:326)
	at hudson.remoting.InterceptingExecutorService$1.call(InterceptingExecutorService.java:72)
	at java.util.concurrent.FutureTask$Sync.innerRun(FutureTask.java:269)
	at java.util.concurrent.FutureTask.run(FutureTask.java:123)
	at java.util.concurrent.ThreadPoolExecutor$Worker.runTask(ThreadPoolExecutor.java:651)
	at java.util.concurrent.ThreadPoolExecutor$Worker.run(ThreadPoolExecutor.java:676)
	at java.lang.Thread.run(Thread.java:595)
Caused by: hudson.remoting.ChannelClosedException: channel is already closed
	at hudson.remoting.Channel.send(Channel.java:494)
	at hudson.remoting.Request.call(Request.java:129)
	at hudson.remoting.RemoteInvocationHandler.invoke(RemoteInvocationHandler.java:160)
	... 32 more
Caused by: java.io.StreamCorruptedException
	at java.io.ObjectInputStream.readObject0(ObjectInputStream.java:1332)
	at java.io.ObjectInputStream.readObject(ObjectInputStream.java:348)
	at hudson.remoting.Command.readFrom(Command.java:92)
	at hudson.remoting.ClassicCommandTransport.read(ClassicCommandTransport.java:59)
	at hudson.remoting.SynchronousCommandTransport$ReaderThread.run(SynchronousCommandTransport.java:48)
[INFO] ------------------------------------------------------------------------
[INFO] Total time: 10 seconds
[INFO] Finished at: Fri May 31 10:05:22 UTC 2013
ERROR: Maven JVM terminated unexpectedly with exit code 0


Jenkins build is back to normal : Karaf-2.2.x #1037

Posted by Apache Jenkins Server <je...@builds.apache.org>.
See <https://builds.apache.org/job/Karaf-2.2.x/1037/>


Build failed in Jenkins: Karaf-2.2.x #1036

Posted by Apache Jenkins Server <je...@builds.apache.org>.
See <https://builds.apache.org/job/Karaf-2.2.x/1036/>

------------------------------------------
[...truncated 2387 lines...]
[INFO]   Apache Karaf :: Assembly
[INFO]   Apache Karaf :: Demos
[INFO]   Apache Karaf :: Demos :: Web
[INFO]   Apache Karaf :: Demos :: Branding
[INFO]   Apache Karaf :: Demos :: Branding :: Shell
[INFO]   Apache Karaf :: Demos :: Demo Dump provider
[INFO]   Apache Karaf :: Demos :: Extend Console Command
[INFO]   Apache Karaf :: Demos :: Deployer
[INFO]   Apache Karaf :: Demos :: Deployer :: Kar
[INFO]   Apache Karaf :: Demos :: Deployer :: Wrap Bundle osgi.commons-lang
[INFO]   Apache Karaf :: Demos :: Deployer :: Bundle
[INFO]   Apache Karaf :: Demos :: Deployer :: Feature
[INFO]   Apache Karaf :: Integration Tests
[INFO]   Apache Karaf :: Integration Tests :: Dependencies
[INFO]   Apache Karaf :: Tooling :: Testing environment
[INFO]   Apache Karaf :: Integration Tests :: ITests
[INFO]   Apache Karaf :: Integration Tests :: Kit Tests
[INFO]   Apache Karaf :: Tooling :: Maven2 Command Help plugin
[INFO]   Apache Karaf :: Archetypes
[INFO]   Apache Karaf :: Archetypes :: Assembly Archetype
[INFO]   Apache Karaf :: Archetypes :: Blueprint Archetype
[INFO]   Apache Karaf :: Archetypes :: Bundle Archetype
[INFO]   Apache Karaf :: Archetypes :: Command Archetype
[INFO]   Apache Karaf :: Archetypes :: Feature Archetype
[INFO]   Apache Karaf :: Archetypes :: Kar Archetype
[WARNING] POM for 'biz.aQute:bndlib:pom:1.50.0:runtime' is invalid.

Its dependencies (if any) will NOT be available to the current build.
[WARNING] POM for 'biz.aQute:bndlib:pom:1.15.0:runtime' is invalid.

Its dependencies (if any) will NOT be available to the current build.
[INFO] ------------------------------------------------------------------------
[INFO] Building Apache Karaf
[INFO]    task-segment: [clean, install, deploy]
[INFO] ------------------------------------------------------------------------
[INFO] [clean:clean {execution: default-clean}]
[INFO] [bundle:cleanVersions {execution: cleanVersions}]
[WARNING] The parameter expression: 'project.build.resources' used in mojo: 'process' has been deprecated. Use 'project.resources' instead.
[INFO] [remote-resources:process {execution: default}]
[INFO] [antrun:run {execution: copy-notice}]
[INFO] Executing tasks

main:
     [copy] Copying 1 file to <https://builds.apache.org/job/Karaf-2.2.x/ws/karaf/target/maven-shared-archive-resources/META-INF>
[INFO] Executed tasks
[INFO] [site:attach-descriptor {execution: default-attach-descriptor}]
[INFO] [install:install {execution: default-install}]
[INFO] Installing <https://builds.apache.org/job/Karaf-2.2.x/ws/karaf/pom.xml> to <https://builds.apache.org/job/Karaf-2.2.x/ws/.repository/org/apache/karaf/karaf/2.2.12-SNAPSHOT/karaf-2.2.12-SNAPSHOT.pom>
[INFO] [bundle:cleanVersions {execution: cleanVersions}]
[WARNING] The parameter expression: 'project.build.resources' used in mojo: 'process' has been deprecated. Use 'project.resources' instead.
[INFO] [remote-resources:process {execution: default}]
[INFO] [antrun:run {execution: copy-notice}]
[INFO] Executing tasks

main:
     [copy] Copying 1 file to <https://builds.apache.org/job/Karaf-2.2.x/ws/karaf/target/maven-shared-archive-resources/META-INF>
[INFO] Executed tasks
[INFO] [site:attach-descriptor {execution: default-attach-descriptor}]
[INFO] [install:install {execution: default-install}]
[INFO] Installing <https://builds.apache.org/job/Karaf-2.2.x/ws/karaf/pom.xml> to <https://builds.apache.org/job/Karaf-2.2.x/ws/.repository/org/apache/karaf/karaf/2.2.12-SNAPSHOT/karaf-2.2.12-SNAPSHOT.pom>
[INFO] [deploy:deploy {execution: default-deploy}]
[INFO] Retrieving previous build number from apache.snapshots.https
[WARNING] *** CHECKSUM FAILED - Checksum failed on download: local = '50c7856252a7ab318e2a24871b9f161823376f56'; remote = 'b5d28ac3aebe92eda37abc624072c32124a4e00a' - RETRYING
[WARNING] *** CHECKSUM FAILED - Checksum failed on download: local = '50c7856252a7ab318e2a24871b9f161823376f56'; remote = 'b5d28ac3aebe92eda37abc624072c32124a4e00a' - IGNORING
Uploading: https://repository.apache.org/content/repositories/snapshots/org/apache/karaf/karaf/2.2.12-SNAPSHOT/karaf-2.2.12-20130601.071908-33.pom
68K uploaded  (karaf-2.2.12-20130601.071908-33.pom)
[INFO] Retrieving previous metadata from apache.snapshots.https
[WARNING] *** CHECKSUM FAILED - Checksum failed on download: local = '50c7856252a7ab318e2a24871b9f161823376f56'; remote = 'b5d28ac3aebe92eda37abc624072c32124a4e00a' - RETRYING
[WARNING] *** CHECKSUM FAILED - Checksum failed on download: local = '50c7856252a7ab318e2a24871b9f161823376f56'; remote = 'b5d28ac3aebe92eda37abc624072c32124a4e00a' - IGNORING
[INFO] Uploading repository metadata for: 'snapshot org.apache.karaf:karaf:2.2.12-SNAPSHOT'
[INFO] Retrieving previous metadata from apache.snapshots.https
[INFO] Uploading repository metadata for: 'artifact org.apache.karaf:karaf'
[JENKINS] Archiving <https://builds.apache.org/job/Karaf-2.2.x/ws/karaf/pom.xml> to /home/hudson/hudson/jobs/Karaf-2.2.x/modules/org.apache.karaf$karaf/builds/2013-06-01_07-17-58/archive/org.apache.karaf/karaf/2.2.12-SNAPSHOT/karaf-2.2.12-SNAPSHOT.pom
[JENKINS] Archiving <https://builds.apache.org/job/Karaf-2.2.x/ws/.repository/org/apache/karaf/karaf/2.2.12-SNAPSHOT/karaf-2.2.12-SNAPSHOT.pom> to /home/hudson/hudson/jobs/Karaf-2.2.x/modules/org.apache.karaf$karaf/builds/2013-06-01_07-17-58/archive/org.apache.karaf/karaf/2.2.12-20130601.071908-33/karaf-2.2.12-20130601.071908-33.pom
[INFO] ------------------------------------------------------------------------
[INFO] Building Apache Karaf :: Util
[INFO]    task-segment: [clean, install, deploy]
[INFO] ------------------------------------------------------------------------
[INFO] [clean:clean {execution: default-clean}]
[INFO] [bundle:cleanVersions {execution: cleanVersions}]
[WARNING] The parameter expression: 'project.build.resources' used in mojo: 'process' has been deprecated. Use 'project.resources' instead.
[INFO] [remote-resources:process {execution: default}]
[INFO] [antrun:run {execution: copy-notice}]
[INFO] Executing tasks

main:
     [copy] Copying 1 file to <https://builds.apache.org/job/Karaf-2.2.x/ws/karaf/util/target/maven-shared-archive-resources/META-INF>
[INFO] Executed tasks
[debug] execute contextualize
[INFO] [resources:resources {execution: default-resources}]
[INFO] Using 'UTF-8' encoding to copy filtered resources.
[INFO] skip non existing resourceDirectory <https://builds.apache.org/job/Karaf-2.2.x/ws/karaf/util/src/main/resources>
[INFO] Copying 3 resources
[INFO] [compiler:compile {execution: default-compile}]
[INFO] Compiling 6 source files to <https://builds.apache.org/job/Karaf-2.2.x/ws/karaf/util/target/classes>
[debug] execute contextualize
[INFO] [resources:testResources {execution: default-testResources}]
[INFO] Using 'UTF-8' encoding to copy filtered resources.
[INFO] Copying 1 resource
[INFO] Copying 3 resources
[INFO] [compiler:testCompile {execution: default-testCompile}]
[INFO] Compiling 2 source files to <https://builds.apache.org/job/Karaf-2.2.x/ws/karaf/util/target/test-classes>
[INFO] [surefire:test {execution: default-test}]
[INFO] Surefire report directory: <https://builds.apache.org/job/Karaf-2.2.x/ws/karaf/util/target/surefire-reports>

-------------------------------------------------------
 T E S T S
-------------------------------------------------------
Running org.apache.karaf.util.PropertiesTest
# 
# The Main  
# 
# Comment 
# 

# Another comment

# A value comment
key1 = val1

# Another value comment
key2 = ${key1}/foo

# A third comment
key3 = val3

=====
# 
# The Main  
# 
# Comment 
# 

# Another comment

# A value comment
key1 = val1

# Another value comment
key2 = ${key1}/foo

# A third comment
key3 = foo

=====
Tests run: 2, Failures: 0, Errors: 0, Skipped: 0, Time elapsed: 0.036 sec
Running org.apache.karaf.util.DeployerUtilsTest
Tests run: 1, Failures: 0, Errors: 0, Skipped: 0, Time elapsed: 0 sec

Results :

Tests run: 3, Failures: 0, Errors: 0, Skipped: 0

[JENKINS] Recording test results
[INFO] [jar:jar {execution: default-jar}]
[INFO] Building jar: <https://builds.apache.org/job/Karaf-2.2.x/ws/karaf/util/target/org.apache.karaf.util-2.2.12-SNAPSHOT.jar>
[INFO] [install:install {execution: default-install}]
[INFO] Installing <https://builds.apache.org/job/Karaf-2.2.x/ws/karaf/util/target/org.apache.karaf.util-2.2.12-SNAPSHOT.jar> to <https://builds.apache.org/job/Karaf-2.2.x/ws/.repository/org/apache/karaf/org.apache.karaf.util/2.2.12-SNAPSHOT/org.apache.karaf.util-2.2.12-SNAPSHOT.jar>
[INFO] [bundle:cleanVersions {execution: cleanVersions}]
[WARNING] The parameter expression: 'project.build.resources' used in mojo: 'process' has been deprecated. Use 'project.resources' instead.
[INFO] [remote-resources:process {execution: default}]
[INFO] [antrun:run {execution: copy-notice}]
[INFO] Executing tasks

main:
     [copy] Copying 1 file to <https://builds.apache.org/job/Karaf-2.2.x/ws/karaf/util/target/maven-shared-archive-resources/META-INF>
[INFO] Executed tasks
[debug] execute contextualize
[INFO] [resources:resources {execution: default-resources}]
[INFO] Using 'UTF-8' encoding to copy filtered resources.
[INFO] skip non existing resourceDirectory <https://builds.apache.org/job/Karaf-2.2.x/ws/karaf/util/src/main/resources>
[INFO] Copying 3 resources
[INFO] Copying 3 resources
[INFO] [compiler:compile {execution: default-compile}]
[INFO] Nothing to compile - all classes are up to date
[debug] execute contextualize
[INFO] [resources:testResources {execution: default-testResources}]
[INFO] Using 'UTF-8' encoding to copy filtered resources.
[INFO] Copying 1 resource
[INFO] Copying 3 resources
[INFO] Copying 3 resources
[INFO] [compiler:testCompile {execution: default-testCompile}]
[INFO] Nothing to compile - all classes are up to date
[INFO] [surefire:test {execution: default-test}]
[INFO] Skipping execution of surefire because it has already been run for this configuration
[JENKINS] Recording test results
Jun 1, 2013 7:19:33 AM hudson.remoting.SynchronousCommandTransport$ReaderThread run
SEVERE: I/O error in channel channel
java.io.StreamCorruptedException
	at java.io.ObjectInputStream.readObject0(ObjectInputStream.java:1332)
	at java.io.ObjectInputStream.readObject(ObjectInputStream.java:348)
	at hudson.remoting.Command.readFrom(Command.java:92)
	at hudson.remoting.ClassicCommandTransport.read(ClassicCommandTransport.java:59)
	at hudson.remoting.SynchronousCommandTransport$ReaderThread.run(SynchronousCommandTransport.java:48)
channel stopped
[INFO] ------------------------------------------------------------------------
[ERROR] FATAL ERROR
[INFO] ------------------------------------------------------------------------
[INFO] null
[INFO] ------------------------------------------------------------------------
[INFO] Trace
java.lang.reflect.UndeclaredThrowableException
	at $Proxy2.isArchivingDisabled(Unknown Source)
	at hudson.maven.MavenBuildProxy$Filter.isArchivingDisabled(MavenBuildProxy.java:227)
	at hudson.maven.reporters.MavenArtifact.archive(MavenArtifact.java:223)
	at hudson.maven.reporters.MavenArtifactArchiver.postBuild(MavenArtifactArchiver.java:108)
	at hudson.maven.Maven2Builder.postModule(Maven2Builder.java:129)
	at hudson.maven.MavenBuilder$Adapter.fireLeaveModule(MavenBuilder.java:354)
	at hudson.maven.MavenBuilder$Adapter.postBuild(MavenBuilder.java:308)
	at org.apache.maven.lifecycle.LifecycleExecutorInterceptor.execute(LifecycleExecutorInterceptor.java:68)
	at org.apache.maven.DefaultMaven.doExecute(DefaultMaven.java:328)
	at org.apache.maven.DefaultMaven.execute(DefaultMaven.java:138)
	at org.apache.maven.cli.MavenCli.main(MavenCli.java:362)
	at sun.reflect.NativeMethodAccessorImpl.invoke0(Native Method)
	at sun.reflect.NativeMethodAccessorImpl.invoke(NativeMethodAccessorImpl.java:39)
	at sun.reflect.DelegatingMethodAccessorImpl.invoke(DelegatingMethodAccessorImpl.java:25)
	at java.lang.reflect.Method.invoke(Method.java:592)
	at org.codehaus.classworlds.Launcher.launchEnhanced(Launcher.java:315)
	at org.codehaus.classworlds.Launcher.launch(Launcher.java:255)
	at hudson.maven.agent.Main.launch(Main.java:185)
	at hudson.maven.MavenBuilder.call(MavenBuilder.java:154)
	at hudson.maven.Maven2Builder.call(Maven2Builder.java:79)
	at hudson.maven.Maven2Builder.call(Maven2Builder.java:55)
	at hudson.remoting.UserRequest.perform(UserRequest.java:118)
	at hudson.remoting.UserRequest.perform(UserRequest.java:48)
	at hudson.remoting.Request$2.run(Request.java:326)
	at hudson.remoting.InterceptingExecutorService$1.call(InterceptingExecutorService.java:72)
	at java.util.concurrent.FutureTask$Sync.innerRun(FutureTask.java:269)
	at java.util.concurrent.FutureTask.run(FutureTask.java:123)
	at java.util.concurrent.ThreadPoolExecutor$Worker.runTask(ThreadPoolExecutor.java:651)
	at java.util.concurrent.ThreadPoolExecutor$Worker.run(ThreadPoolExecutor.java:676)
	at java.lang.Thread.run(Thread.java:595)
Caused by: hudson.remoting.ChannelClosedException: channel is already closed
	at hudson.remoting.Channel.send(Channel.java:494)
	at hudson.remoting.Request.call(Request.java:129)
	at hudson.remoting.Channel.call(Channel.java:672)
	at hudson.remoting.RemoteInvocationHandler.invoke(RemoteInvocationHandler.java:158)
	... 30 more
Caused by: java.io.StreamCorruptedException
	at java.io.ObjectInputStream.readObject0(ObjectInputStream.java:1332)
	at java.io.ObjectInputStream.readObject(ObjectInputStream.java:348)
	at hudson.remoting.Command.readFrom(Command.java:92)
	at hudson.remoting.ClassicCommandTransport.read(ClassicCommandTransport.java:59)
	at hudson.remoting.SynchronousCommandTransport$ReaderThread.run(SynchronousCommandTransport.java:48)
[INFO] ------------------------------------------------------------------------
[INFO] Total time: 51 seconds
[INFO] Finished at: Sat Jun 01 07:19:33 UTC 2013
ERROR: Maven JVM terminated unexpectedly with exit code 0