You are viewing a plain text version of this content. The canonical link for it is here.
Posted to builds@beam.apache.org by Apache Jenkins Server <je...@builds.apache.org> on 2020/02/03 14:47:49 UTC
Build failed in Jenkins: beam_PostCommit_Java_PortabilityApi #4008
See <https://builds.apache.org/job/beam_PostCommit_Java_PortabilityApi/4008/display/redirect>
Changes:
------------------------------------------
[...truncated 36.27 KB...]
Resolving github.com/xordataexchange/crypt: commit='b2862e3d0a775f18c7cfe02273500ae307b61218', urls=[https://github.com/xordataexchange/crypt.git, git@github.com:xordataexchange/crypt.git]
Resolving go.opencensus.io: commit='aa2b39d1618ef56ba156f27cfcdae9042f68f0bc', urls=[https://github.com/census-instrumentation/opencensus-go]
> Task :sdks:java:core:shadowJar
> Task :sdks:java:extensions:protobuf:extractIncludeProto
> Task :sdks:java:extensions:protobuf:generateProto NO-SOURCE
> Task :vendor:sdks-java-extensions-protobuf:compileJava FROM-CACHE
> Task :vendor:sdks-java-extensions-protobuf:classes UP-TO-DATE
> Task :sdks:java:io:common:compileTestJava FROM-CACHE
> Task :sdks:java:io:common:testClasses UP-TO-DATE
> Task :sdks:java:extensions:google-cloud-platform-core:compileJava FROM-CACHE
> Task :sdks:java:extensions:google-cloud-platform-core:classes UP-TO-DATE
> Task :sdks:java:io:kafka:compileJava FROM-CACHE
> Task :sdks:java:io:kafka:classes UP-TO-DATE
> Task :runners:local-java:compileJava FROM-CACHE
> Task :runners:local-java:classes UP-TO-DATE
> Task :vendor:sdks-java-extensions-protobuf:shadowJar
> Task :runners:core-construction-java:compileJava FROM-CACHE
> Task :runners:core-construction-java:classes UP-TO-DATE
> Task :sdks:java:fn-execution:compileJava FROM-CACHE
> Task :sdks:java:fn-execution:classes UP-TO-DATE
> Task :sdks:java:io:common:testJar
> Task :runners:local-java:jar
> Task :sdks:java:extensions:google-cloud-platform-core:jar
> Task :sdks:java:io:kafka:jar
> Task :sdks:java:fn-execution:jar
> Task :sdks:java:testing:test-utils:compileJava FROM-CACHE
> Task :sdks:java:testing:test-utils:classes UP-TO-DATE
> Task :sdks:java:testing:test-utils:jar
> Task :sdks:java:testing:test-utils:compileTestJava FROM-CACHE
> Task :sdks:java:testing:test-utils:testClasses UP-TO-DATE
> Task :runners:core-construction-java:jar
> Task :sdks:java:testing:test-utils:testJar
> Task :sdks:java:extensions:protobuf:compileJava FROM-CACHE
> Task :sdks:java:extensions:protobuf:classes UP-TO-DATE
> Task :sdks:java:extensions:protobuf:jar
> Task :runners:core-java:compileJava FROM-CACHE
> Task :runners:core-java:classes UP-TO-DATE
> Task :runners:core-java:jar
> Task :sdks:java:io:google-cloud-platform:compileJava FROM-CACHE
> Task :sdks:java:io:google-cloud-platform:classes UP-TO-DATE
> Task :sdks:java:harness:compileJava FROM-CACHE
> Task :sdks:java:harness:classes UP-TO-DATE
> Task :sdks:go:resolveBuildDependencies
Resolving golang.org/x/crypto: commit='d9133f5469342136e669e85192a26056b587f503', urls=[https://go.googlesource.com/crypto]
> Task :sdks:java:io:google-cloud-platform:jar
> Task :examples:java:compileJava FROM-CACHE
> Task :examples:java:classes UP-TO-DATE
> Task :runners:google-cloud-dataflow-java:compileJava FROM-CACHE
> Task :runners:google-cloud-dataflow-java:classes
> Task :examples:java:jar
> Task :runners:google-cloud-dataflow-java:jar
> Task :examples:java:compileTestJava FROM-CACHE
> Task :examples:java:testClasses
> Task :examples:java:testJar
> Task :sdks:java:core:compileTestJava FROM-CACHE
> Task :sdks:java:core:testClasses
> Task :sdks:go:resolveBuildDependencies
Resolving golang.org/x/debug: commit='95515998a8a4bd7448134b2cb5971dbeb12e0b77', urls=[https://go.googlesource.com/debug]
Resolving golang.org/x/net: commit='2fb46b16b8dda405028c50f7c7f0f9dd1fa6bfb1', urls=[https://go.googlesource.com/net]
Resolving golang.org/x/oauth2: commit='a032972e28060ca4f5644acffae3dfc268cc09db', urls=[https://go.googlesource.com/oauth2]
Resolving golang.org/x/sync: commit='fd80eb99c8f653c847d294a001bdf2a3a6f768f5', urls=[https://go.googlesource.com/sync]
> Task :sdks:java:core:shadowTestJar
> Task :sdks:java:extensions:google-cloud-platform-core:compileTestJava FROM-CACHE
> Task :sdks:java:extensions:google-cloud-platform-core:testClasses UP-TO-DATE
> Task :sdks:java:extensions:google-cloud-platform-core:testJar
> Task :sdks:go:resolveBuildDependencies
Resolving golang.org/x/sys: commit='37707fdb30a5b38865cfb95e5aab41707daec7fd', urls=[https://go.googlesource.com/sys]
Resolving cached github.com/coreos/etcd: commit='11214aa33bf5a47d3d9d8dafe0f6b97237dfe921', urls=[https://github.com/coreos/etcd.git, git@github.com:coreos/etcd.git]
Resolving cached github.com/coreos/etcd: commit='11214aa33bf5a47d3d9d8dafe0f6b97237dfe921', urls=[https://github.com/coreos/etcd.git, git@github.com:coreos/etcd.git]
> Task :sdks:java:harness:shadowJar
> Task :sdks:java:harness:jar
> Task :sdks:java:container:copyDockerfileDependencies
> Task :runners:java-fn-execution:compileJava FROM-CACHE
> Task :runners:java-fn-execution:classes UP-TO-DATE
> Task :runners:java-fn-execution:jar
> Task :runners:direct-java:compileJava FROM-CACHE
> Task :runners:direct-java:classes UP-TO-DATE
> Task :runners:google-cloud-dataflow-java:worker:compileJava FROM-CACHE
> Task :runners:google-cloud-dataflow-java:worker:classes
> Task :runners:direct-java:shadowJar
> Task :sdks:java:io:google-cloud-platform:compileTestJava FROM-CACHE
> Task :sdks:java:io:google-cloud-platform:testClasses UP-TO-DATE
> Task :sdks:java:io:google-cloud-platform:testJar
> Task :runners:google-cloud-dataflow-java:worker:shadowJar
> Task :sdks:go:resolveBuildDependencies
Resolving google.golang.org/api: commit='386d4e5f4f92f86e6aec85985761bba4b938a2d5', urls=[https://code.googlesource.com/google-api-go-client]
Resolving google.golang.org/genproto: commit='2b5a72b8730b0b16380010cfe5286c42108d88e7', urls=[https://github.com/google/go-genproto]
Resolving google.golang.org/grpc: commit='7646b5360d049a7ca31e9133315db43456f39e2e', urls=[https://github.com/grpc/grpc-go]
Resolving cached github.com/coreos/etcd: commit='11214aa33bf5a47d3d9d8dafe0f6b97237dfe921', urls=[https://github.com/coreos/etcd.git, git@github.com:coreos/etcd.git]
Resolving cached github.com/coreos/etcd: commit='11214aa33bf5a47d3d9d8dafe0f6b97237dfe921', urls=[https://github.com/coreos/etcd.git, git@github.com:coreos/etcd.git]
> Task :sdks:go:installDependencies
> Task :sdks:go:buildLinuxAmd64
> Task :sdks:go:goBuild
> Task :sdks:java:container:resolveBuildDependencies
Resolving ./github.com/apache/beam/sdks/go@<https://builds.apache.org/job/beam_PostCommit_Java_PortabilityApi/ws/src/sdks/go>
> Task :sdks:java:container:installDependencies
> Task :sdks:java:container:buildLinuxAmd64
> Task :sdks:java:container:goBuild
> Task :sdks:java:container:dockerPrepare
> Task :sdks:java:container:docker
> Task :runners:google-cloud-dataflow-java:buildAndPushDockerContainer
WARNING: `gcloud docker` will not be supported for Docker client versions above 18.03.
As an alternative, use `gcloud auth configure-docker` to configure `docker` to
use `gcloud` as a credential helper, then use `docker` as you would for non-GCR
registries, e.g. `docker pull gcr.io/project-id/my-image`. Add
`--verbosity=error` to silence this warning: `gcloud docker
--verbosity=error -- pull gcr.io/project-id/my-image`.
See: https://cloud.google.com/container-registry/docs/support/deprecation-notices#gcloud-docker
The push refers to repository [us.gcr.io/apache-beam-testing/java-postcommit-it/java]
ac9133594337: Preparing
7fda14af904a: Preparing
018bdb93b562: Preparing
cdcb1dad5dfa: Preparing
3a44f2550a7a: Preparing
be20310f856b: Preparing
d81d8fa6dfd4: Preparing
bd76253da83a: Preparing
e43c0c41b833: Preparing
01727b1a72df: Preparing
69dfa7bd7a92: Preparing
4d1ab3827f6b: Preparing
7948c3e5790c: Preparing
be20310f856b: Waiting
bd76253da83a: Waiting
d81d8fa6dfd4: Waiting
e43c0c41b833: Waiting
01727b1a72df: Waiting
69dfa7bd7a92: Waiting
4d1ab3827f6b: Waiting
7948c3e5790c: Waiting
018bdb93b562: Pushed
3a44f2550a7a: Pushed
7fda14af904a: Pushed
d81d8fa6dfd4: Layer already exists
bd76253da83a: Layer already exists
01727b1a72df: Layer already exists
e43c0c41b833: Layer already exists
69dfa7bd7a92: Layer already exists
4d1ab3827f6b: Layer already exists
7948c3e5790c: Layer already exists
be20310f856b: Pushed
ac9133594337: Pushed
cdcb1dad5dfa: Pushed
20200203120039: digest: sha256:efab1b172bd6d343b221c33f6449ea514fc59cab26bd40b66aec04d98847360d size: 3056
> Task :runners:google-cloud-dataflow-java:coreSDKJavaFnApiWorkerIntegrationTest NO-SOURCE
> Task :runners:google-cloud-dataflow-java:examplesJavaFnApiWorkerIntegrationTest
org.apache.beam.examples.cookbook.BigQueryTornadoesIT > testE2eBigQueryTornadoesWithStorageApi FAILED
java.lang.RuntimeException at BigQueryTornadoesIT.java:68
2 tests completed, 1 failed
> Task :runners:google-cloud-dataflow-java:examplesJavaFnApiWorkerIntegrationTest FAILED
> Task :runners:google-cloud-dataflow-java:googleCloudPlatformFnApiWorkerIntegrationTest
org.apache.beam.sdk.io.gcp.bigquery.BigQueryTimePartitioningClusteringIT > testE2EBigQueryClusteringTableFunction FAILED
java.lang.RuntimeException at BigQueryTimePartitioningClusteringIT.java:199
org.apache.beam.sdk.io.gcp.bigtable.BigtableWriteIT > testE2EBigtableWrite FAILED
java.lang.RuntimeException at BigtableWriteIT.java:130
org.apache.beam.sdk.io.gcp.bigquery.BigQuerySchemaUpdateOptionsIT > testAllowFieldAddition FAILED
java.lang.RuntimeException at BigQuerySchemaUpdateOptionsIT.java:154
org.apache.beam.sdk.io.gcp.bigquery.BigQueryToTableIT > testNewTypesQueryWithReshuffle FAILED
java.lang.RuntimeException at BigQueryToTableIT.java:118
13 tests completed, 4 failed
> Task :runners:google-cloud-dataflow-java:googleCloudPlatformFnApiWorkerIntegrationTest FAILED
> Task :runners:google-cloud-dataflow-java:cleanUpDockerImages
Untagged: us.gcr.io/apache-beam-testing/java-postcommit-it/java:20200203120039
Untagged: us.gcr.io/apache-beam-testing/java-postcommit-it/java@sha256:efab1b172bd6d343b221c33f6449ea514fc59cab26bd40b66aec04d98847360d
Deleted: sha256:a67c3f9fcf745f5e2d40ff3abbd6c3ce73a9c9e1135d26f47062526773aa3092
Deleted: sha256:2a8cc3a6be84144fb251a0640e503a245fc8fef4839b9a57a11539b5a62df561
Deleted: sha256:211799b0571f8fdd4ac5391c2d80b32a7ba56a19f5154c3b8f43eff337be96a3
Deleted: sha256:3c0aadaa2b7d4da5ff4fe5dc92ede09e8ca97fdb10c5ed2b508bcb5721acbb11
Deleted: sha256:948cdd85b923ad6f5beaabff3e25eed0280a8bfc7f1da387bf20a295f5e2b1fb
Deleted: sha256:66b2fefacfbd285fc699d9afbf9a63abc8e646f1f712e39e79b9ebee3601d496
Deleted: sha256:aeec76b1bb08bd41b862c4c791b5a43af22f55288d34b13630cb1aa59f082f58
Deleted: sha256:d4132c53306faf84f55a1d1fd3e82cf59b1d081ccb16d1b4dc60310651b1c1cf
Deleted: sha256:37d2d0d8ce74e00197b196ea02d7a33c31a33b406f5a1d67095c23156b4be09d
Deleted: sha256:339174ec35a703823b21952d84094b3cdcb39ae8dcdbcc3d23bf77ee5ccd0494
Deleted: sha256:048bb8bac466ae23b83e6951afe23625983022f524cf2ba57b254af2a6a10a44
Deleted: sha256:44b0d4b10980d6a276d9fddfdf7945a8d74c15299891d5f7be51b0ff5e6ab4a3
Deleted: sha256:3fa2aba6377434c0afce5be9aa69eac6101045f78ab8e2a3f19baebfa8d0ecf5
Deleted: sha256:5d4be3a07088a7b44f41d34f8bb984ae1fd83f64453c1aa8438a8f6565da310a
Digests:
- us.gcr.io/apache-beam-testing/java-postcommit-it/java@sha256:efab1b172bd6d343b221c33f6449ea514fc59cab26bd40b66aec04d98847360d
Associated tags:
- 20200203120039
Tags:
- us.gcr.io/apache-beam-testing/java-postcommit-it/java:20200203120039
Deleted [us.gcr.io/apache-beam-testing/java-postcommit-it/java:20200203120039].
Deleted [us.gcr.io/apache-beam-testing/java-postcommit-it/java@sha256:efab1b172bd6d343b221c33f6449ea514fc59cab26bd40b66aec04d98847360d].
FAILURE: Build completed with 2 failures.
1: Task failed with an exception.
-----------
* What went wrong:
Execution failed for task ':runners:google-cloud-dataflow-java:examplesJavaFnApiWorkerIntegrationTest'.
> There were failing tests. See the report at: file://<https://builds.apache.org/job/beam_PostCommit_Java_PortabilityApi/ws/src/runners/google-cloud-dataflow-java/build/reports/tests/examplesJavaFnApiWorkerIntegrationTest/index.html>
* Try:
Run with --stacktrace option to get the stack trace. Run with --info or --debug option to get more log output. Run with --scan to get full insights.
==============================================================================
2: Task failed with an exception.
-----------
* What went wrong:
Execution failed for task ':runners:google-cloud-dataflow-java:googleCloudPlatformFnApiWorkerIntegrationTest'.
> There were failing tests. See the report at: file://<https://builds.apache.org/job/beam_PostCommit_Java_PortabilityApi/ws/src/runners/google-cloud-dataflow-java/build/reports/tests/googleCloudPlatformFnApiWorkerIntegrationTest/index.html>
* Try:
Run with --stacktrace option to get the stack trace. Run with --info or --debug option to get more log output. Run with --scan to get full insights.
==============================================================================
* Get more help at https://help.gradle.org
Deprecated Gradle features were used in this build, making it incompatible with Gradle 6.0.
Use '--warning-mode all' to show the individual deprecation warnings.
See https://docs.gradle.org/5.2.1/userguide/command_line_interface.html#sec:command_line_warnings
BUILD FAILED in 2h 47m 23s
100 actionable tasks: 71 executed, 28 from cache, 1 up-to-date
Publishing build scan...
https://gradle.com/s/vo6amnqkn6z4g
Build step 'Invoke Gradle script' changed build result to FAILURE
Build step 'Invoke Gradle script' marked build as failure
---------------------------------------------------------------------
To unsubscribe, e-mail: builds-unsubscribe@beam.apache.org
For additional commands, e-mail: builds-help@beam.apache.org
Jenkins build is back to normal :
beam_PostCommit_Java_PortabilityApi #4009
Posted by Apache Jenkins Server <je...@builds.apache.org>.
See <https://builds.apache.org/job/beam_PostCommit_Java_PortabilityApi/4009/display/redirect?page=changes>
---------------------------------------------------------------------
To unsubscribe, e-mail: builds-unsubscribe@beam.apache.org
For additional commands, e-mail: builds-help@beam.apache.org