You are viewing a plain text version of this content. The canonical link for it is here.
Posted to yarn-dev@hadoop.apache.org by Apache Jenkins Server <je...@builds.apache.org> on 2015/05/02 06:40:54 UTC
Failed: YARN-445 PreCommit Build #7608
Jira: https://issues.apache.org/jira/browse/YARN-445
Build: https://builds.apache.org/job/PreCommit-YARN-Build/7608/
###################################################################################
########################## LAST 60 LINES OF THE CONSOLE ###########################
[...truncated 452 lines...]
import org.apache.hadoop.yarn.api.protocolrecords.KillApplicationRequest;
import org.apache.hadoop.yarn.api.protocolrecords.SubmitApplicationRequest;
import org.apache.hadoop.yarn.api.protocolrecords.SubmitApplicationResponse;
import org.apache.hadoop.yarn.api.records.ApplicationAccessType;
import org.apache.hadoop.yarn.api.records.ApplicationAttemptId;
import org.apache.hadoop.yarn.api.records.ApplicationId;
import org.apache.hadoop.yarn.api.records.ApplicationSubmissionContext;
import org.apache.hadoop.yarn.api.records.ContainerLaunchContext;
import org.apache.hadoop.yarn.api.records.NodeId;
import org.apache.hadoop.yarn.api.records.NodeState;
error: patch failed: hadoop-yarn-project/hadoop-yarn/hadoop-yarn-server/hadoop-yarn-server-resourcemanager/src/test/java/org/apache/hadoop/yarn/server/resourcemanager/MockRM.java:29
error: hadoop-yarn-project/hadoop-yarn/hadoop-yarn-server/hadoop-yarn-server-resourcemanager/src/test/java/org/apache/hadoop/yarn/server/resourcemanager/MockRM.java: patch does not apply
Checking patch hadoop-yarn-project/hadoop-yarn/hadoop-yarn-server/hadoop-yarn-server-resourcemanager/src/test/java/org/apache/hadoop/yarn/server/resourcemanager/TestSignalContainer.java...
PATCH APPLICATION FAILED
Elapsed time: 0m 0s
-1 overall
| Vote | Subsystem | Runtime | Comment
============================================================================
| -1 | patch | 0m 0s | The patch command could not apply the
| | | | patch during dryrun.
|| Subsystem || Report/Notes ||
============================================================================
| Patch URL | http://issues.apache.org/jira/secure/attachment/12633748/YARN-445-signal-container-via-rm.patch |
| Optional Tests | javadoc javac unit findbugs checkstyle |
| git revision | trunk / f1a152c |
============================================================================
============================================================================
Adding comment to JIRA
============================================================================
============================================================================
Comment added.
d080e65b5ebf011493ae8a60acdbf6eababb825e logged out
============================================================================
============================================================================
Finished build.
============================================================================
============================================================================
Build step 'Execute shell' marked build as failure
Archiving artifacts
Description set: MAPREDUCE-6345
Recording test results
Email was triggered for: Failure
Sending email for trigger: Failure
###################################################################################
############################## FAILED TESTS (if any) ##############################
No tests ran.
Failed: YARN-3381 PreCommit Build #7630
Posted by Apache Jenkins Server <je...@builds.apache.org>.
Jira: https://issues.apache.org/jira/browse/YARN-3381
Build: https://builds.apache.org/job/PreCommit-YARN-Build/7630/
###################################################################################
########################## LAST 60 LINES OF THE CONSOLE ###########################
[...truncated 380 lines...]
| +1 | findbugs | 5m 19s | The patch does not introduce any
| | | | new Findbugs (version 2.0.3)
| | | | warnings.
| +1 | mapreduce tests | 8m 50s | Tests passed in
| | | | hadoop-mapreduce-client-app.
| +1 | yarn tests | 6m 47s | Tests passed in hadoop-yarn-client.
| +1 | yarn tests | 1m 55s | Tests passed in hadoop-yarn-common.
| +1 | yarn tests | 5m 50s | Tests passed in
| | | | hadoop-yarn-server-nodemanager.
| +1 | yarn tests | 52m 13s | Tests passed in
| | | | hadoop-yarn-server-resourcemanager.
| | | 117m 46s |
|| Subsystem || Report/Notes ||
============================================================================
| Patch URL | http://issues.apache.org/jira/secure/attachment/12729924/YARN-3381-003.patch |
| Optional Tests | javadoc javac unit findbugs checkstyle |
| git revision | trunk / f1a152c |
| hadoop-mapreduce-client-app test log | /home/jenkins/jenkins-slave/workspace/PreCommit-YARN-Build/../patchprocess/testrun_hadoop-mapreduce-client-app.txt |
| hadoop-yarn-client test log | /home/jenkins/jenkins-slave/workspace/PreCommit-YARN-Build/../patchprocess/testrun_hadoop-yarn-client.txt |
| hadoop-yarn-common test log | /home/jenkins/jenkins-slave/workspace/PreCommit-YARN-Build/../patchprocess/testrun_hadoop-yarn-common.txt |
| hadoop-yarn-server-nodemanager test log | /home/jenkins/jenkins-slave/workspace/PreCommit-YARN-Build/../patchprocess/testrun_hadoop-yarn-server-nodemanager.txt |
| hadoop-yarn-server-resourcemanager test log | /home/jenkins/jenkins-slave/workspace/PreCommit-YARN-Build/../patchprocess/testrun_hadoop-yarn-server-resourcemanager.txt |
| Test Results | https://builds.apache.org/job/PreCommit-YARN-Build/7630/testReport/ |
| Java | 1.7.0_55 |
| uname | Linux asf902.gq1.ygridcore.net 3.13.0-36-lowlatency #63-Ubuntu SMP PREEMPT Wed Sep 3 21:56:12 UTC 2014 x86_64 x86_64 x86_64 GNU/Linux |
============================================================================
============================================================================
Adding comment to JIRA
============================================================================
============================================================================
Comment added.
2cab79328721980bd29d16f688c0bd64c7a8dd40 logged out
============================================================================
============================================================================
Finished build.
============================================================================
============================================================================
Build step 'Execute shell' marked build as failure
Archiving artifacts
Sending artifact delta relative to PreCommit-YARN-Build #7592
Archived 57 artifacts
Archive block size is 32768
Received 101 blocks and 12838169 bytes
Compression is 20.5%
Took 5.1 sec
Description set: MAPREDUCE-6345
Recording test results
Email was triggered for: Failure
Sending email for trigger: Failure
###################################################################################
############################## FAILED TESTS (if any) ##############################
All tests passed
Failed: YARN-2046 PreCommit Build #7629
Posted by Apache Jenkins Server <je...@builds.apache.org>.
Jira: https://issues.apache.org/jira/browse/YARN-2046
Build: https://builds.apache.org/job/PreCommit-YARN-Build/7629/
###################################################################################
########################## LAST 60 LINES OF THE CONSOLE ###########################
[...truncated 117 lines...]
Hunk #2 succeeded at 262 (offset 14 lines).
Hunk #3 succeeded at 292 (offset 14 lines).
error: while searching for:
assertEquals(ContainerState.NEW, wc.c.getContainerState());
wc.killContainer();
assertEquals(ContainerState.DONE, wc.c.getContainerState());
assertEquals(ContainerExitStatus.KILLED_BY_RESOURCEMANAGER,
wc.c.cloneAndGetContainerStatus().getExitStatus());
assertTrue(wc.c.cloneAndGetContainerStatus().getDiagnostics()
error: patch failed: hadoop-yarn-project/hadoop-yarn/hadoop-yarn-server/hadoop-yarn-server-nodemanager/src/test/java/org/apache/hadoop/yarn/server/nodemanager/containermanager/container/TestContainer.java:321
error: hadoop-yarn-project/hadoop-yarn/hadoop-yarn-server/hadoop-yarn-server-nodemanager/src/test/java/org/apache/hadoop/yarn/server/nodemanager/containermanager/container/TestContainer.java: patch does not apply
Checking patch hadoop-yarn-project/hadoop-yarn/hadoop-yarn-server/hadoop-yarn-server-nodemanager/src/test/java/org/apache/hadoop/yarn/server/nodemanager/webapp/TestNMWebServer.java...
Hunk #1 succeeded at 218 (offset 7 lines).
PATCH APPLICATION FAILED
Elapsed time: 0m 0s
-1 overall
| Vote | Subsystem | Runtime | Comment
============================================================================
| -1 | patch | 0m 0s | The patch command could not apply the
| | | | patch during dryrun.
|| Subsystem || Report/Notes ||
============================================================================
| Patch URL | http://issues.apache.org/jira/secure/attachment/12666320/YARN-2046.patch |
| Optional Tests | javadoc javac unit findbugs checkstyle |
| git revision | trunk / f1a152c |
============================================================================
============================================================================
Adding comment to JIRA
============================================================================
============================================================================
Comment added.
4146c8e381b21425ff959f02b167af7f7969ff46 logged out
============================================================================
============================================================================
Finished build.
============================================================================
============================================================================
Build step 'Execute shell' marked build as failure
Archiving artifacts
Description set: MAPREDUCE-6345
Recording test results
Email was triggered for: Failure
Sending email for trigger: Failure
###################################################################################
############################## FAILED TESTS (if any) ##############################
No tests ran.
Failed: YARN-1912 PreCommit Build #7628
Posted by Apache Jenkins Server <je...@builds.apache.org>.
Jira: https://issues.apache.org/jira/browse/YARN-1912
Build: https://builds.apache.org/job/PreCommit-YARN-Build/7628/
###################################################################################
########################## LAST 60 LINES OF THE CONSOLE ###########################
[...truncated 72 lines...]
Assert.assertEquals(result.get(4), "/bin/nmPrivateCTokensPath");
Assert.assertEquals(result.get(8), "-classpath" );
Assert.assertEquals(result.get(11),"org.apache.hadoop.yarn.server.nodemanager.containermanager.localizer.ContainerLocalizer" );
Assert.assertEquals(result.get(12), "test");
Assert.assertEquals(result.get(13), "application_0");
Assert.assertEquals(result.get(14),"12345" );
Assert.assertEquals(result.get(15),"localhost" );
Assert.assertEquals(result.get(16),"8040" );
} catch (InterruptedException e) {
LOG.error("Error:"+e.getMessage(),e);
error: patch failed: hadoop-yarn-project/hadoop-yarn/hadoop-yarn-server/hadoop-yarn-server-nodemanager/src/test/java/org/apache/hadoop/yarn/server/nodemanager/TestLinuxContainerExecutorWithMocks.java:181
error: hadoop-yarn-project/hadoop-yarn/hadoop-yarn-server/hadoop-yarn-server-nodemanager/src/test/java/org/apache/hadoop/yarn/server/nodemanager/TestLinuxContainerExecutorWithMocks.java: patch does not apply
PATCH APPLICATION FAILED
Elapsed time: 0m 0s
-1 overall
| Vote | Subsystem | Runtime | Comment
============================================================================
| -1 | patch | 0m 0s | The patch command could not apply the
| | | | patch during dryrun.
|| Subsystem || Report/Notes ||
============================================================================
| Patch URL | http://issues.apache.org/jira/secure/attachment/12642478/YARN-1912-1.patch |
| Optional Tests | javadoc javac unit findbugs checkstyle |
| git revision | trunk / f1a152c |
============================================================================
============================================================================
Adding comment to JIRA
============================================================================
============================================================================
Comment added.
3a5f885bfd07e786480406115242407c8f013c86 logged out
============================================================================
============================================================================
Finished build.
============================================================================
============================================================================
Build step 'Execute shell' marked build as failure
Archiving artifacts
Description set: MAPREDUCE-6345
Recording test results
Email was triggered for: Failure
Sending email for trigger: Failure
###################################################################################
############################## FAILED TESTS (if any) ##############################
No tests ran.
Failed: YARN-2130 PreCommit Build #7627
Posted by Apache Jenkins Server <je...@builds.apache.org>.
Jira: https://issues.apache.org/jira/browse/YARN-2130
Build: https://builds.apache.org/job/PreCommit-YARN-Build/7627/
###################################################################################
########################## LAST 60 LINES OF THE CONSOLE ###########################
[...truncated 37 lines...]
Confirming git environment
============================================================================
============================================================================
HEAD is now at f1a152c MAPREDUCE-6345. Documentation fix for when CRLA is enabled for MRAppMaster logs. (Rohit Agarwal via gera)
Switched to branch 'trunk'
Your branch is up-to-date with 'origin/trunk'.
Current branch trunk is up to date.
Already on 'trunk'
Your branch is up-to-date with 'origin/trunk'.
Current branch trunk is up to date.
Testing YARN-2130 patch on trunk.
The patch does not appear to apply with p0 to p2
PATCH APPLICATION FAILED
Elapsed time: 0m 0s
-1 overall
| Vote | Subsystem | Runtime | Comment
============================================================================
| -1 | patch | 0m 0s | The patch command could not apply the
| | | | patch during dryrun.
|| Subsystem || Report/Notes ||
============================================================================
| Patch URL | http://issues.apache.org/jira/secure/attachment/12666181/YARN-2130.9.patch |
| Optional Tests | javac unit findbugs checkstyle javadoc |
| git revision | trunk / f1a152c |
============================================================================
============================================================================
Adding comment to JIRA
============================================================================
============================================================================
Comment added.
2a4155929e72258486aeb0dd852635db4fd6c204 logged out
============================================================================
============================================================================
Finished build.
============================================================================
============================================================================
Build step 'Execute shell' marked build as failure
Archiving artifacts
Description set: MAPREDUCE-6345
Recording test results
Email was triggered for: Failure
Sending email for trigger: Failure
###################################################################################
############################## FAILED TESTS (if any) ##############################
No tests ran.
Failed: YARN-1912 PreCommit Build #7626
Posted by Apache Jenkins Server <je...@builds.apache.org>.
Jira: https://issues.apache.org/jira/browse/YARN-1912
Build: https://builds.apache.org/job/PreCommit-YARN-Build/7626/
###################################################################################
########################## LAST 60 LINES OF THE CONSOLE ###########################
[...truncated 72 lines...]
Assert.assertEquals(result.get(4), "/bin/nmPrivateCTokensPath");
Assert.assertEquals(result.get(8), "-classpath" );
Assert.assertEquals(result.get(11),"org.apache.hadoop.yarn.server.nodemanager.containermanager.localizer.ContainerLocalizer" );
Assert.assertEquals(result.get(12), "test");
Assert.assertEquals(result.get(13), "application_0");
Assert.assertEquals(result.get(14),"12345" );
Assert.assertEquals(result.get(15),"localhost" );
Assert.assertEquals(result.get(16),"8040" );
} catch (InterruptedException e) {
LOG.error("Error:"+e.getMessage(),e);
error: patch failed: hadoop-yarn-project/hadoop-yarn/hadoop-yarn-server/hadoop-yarn-server-nodemanager/src/test/java/org/apache/hadoop/yarn/server/nodemanager/TestLinuxContainerExecutorWithMocks.java:181
error: hadoop-yarn-project/hadoop-yarn/hadoop-yarn-server/hadoop-yarn-server-nodemanager/src/test/java/org/apache/hadoop/yarn/server/nodemanager/TestLinuxContainerExecutorWithMocks.java: patch does not apply
PATCH APPLICATION FAILED
Elapsed time: 0m 0s
-1 overall
| Vote | Subsystem | Runtime | Comment
============================================================================
| -1 | patch | 0m 0s | The patch command could not apply the
| | | | patch during dryrun.
|| Subsystem || Report/Notes ||
============================================================================
| Patch URL | http://issues.apache.org/jira/secure/attachment/12642478/YARN-1912-1.patch |
| Optional Tests | javadoc javac unit findbugs checkstyle |
| git revision | trunk / f1a152c |
============================================================================
============================================================================
Adding comment to JIRA
============================================================================
============================================================================
Comment added.
6195c843600f3d106e92254d1ad32a7e402e8878 logged out
============================================================================
============================================================================
Finished build.
============================================================================
============================================================================
Build step 'Execute shell' marked build as failure
Archiving artifacts
Description set: MAPREDUCE-6345
Recording test results
Email was triggered for: Failure
Sending email for trigger: Failure
###################################################################################
############################## FAILED TESTS (if any) ##############################
No tests ran.
Failed: YARN-2046 PreCommit Build #7625
Posted by Apache Jenkins Server <je...@builds.apache.org>.
Jira: https://issues.apache.org/jira/browse/YARN-2046
Build: https://builds.apache.org/job/PreCommit-YARN-Build/7625/
###################################################################################
########################## LAST 60 LINES OF THE CONSOLE ###########################
[...truncated 117 lines...]
Hunk #2 succeeded at 262 (offset 14 lines).
Hunk #3 succeeded at 292 (offset 14 lines).
error: while searching for:
assertEquals(ContainerState.NEW, wc.c.getContainerState());
wc.killContainer();
assertEquals(ContainerState.DONE, wc.c.getContainerState());
assertEquals(ContainerExitStatus.KILLED_BY_RESOURCEMANAGER,
wc.c.cloneAndGetContainerStatus().getExitStatus());
assertTrue(wc.c.cloneAndGetContainerStatus().getDiagnostics()
error: patch failed: hadoop-yarn-project/hadoop-yarn/hadoop-yarn-server/hadoop-yarn-server-nodemanager/src/test/java/org/apache/hadoop/yarn/server/nodemanager/containermanager/container/TestContainer.java:321
error: hadoop-yarn-project/hadoop-yarn/hadoop-yarn-server/hadoop-yarn-server-nodemanager/src/test/java/org/apache/hadoop/yarn/server/nodemanager/containermanager/container/TestContainer.java: patch does not apply
Checking patch hadoop-yarn-project/hadoop-yarn/hadoop-yarn-server/hadoop-yarn-server-nodemanager/src/test/java/org/apache/hadoop/yarn/server/nodemanager/webapp/TestNMWebServer.java...
Hunk #1 succeeded at 218 (offset 7 lines).
PATCH APPLICATION FAILED
Elapsed time: 0m 0s
-1 overall
| Vote | Subsystem | Runtime | Comment
============================================================================
| -1 | patch | 0m 0s | The patch command could not apply the
| | | | patch during dryrun.
|| Subsystem || Report/Notes ||
============================================================================
| Patch URL | http://issues.apache.org/jira/secure/attachment/12666320/YARN-2046.patch |
| Optional Tests | javadoc javac unit findbugs checkstyle |
| git revision | trunk / f1a152c |
============================================================================
============================================================================
Adding comment to JIRA
============================================================================
============================================================================
Comment added.
9f2dc59f94ee831f7d9c2b68209ef7e7e104d379 logged out
============================================================================
============================================================================
Finished build.
============================================================================
============================================================================
Build step 'Execute shell' marked build as failure
Archiving artifacts
Description set: MAPREDUCE-6345
Recording test results
Email was triggered for: Failure
Sending email for trigger: Failure
###################################################################################
############################## FAILED TESTS (if any) ##############################
No tests ran.
Failed: YARN-2130 PreCommit Build #7624
Posted by Apache Jenkins Server <je...@builds.apache.org>.
Jira: https://issues.apache.org/jira/browse/YARN-2130
Build: https://builds.apache.org/job/PreCommit-YARN-Build/7624/
###################################################################################
########################## LAST 60 LINES OF THE CONSOLE ###########################
[...truncated 37 lines...]
Confirming git environment
============================================================================
============================================================================
HEAD is now at f1a152c MAPREDUCE-6345. Documentation fix for when CRLA is enabled for MRAppMaster logs. (Rohit Agarwal via gera)
Switched to branch 'trunk'
Your branch is up-to-date with 'origin/trunk'.
Current branch trunk is up to date.
Already on 'trunk'
Your branch is up-to-date with 'origin/trunk'.
Current branch trunk is up to date.
Testing YARN-2130 patch on trunk.
The patch does not appear to apply with p0 to p2
PATCH APPLICATION FAILED
Elapsed time: 0m 0s
-1 overall
| Vote | Subsystem | Runtime | Comment
============================================================================
| -1 | patch | 0m 0s | The patch command could not apply the
| | | | patch during dryrun.
|| Subsystem || Report/Notes ||
============================================================================
| Patch URL | http://issues.apache.org/jira/secure/attachment/12666181/YARN-2130.9.patch |
| Optional Tests | javac unit findbugs checkstyle javadoc |
| git revision | trunk / f1a152c |
============================================================================
============================================================================
Adding comment to JIRA
============================================================================
============================================================================
Comment added.
ea88b7ce12e73789308604cbce2c14ccebaaa901 logged out
============================================================================
============================================================================
Finished build.
============================================================================
============================================================================
Build step 'Execute shell' marked build as failure
Archiving artifacts
Description set: MAPREDUCE-6345
Recording test results
Email was triggered for: Failure
Sending email for trigger: Failure
###################################################################################
############################## FAILED TESTS (if any) ##############################
No tests ran.
Failed: YARN-2142 PreCommit Build #7623
Posted by Apache Jenkins Server <je...@builds.apache.org>.
Jira: https://issues.apache.org/jira/browse/YARN-2142
Build: https://builds.apache.org/job/PreCommit-YARN-Build/7623/
###################################################################################
########################## LAST 60 LINES OF THE CONSOLE ###########################
[...truncated 37 lines...]
Confirming git environment
============================================================================
============================================================================
HEAD is now at f1a152c MAPREDUCE-6345. Documentation fix for when CRLA is enabled for MRAppMaster logs. (Rohit Agarwal via gera)
Switched to branch 'trunk'
Your branch is up-to-date with 'origin/trunk'.
Current branch trunk is up to date.
Already on 'trunk'
Your branch is up-to-date with 'origin/trunk'.
Current branch trunk is up to date.
Testing YARN-2142 patch on trunk.
The patch does not appear to apply with p0 to p2
PATCH APPLICATION FAILED
Elapsed time: 0m 0s
-1 overall
| Vote | Subsystem | Runtime | Comment
============================================================================
| -1 | patch | 0m 0s | The patch command could not apply the
| | | | patch during dryrun.
|| Subsystem || Report/Notes ||
============================================================================
| Patch URL | http://issues.apache.org/jira/secure/attachment/12654924/final.patch |
| Optional Tests | javadoc javac unit findbugs checkstyle |
| git revision | trunk / f1a152c |
============================================================================
============================================================================
Adding comment to JIRA
============================================================================
============================================================================
Comment added.
7b88167bd7b87b0341d930e4970be559ce2a8cea logged out
============================================================================
============================================================================
Finished build.
============================================================================
============================================================================
Build step 'Execute shell' marked build as failure
Archiving artifacts
Description set: MAPREDUCE-6345
Recording test results
Email was triggered for: Failure
Sending email for trigger: Failure
###################################################################################
############################## FAILED TESTS (if any) ##############################
No tests ran.
Failed: YARN-641 PreCommit Build #7622
Posted by Apache Jenkins Server <je...@builds.apache.org>.
Jira: https://issues.apache.org/jira/browse/YARN-641
Build: https://builds.apache.org/job/PreCommit-YARN-Build/7622/
###################################################################################
########################## LAST 60 LINES OF THE CONSOLE ###########################
[...truncated 37 lines...]
Confirming git environment
============================================================================
============================================================================
HEAD is now at f1a152c MAPREDUCE-6345. Documentation fix for when CRLA is enabled for MRAppMaster logs. (Rohit Agarwal via gera)
Switched to branch 'trunk'
Your branch is up-to-date with 'origin/trunk'.
Current branch trunk is up to date.
Already on 'trunk'
Your branch is up-to-date with 'origin/trunk'.
Current branch trunk is up to date.
Testing YARN-641 patch on trunk.
The patch does not appear to apply with p0 to p2
PATCH APPLICATION FAILED
Elapsed time: 0m 0s
-1 overall
| Vote | Subsystem | Runtime | Comment
============================================================================
| -1 | patch | 0m 0s | The patch command could not apply the
| | | | patch during dryrun.
|| Subsystem || Report/Notes ||
============================================================================
| Patch URL | http://issues.apache.org/jira/secure/attachment/12587395/YARN-641.3.patch |
| Optional Tests | javadoc javac unit findbugs checkstyle |
| git revision | trunk / f1a152c |
============================================================================
============================================================================
Adding comment to JIRA
============================================================================
============================================================================
Comment added.
e48a17ef2c1c094e479b6b3a06e3b7de1cd45f40 logged out
============================================================================
============================================================================
Finished build.
============================================================================
============================================================================
Build step 'Execute shell' marked build as failure
Archiving artifacts
Description set: MAPREDUCE-6345
Recording test results
Email was triggered for: Failure
Sending email for trigger: Failure
###################################################################################
############################## FAILED TESTS (if any) ##############################
No tests ran.
Failed: YARN-1515 PreCommit Build #7621
Posted by Apache Jenkins Server <je...@builds.apache.org>.
Jira: https://issues.apache.org/jira/browse/YARN-1515
Build: https://builds.apache.org/job/PreCommit-YARN-Build/7621/
###################################################################################
########################## LAST 60 LINES OF THE CONSOLE ###########################
[...truncated 348 lines...]
import org.apache.hadoop.yarn.server.resourcemanager.RMContext;
import org.apache.hadoop.yarn.server.resourcemanager.RMServerUtils;
import org.apache.hadoop.yarn.server.resourcemanager.amlauncher.AMLauncherEvent;
import org.apache.hadoop.yarn.server.resourcemanager.amlauncher.AMLauncherEventType;
import org.apache.hadoop.yarn.server.resourcemanager.recovery.RMStateStore;
error: patch failed: hadoop-yarn-project/hadoop-yarn/hadoop-yarn-server/hadoop-yarn-server-resourcemanager/src/main/java/org/apache/hadoop/yarn/server/resourcemanager/rmapp/attempt/RMAppAttemptImpl.java:67
error: hadoop-yarn-project/hadoop-yarn/hadoop-yarn-server/hadoop-yarn-server-resourcemanager/src/main/java/org/apache/hadoop/yarn/server/resourcemanager/rmapp/attempt/RMAppAttemptImpl.java: patch does not apply
Checking patch hadoop-yarn-project/hadoop-yarn/hadoop-yarn-server/hadoop-yarn-server-resourcemanager/src/test/java/org/apache/hadoop/yarn/server/resourcemanager/MockRMWithCustomAMLauncher.java...
Checking patch hadoop-yarn-project/hadoop-yarn/hadoop-yarn-server/hadoop-yarn-server-resourcemanager/src/test/java/org/apache/hadoop/yarn/server/resourcemanager/NodeManager.java...
Checking patch hadoop-yarn-project/hadoop-yarn/hadoop-yarn-server/hadoop-yarn-server-resourcemanager/src/test/java/org/apache/hadoop/yarn/server/resourcemanager/TestAMAuthorization.java...
Checking patch hadoop-yarn-project/hadoop-yarn/hadoop-yarn-server/hadoop-yarn-server-resourcemanager/src/test/java/org/apache/hadoop/yarn/server/resourcemanager/TestApplicationMasterLauncher.java...
Hunk #1 succeeded at 34 (offset 3 lines).
Hunk #2 succeeded at 129 (offset 9 lines).
PATCH APPLICATION FAILED
Elapsed time: 0m 0s
-1 overall
| Vote | Subsystem | Runtime | Comment
============================================================================
| -1 | patch | 0m 0s | The patch command could not apply the
| | | | patch during dryrun.
|| Subsystem || Report/Notes ||
============================================================================
| Patch URL | http://issues.apache.org/jira/secure/attachment/12645519/YARN-1515.v08.patch |
| Optional Tests | javac unit findbugs checkstyle javadoc |
| git revision | trunk / f1a152c |
============================================================================
============================================================================
Adding comment to JIRA
============================================================================
============================================================================
Comment added.
25b3ff29f9db81a5b6c7751368e74b46f93022c9 logged out
============================================================================
============================================================================
Finished build.
============================================================================
============================================================================
Build step 'Execute shell' marked build as failure
Archiving artifacts
Description set: MAPREDUCE-6345
Recording test results
Email was triggered for: Failure
Sending email for trigger: Failure
###################################################################################
############################## FAILED TESTS (if any) ##############################
No tests ran.
Failed: YARN-2151 PreCommit Build #7620
Posted by Apache Jenkins Server <je...@builds.apache.org>.
Jira: https://issues.apache.org/jira/browse/YARN-2151
Build: https://builds.apache.org/job/PreCommit-YARN-Build/7620/
###################################################################################
########################## LAST 60 LINES OF THE CONSOLE ###########################
[...truncated 137 lines...]
error: patch failed: hadoop-yarn-project/hadoop-yarn/hadoop-yarn-server/hadoop-yarn-server-resourcemanager/src/test/java/org/apache/hadoop/yarn/server/resourcemanager/scheduler/fair/TestAllocationFileLoaderService.java:458
error: hadoop-yarn-project/hadoop-yarn/hadoop-yarn-server/hadoop-yarn-server-resourcemanager/src/test/java/org/apache/hadoop/yarn/server/resourcemanager/scheduler/fair/TestAllocationFileLoaderService.java: patch does not apply
Checking patch hadoop-yarn-project/hadoop-yarn/hadoop-yarn-server/hadoop-yarn-server-resourcemanager/src/test/java/org/apache/hadoop/yarn/server/resourcemanager/scheduler/fair/TestFairScheduler.java...
Hunk #1 succeeded at 47 (offset 4 lines).
error: while searching for:
createSchedulingRequest(1024, 1, "queue1", "user1", 3);
scheduler.moveApplication(appAttId.getApplicationId(), "queue2");
}
}
error: patch failed: hadoop-yarn-project/hadoop-yarn/hadoop-yarn-server/hadoop-yarn-server-resourcemanager/src/test/java/org/apache/hadoop/yarn/server/resourcemanager/scheduler/fair/TestFairScheduler.java:2956
error: hadoop-yarn-project/hadoop-yarn/hadoop-yarn-server/hadoop-yarn-server-resourcemanager/src/test/java/org/apache/hadoop/yarn/server/resourcemanager/scheduler/fair/TestFairScheduler.java: patch does not apply
PATCH APPLICATION FAILED
Elapsed time: 0m 1s
-1 overall
| Vote | Subsystem | Runtime | Comment
============================================================================
| -1 | patch | 0m 1s | The patch command could not apply the
| | | | patch during dryrun.
|| Subsystem || Report/Notes ||
============================================================================
| Patch URL | http://issues.apache.org/jira/secure/attachment/12649887/YARN-2151.patch |
| Optional Tests | javadoc javac unit findbugs checkstyle |
| git revision | trunk / f1a152c |
============================================================================
============================================================================
Adding comment to JIRA
============================================================================
============================================================================
Comment added.
4d99f4fba30e0daa75e0fa16e793a5508d31eff1 logged out
============================================================================
============================================================================
Finished build.
============================================================================
============================================================================
Build step 'Execute shell' marked build as failure
Archiving artifacts
Description set: MAPREDUCE-6345
Recording test results
Email was triggered for: Failure
Sending email for trigger: Failure
###################################################################################
############################## FAILED TESTS (if any) ##############################
No tests ran.
Failed: YARN-2325 PreCommit Build #7619
Posted by Apache Jenkins Server <je...@builds.apache.org>.
Jira: https://issues.apache.org/jira/browse/YARN-2325
Build: https://builds.apache.org/job/PreCommit-YARN-Build/7619/
###################################################################################
########################## LAST 60 LINES OF THE CONSOLE ###########################
[...truncated 37 lines...]
Confirming git environment
============================================================================
============================================================================
HEAD is now at f1a152c MAPREDUCE-6345. Documentation fix for when CRLA is enabled for MRAppMaster logs. (Rohit Agarwal via gera)
Switched to branch 'trunk'
Your branch is up-to-date with 'origin/trunk'.
Current branch trunk is up to date.
Already on 'trunk'
Your branch is up-to-date with 'origin/trunk'.
Current branch trunk is up to date.
Testing YARN-2325 patch on trunk.
The patch does not appear to apply with p0 to p2
PATCH APPLICATION FAILED
Elapsed time: 0m 0s
-1 overall
| Vote | Subsystem | Runtime | Comment
============================================================================
| -1 | patch | 0m 0s | The patch command could not apply the
| | | | patch during dryrun.
|| Subsystem || Report/Notes ||
============================================================================
| Patch URL | http://issues.apache.org/jira/secure/attachment/12656795/YARN-2325.000.patch |
| Optional Tests | javadoc javac unit findbugs checkstyle |
| git revision | trunk / f1a152c |
============================================================================
============================================================================
Adding comment to JIRA
============================================================================
============================================================================
Comment added.
f805365278ff8647c8a651e6472105678dc2fa29 logged out
============================================================================
============================================================================
Finished build.
============================================================================
============================================================================
Build step 'Execute shell' marked build as failure
Archiving artifacts
Description set: MAPREDUCE-6345
Recording test results
Email was triggered for: Failure
Sending email for trigger: Failure
###################################################################################
############################## FAILED TESTS (if any) ##############################
No tests ran.
Failed: YARN-2325 PreCommit Build #7618
Posted by Apache Jenkins Server <je...@builds.apache.org>.
Jira: https://issues.apache.org/jira/browse/YARN-2325
Build: https://builds.apache.org/job/PreCommit-YARN-Build/7618/
###################################################################################
########################## LAST 60 LINES OF THE CONSOLE ###########################
[...truncated 37 lines...]
Confirming git environment
============================================================================
============================================================================
HEAD is now at f1a152c MAPREDUCE-6345. Documentation fix for when CRLA is enabled for MRAppMaster logs. (Rohit Agarwal via gera)
Switched to branch 'trunk'
Your branch is up-to-date with 'origin/trunk'.
Current branch trunk is up to date.
Already on 'trunk'
Your branch is up-to-date with 'origin/trunk'.
Current branch trunk is up to date.
Testing YARN-2325 patch on trunk.
The patch does not appear to apply with p0 to p2
PATCH APPLICATION FAILED
Elapsed time: 0m 0s
-1 overall
| Vote | Subsystem | Runtime | Comment
============================================================================
| -1 | patch | 0m 0s | The patch command could not apply the
| | | | patch during dryrun.
|| Subsystem || Report/Notes ||
============================================================================
| Patch URL | http://issues.apache.org/jira/secure/attachment/12656795/YARN-2325.000.patch |
| Optional Tests | javadoc javac unit findbugs checkstyle |
| git revision | trunk / f1a152c |
============================================================================
============================================================================
Adding comment to JIRA
============================================================================
============================================================================
Comment added.
bb7949c86416bf1c2543763d4bebb9b85e79dbcf logged out
============================================================================
============================================================================
Finished build.
============================================================================
============================================================================
Build step 'Execute shell' marked build as failure
Archiving artifacts
Description set: MAPREDUCE-6345
Recording test results
Email was triggered for: Failure
Sending email for trigger: Failure
###################################################################################
############################## FAILED TESTS (if any) ##############################
No tests ran.
Failed: YARN-641 PreCommit Build #7617
Posted by Apache Jenkins Server <je...@builds.apache.org>.
Jira: https://issues.apache.org/jira/browse/YARN-641
Build: https://builds.apache.org/job/PreCommit-YARN-Build/7617/
###################################################################################
########################## LAST 60 LINES OF THE CONSOLE ###########################
[...truncated 37 lines...]
Confirming git environment
============================================================================
============================================================================
HEAD is now at f1a152c MAPREDUCE-6345. Documentation fix for when CRLA is enabled for MRAppMaster logs. (Rohit Agarwal via gera)
Switched to branch 'trunk'
Your branch is up-to-date with 'origin/trunk'.
Current branch trunk is up to date.
Already on 'trunk'
Your branch is up-to-date with 'origin/trunk'.
Current branch trunk is up to date.
Testing YARN-641 patch on trunk.
The patch does not appear to apply with p0 to p2
PATCH APPLICATION FAILED
Elapsed time: 0m 0s
-1 overall
| Vote | Subsystem | Runtime | Comment
============================================================================
| -1 | patch | 0m 0s | The patch command could not apply the
| | | | patch during dryrun.
|| Subsystem || Report/Notes ||
============================================================================
| Patch URL | http://issues.apache.org/jira/secure/attachment/12587395/YARN-641.3.patch |
| Optional Tests | javadoc javac unit findbugs checkstyle |
| git revision | trunk / f1a152c |
============================================================================
============================================================================
Adding comment to JIRA
============================================================================
============================================================================
Comment added.
b578a7c8cadaa7375df44deb47fe040155a38992 logged out
============================================================================
============================================================================
Finished build.
============================================================================
============================================================================
Build step 'Execute shell' marked build as failure
Archiving artifacts
Description set: MAPREDUCE-6345
Recording test results
Email was triggered for: Failure
Sending email for trigger: Failure
###################################################################################
############################## FAILED TESTS (if any) ##############################
No tests ran.
Failed: YARN-2142 PreCommit Build #7616
Posted by Apache Jenkins Server <je...@builds.apache.org>.
Jira: https://issues.apache.org/jira/browse/YARN-2142
Build: https://builds.apache.org/job/PreCommit-YARN-Build/7616/
###################################################################################
########################## LAST 60 LINES OF THE CONSOLE ###########################
[...truncated 37 lines...]
Confirming git environment
============================================================================
============================================================================
HEAD is now at f1a152c MAPREDUCE-6345. Documentation fix for when CRLA is enabled for MRAppMaster logs. (Rohit Agarwal via gera)
Switched to branch 'trunk'
Your branch is up-to-date with 'origin/trunk'.
Current branch trunk is up to date.
Already on 'trunk'
Your branch is up-to-date with 'origin/trunk'.
Current branch trunk is up to date.
Testing YARN-2142 patch on trunk.
The patch does not appear to apply with p0 to p2
PATCH APPLICATION FAILED
Elapsed time: 0m 0s
-1 overall
| Vote | Subsystem | Runtime | Comment
============================================================================
| -1 | patch | 0m 0s | The patch command could not apply the
| | | | patch during dryrun.
|| Subsystem || Report/Notes ||
============================================================================
| Patch URL | http://issues.apache.org/jira/secure/attachment/12654924/final.patch |
| Optional Tests | javadoc javac unit findbugs checkstyle |
| git revision | trunk / f1a152c |
============================================================================
============================================================================
Adding comment to JIRA
============================================================================
============================================================================
Comment added.
d40d5a5e8a064bbcd70b3bf3204aa768a35b81e5 logged out
============================================================================
============================================================================
Finished build.
============================================================================
============================================================================
Build step 'Execute shell' marked build as failure
Archiving artifacts
Description set: MAPREDUCE-6345
Recording test results
Email was triggered for: Failure
Sending email for trigger: Failure
###################################################################################
############################## FAILED TESTS (if any) ##############################
No tests ran.
Failed: YARN-1515 PreCommit Build #7615
Posted by Apache Jenkins Server <je...@builds.apache.org>.
Jira: https://issues.apache.org/jira/browse/YARN-1515
Build: https://builds.apache.org/job/PreCommit-YARN-Build/7615/
###################################################################################
########################## LAST 60 LINES OF THE CONSOLE ###########################
[...truncated 348 lines...]
import org.apache.hadoop.yarn.server.resourcemanager.RMContext;
import org.apache.hadoop.yarn.server.resourcemanager.RMServerUtils;
import org.apache.hadoop.yarn.server.resourcemanager.amlauncher.AMLauncherEvent;
import org.apache.hadoop.yarn.server.resourcemanager.amlauncher.AMLauncherEventType;
import org.apache.hadoop.yarn.server.resourcemanager.recovery.RMStateStore;
error: patch failed: hadoop-yarn-project/hadoop-yarn/hadoop-yarn-server/hadoop-yarn-server-resourcemanager/src/main/java/org/apache/hadoop/yarn/server/resourcemanager/rmapp/attempt/RMAppAttemptImpl.java:67
error: hadoop-yarn-project/hadoop-yarn/hadoop-yarn-server/hadoop-yarn-server-resourcemanager/src/main/java/org/apache/hadoop/yarn/server/resourcemanager/rmapp/attempt/RMAppAttemptImpl.java: patch does not apply
Checking patch hadoop-yarn-project/hadoop-yarn/hadoop-yarn-server/hadoop-yarn-server-resourcemanager/src/test/java/org/apache/hadoop/yarn/server/resourcemanager/MockRMWithCustomAMLauncher.java...
Checking patch hadoop-yarn-project/hadoop-yarn/hadoop-yarn-server/hadoop-yarn-server-resourcemanager/src/test/java/org/apache/hadoop/yarn/server/resourcemanager/NodeManager.java...
Checking patch hadoop-yarn-project/hadoop-yarn/hadoop-yarn-server/hadoop-yarn-server-resourcemanager/src/test/java/org/apache/hadoop/yarn/server/resourcemanager/TestAMAuthorization.java...
Checking patch hadoop-yarn-project/hadoop-yarn/hadoop-yarn-server/hadoop-yarn-server-resourcemanager/src/test/java/org/apache/hadoop/yarn/server/resourcemanager/TestApplicationMasterLauncher.java...
Hunk #1 succeeded at 34 (offset 3 lines).
Hunk #2 succeeded at 129 (offset 9 lines).
PATCH APPLICATION FAILED
Elapsed time: 0m 0s
-1 overall
| Vote | Subsystem | Runtime | Comment
============================================================================
| -1 | patch | 0m 0s | The patch command could not apply the
| | | | patch during dryrun.
|| Subsystem || Report/Notes ||
============================================================================
| Patch URL | http://issues.apache.org/jira/secure/attachment/12645519/YARN-1515.v08.patch |
| Optional Tests | javac unit findbugs checkstyle javadoc |
| git revision | trunk / f1a152c |
============================================================================
============================================================================
Adding comment to JIRA
============================================================================
============================================================================
Comment added.
8f08819476d6fcb6770ce334e2537c9b8eb77cec logged out
============================================================================
============================================================================
Finished build.
============================================================================
============================================================================
Build step 'Execute shell' marked build as failure
Archiving artifacts
Description set: MAPREDUCE-6345
Recording test results
Email was triggered for: Failure
Sending email for trigger: Failure
###################################################################################
############################## FAILED TESTS (if any) ##############################
No tests ran.
Failed: YARN-2151 PreCommit Build #7614
Posted by Apache Jenkins Server <je...@builds.apache.org>.
Jira: https://issues.apache.org/jira/browse/YARN-2151
Build: https://builds.apache.org/job/PreCommit-YARN-Build/7614/
###################################################################################
########################## LAST 60 LINES OF THE CONSOLE ###########################
[...truncated 137 lines...]
error: patch failed: hadoop-yarn-project/hadoop-yarn/hadoop-yarn-server/hadoop-yarn-server-resourcemanager/src/test/java/org/apache/hadoop/yarn/server/resourcemanager/scheduler/fair/TestAllocationFileLoaderService.java:458
error: hadoop-yarn-project/hadoop-yarn/hadoop-yarn-server/hadoop-yarn-server-resourcemanager/src/test/java/org/apache/hadoop/yarn/server/resourcemanager/scheduler/fair/TestAllocationFileLoaderService.java: patch does not apply
Checking patch hadoop-yarn-project/hadoop-yarn/hadoop-yarn-server/hadoop-yarn-server-resourcemanager/src/test/java/org/apache/hadoop/yarn/server/resourcemanager/scheduler/fair/TestFairScheduler.java...
Hunk #1 succeeded at 47 (offset 4 lines).
error: while searching for:
createSchedulingRequest(1024, 1, "queue1", "user1", 3);
scheduler.moveApplication(appAttId.getApplicationId(), "queue2");
}
}
error: patch failed: hadoop-yarn-project/hadoop-yarn/hadoop-yarn-server/hadoop-yarn-server-resourcemanager/src/test/java/org/apache/hadoop/yarn/server/resourcemanager/scheduler/fair/TestFairScheduler.java:2956
error: hadoop-yarn-project/hadoop-yarn/hadoop-yarn-server/hadoop-yarn-server-resourcemanager/src/test/java/org/apache/hadoop/yarn/server/resourcemanager/scheduler/fair/TestFairScheduler.java: patch does not apply
PATCH APPLICATION FAILED
Elapsed time: 0m 1s
-1 overall
| Vote | Subsystem | Runtime | Comment
============================================================================
| -1 | patch | 0m 1s | The patch command could not apply the
| | | | patch during dryrun.
|| Subsystem || Report/Notes ||
============================================================================
| Patch URL | http://issues.apache.org/jira/secure/attachment/12649887/YARN-2151.patch |
| Optional Tests | javadoc javac unit findbugs checkstyle |
| git revision | trunk / f1a152c |
============================================================================
============================================================================
Adding comment to JIRA
============================================================================
============================================================================
Comment added.
c93f8c367510b1cb1964164f782f5ffc3829bd4b logged out
============================================================================
============================================================================
Finished build.
============================================================================
============================================================================
Build step 'Execute shell' marked build as failure
Archiving artifacts
Description set: MAPREDUCE-6345
Recording test results
Email was triggered for: Failure
Sending email for trigger: Failure
###################################################################################
############################## FAILED TESTS (if any) ##############################
No tests ran.
Failed: YARN-126 PreCommit Build #7613
Posted by Apache Jenkins Server <je...@builds.apache.org>.
Jira: https://issues.apache.org/jira/browse/YARN-126
Build: https://builds.apache.org/job/PreCommit-YARN-Build/7613/
###################################################################################
########################## LAST 60 LINES OF THE CONSOLE ###########################
[...truncated 37 lines...]
Confirming git environment
============================================================================
============================================================================
HEAD is now at f1a152c MAPREDUCE-6345. Documentation fix for when CRLA is enabled for MRAppMaster logs. (Rohit Agarwal via gera)
Switched to branch 'trunk'
Your branch is up-to-date with 'origin/trunk'.
Current branch trunk is up to date.
Already on 'trunk'
Your branch is up-to-date with 'origin/trunk'.
Current branch trunk is up to date.
Testing YARN-126 patch on trunk.
The patch does not appear to apply with p0 to p2
PATCH APPLICATION FAILED
Elapsed time: 0m 0s
-1 overall
| Vote | Subsystem | Runtime | Comment
============================================================================
| -1 | patch | 0m 0s | The patch command could not apply the
| | | | patch during dryrun.
|| Subsystem || Report/Notes ||
============================================================================
| Patch URL | http://issues.apache.org/jira/secure/attachment/12580129/YARN-126.patch |
| Optional Tests | javadoc javac unit findbugs checkstyle |
| git revision | trunk / f1a152c |
============================================================================
============================================================================
Adding comment to JIRA
============================================================================
============================================================================
Comment added.
9328a007163fd0b8fb64b11d8263dbf1c1b832a4 logged out
============================================================================
============================================================================
Finished build.
============================================================================
============================================================================
Build step 'Execute shell' marked build as failure
Archiving artifacts
Description set: MAPREDUCE-6345
Recording test results
Email was triggered for: Failure
Sending email for trigger: Failure
###################################################################################
############################## FAILED TESTS (if any) ##############################
No tests ran.
Failed: YARN-1782 PreCommit Build #7612
Posted by Apache Jenkins Server <je...@builds.apache.org>.
Jira: https://issues.apache.org/jira/browse/YARN-1782
Build: https://builds.apache.org/job/PreCommit-YARN-Build/7612/
###################################################################################
########################## LAST 60 LINES OF THE CONSOLE ###########################
[...truncated 37 lines...]
Confirming git environment
============================================================================
============================================================================
HEAD is now at f1a152c MAPREDUCE-6345. Documentation fix for when CRLA is enabled for MRAppMaster logs. (Rohit Agarwal via gera)
Switched to branch 'trunk'
Your branch is up-to-date with 'origin/trunk'.
Current branch trunk is up to date.
Already on 'trunk'
Your branch is up-to-date with 'origin/trunk'.
Current branch trunk is up to date.
Testing YARN-1782 patch on trunk.
The patch does not appear to apply with p0 to p2
PATCH APPLICATION FAILED
Elapsed time: 0m 0s
-1 overall
| Vote | Subsystem | Runtime | Comment
============================================================================
| -1 | patch | 0m 0s | The patch command could not apply the
| | | | patch during dryrun.
|| Subsystem || Report/Notes ||
============================================================================
| Patch URL | http://issues.apache.org/jira/secure/attachment/12650527/YARN-1782.patch |
| Optional Tests | shellcheck javadoc javac unit findbugs checkstyle site |
| git revision | trunk / f1a152c |
============================================================================
============================================================================
Adding comment to JIRA
============================================================================
============================================================================
Comment added.
f402b1da7b715df9a6836e36b91fd97fca7896ae logged out
============================================================================
============================================================================
Finished build.
============================================================================
============================================================================
Build step 'Execute shell' marked build as failure
Archiving artifacts
Description set: MAPREDUCE-6345
Recording test results
Email was triggered for: Failure
Sending email for trigger: Failure
###################################################################################
############################## FAILED TESTS (if any) ##############################
No tests ran.
Failed: YARN-1287 PreCommit Build #7611
Posted by Apache Jenkins Server <je...@builds.apache.org>.
Jira: https://issues.apache.org/jira/browse/YARN-1287
Build: https://builds.apache.org/job/PreCommit-YARN-Build/7611/
###################################################################################
########################## LAST 60 LINES OF THE CONSOLE ###########################
[...truncated 75 lines...]
error: patch failed: hadoop-yarn-project/hadoop-yarn/hadoop-yarn-server/hadoop-yarn-server-resourcemanager/src/test/java/org/apache/hadoop/yarn/server/resourcemanager/scheduler/fair/TestFairScheduler.java:88
error: hadoop-yarn-project/hadoop-yarn/hadoop-yarn-server/hadoop-yarn-server-resourcemanager/src/test/java/org/apache/hadoop/yarn/server/resourcemanager/scheduler/fair/TestFairScheduler.java: patch does not apply
Checking patch hadoop-yarn-project/hadoop-yarn/hadoop-yarn-server/hadoop-yarn-server-resourcemanager/src/test/java/org/apache/hadoop/yarn/server/resourcemanager/scheduler/fair/TestMaxRunningAppsEnforcer.java...
error: while searching for:
import org.apache.hadoop.conf.Configuration;
import org.apache.hadoop.yarn.api.records.ApplicationAttemptId;
import org.apache.hadoop.yarn.api.records.ApplicationId;
import org.junit.Before;
import org.junit.Test;
error: patch failed: hadoop-yarn-project/hadoop-yarn/hadoop-yarn-server/hadoop-yarn-server-resourcemanager/src/test/java/org/apache/hadoop/yarn/server/resourcemanager/scheduler/fair/TestMaxRunningAppsEnforcer.java:26
error: hadoop-yarn-project/hadoop-yarn/hadoop-yarn-server/hadoop-yarn-server-resourcemanager/src/test/java/org/apache/hadoop/yarn/server/resourcemanager/scheduler/fair/TestMaxRunningAppsEnforcer.java: patch does not apply
PATCH APPLICATION FAILED
Elapsed time: 0m 1s
-1 overall
| Vote | Subsystem | Runtime | Comment
============================================================================
| -1 | patch | 0m 1s | The patch command could not apply the
| | | | patch during dryrun.
|| Subsystem || Report/Notes ||
============================================================================
| Patch URL | http://issues.apache.org/jira/secure/attachment/12621781/YARN-1287-3.patch |
| Optional Tests | javac unit findbugs checkstyle |
| git revision | trunk / f1a152c |
============================================================================
============================================================================
Adding comment to JIRA
============================================================================
============================================================================
Comment added.
06c31a775add3fe506dd8108ddf8be66f8d144eb logged out
============================================================================
============================================================================
Finished build.
============================================================================
============================================================================
Build step 'Execute shell' marked build as failure
Archiving artifacts
Description set: MAPREDUCE-6345
Recording test results
Email was triggered for: Failure
Sending email for trigger: Failure
###################################################################################
############################## FAILED TESTS (if any) ##############################
No tests ran.
Failed: YARN-2120 PreCommit Build #7610
Posted by Apache Jenkins Server <je...@builds.apache.org>.
Jira: https://issues.apache.org/jira/browse/YARN-2120
Build: https://builds.apache.org/job/PreCommit-YARN-Build/7610/
###################################################################################
########################## LAST 60 LINES OF THE CONSOLE ###########################
[...truncated 37 lines...]
Confirming git environment
============================================================================
============================================================================
HEAD is now at f1a152c MAPREDUCE-6345. Documentation fix for when CRLA is enabled for MRAppMaster logs. (Rohit Agarwal via gera)
Switched to branch 'trunk'
Your branch is up-to-date with 'origin/trunk'.
Current branch trunk is up to date.
Already on 'trunk'
Your branch is up-to-date with 'origin/trunk'.
Current branch trunk is up to date.
Testing YARN-2120 patch on trunk.
The patch does not appear to apply with p0 to p2
PATCH APPLICATION FAILED
Elapsed time: 0m 0s
-1 overall
| Vote | Subsystem | Runtime | Comment
============================================================================
| -1 | patch | 0m 0s | The patch command could not apply the
| | | | patch during dryrun.
|| Subsystem || Report/Notes ||
============================================================================
| Patch URL | http://issues.apache.org/jira/secure/attachment/12648681/YARN-2120.v2.patch |
| Optional Tests | javadoc javac unit findbugs checkstyle |
| git revision | trunk / f1a152c |
============================================================================
============================================================================
Adding comment to JIRA
============================================================================
============================================================================
Comment added.
0cfda9ce86bae6936a1468231bc45d1d9c4cd57c logged out
============================================================================
============================================================================
Finished build.
============================================================================
============================================================================
Build step 'Execute shell' marked build as failure
Archiving artifacts
Description set: MAPREDUCE-6345
Recording test results
Email was triggered for: Failure
Sending email for trigger: Failure
###################################################################################
############################## FAILED TESTS (if any) ##############################
No tests ran.
Failed: YARN-1805 PreCommit Build #7609
Posted by Apache Jenkins Server <je...@builds.apache.org>.
Jira: https://issues.apache.org/jira/browse/YARN-1805
Build: https://builds.apache.org/job/PreCommit-YARN-Build/7609/
###################################################################################
########################## LAST 60 LINES OF THE CONSOLE ###########################
[...truncated 243 lines...]
error: hadoop-yarn-project/hadoop-yarn/hadoop-yarn-server/hadoop-yarn-server-nodemanager/src/test/java/org/apache/hadoop/yarn/server/nodemanager/containermanager/TestContainerManager.java: patch does not apply
Checking patch hadoop-yarn-project/hadoop-yarn/hadoop-yarn-server/hadoop-yarn-server-nodemanager/src/test/java/org/apache/hadoop/yarn/server/nodemanager/containermanager/monitor/TestContainersMonitor.java...
error: while searching for:
import org.apache.hadoop.yarn.api.records.LocalResourceType;
import org.apache.hadoop.yarn.api.records.LocalResourceVisibility;
import org.apache.hadoop.yarn.api.records.Resource;
import org.apache.hadoop.yarn.api.records.Token;
import org.apache.hadoop.yarn.api.records.URL;
import org.apache.hadoop.yarn.conf.YarnConfiguration;
error: patch failed: hadoop-yarn-project/hadoop-yarn/hadoop-yarn-server/hadoop-yarn-server-nodemanager/src/test/java/org/apache/hadoop/yarn/server/nodemanager/containermanager/monitor/TestContainersMonitor.java:53
error: hadoop-yarn-project/hadoop-yarn/hadoop-yarn-server/hadoop-yarn-server-nodemanager/src/test/java/org/apache/hadoop/yarn/server/nodemanager/containermanager/monitor/TestContainersMonitor.java: patch does not apply
Checking patch hadoop-yarn-project/hadoop-yarn/hadoop-yarn-server/hadoop-yarn-server-resourcemanager/src/main/java/org/apache/hadoop/yarn/server/resourcemanager/ResourceTrackerService.java...
Hunk #1 succeeded at 441 (offset 47 lines).
PATCH APPLICATION FAILED
Elapsed time: 0m 1s
-1 overall
| Vote | Subsystem | Runtime | Comment
============================================================================
| -1 | patch | 0m 1s | The patch command could not apply the
| | | | patch during dryrun.
|| Subsystem || Report/Notes ||
============================================================================
| Patch URL | http://issues.apache.org/jira/secure/attachment/12643371/YARN-1805.patch |
| Optional Tests | javadoc javac unit findbugs checkstyle |
| git revision | trunk / f1a152c |
============================================================================
============================================================================
Adding comment to JIRA
============================================================================
============================================================================
Comment added.
1acb0b1a66de8c41f1787214c8a1fd2129c4c0cf logged out
============================================================================
============================================================================
Finished build.
============================================================================
============================================================================
Build step 'Execute shell' marked build as failure
Archiving artifacts
Description set: MAPREDUCE-6345
Recording test results
Email was triggered for: Failure
Sending email for trigger: Failure
###################################################################################
############################## FAILED TESTS (if any) ##############################
No tests ran.