You are viewing a plain text version of this content. The canonical link for it is here.
Posted to dev@kafka.apache.org by Apache Jenkins Server <je...@builds.apache.org> on 2018/05/03 18:22:51 UTC

Build failed in Jenkins: kafka-1.1-jdk7 #124

See <https://builds.apache.org/job/kafka-1.1-jdk7/124/display/redirect?page=changes>

Changes:

[ismael] KAFKA-6853: ZooKeeperRequestLatencyMs is incorrect (#4961)

------------------------------------------
[...truncated 417.67 KB...]
kafka.admin.ResetConsumerGroupOffsetTest > testResetOffsetsNewConsumerExistingTopic PASSED

kafka.admin.ResetConsumerGroupOffsetTest > testResetOffsetsShiftByLowerThanEarliest STARTED

kafka.admin.ResetConsumerGroupOffsetTest > testResetOffsetsShiftByLowerThanEarliest PASSED

kafka.admin.ResetConsumerGroupOffsetTest > testResetOffsetsByDuration STARTED

kafka.admin.ResetConsumerGroupOffsetTest > testResetOffsetsByDuration PASSED

kafka.admin.ResetConsumerGroupOffsetTest > testResetOffsetsToLocalDateTime STARTED

kafka.admin.ResetConsumerGroupOffsetTest > testResetOffsetsToLocalDateTime PASSED

kafka.admin.ResetConsumerGroupOffsetTest > testResetOffsetsToEarliestOnTopicsAndPartitions STARTED

kafka.admin.ResetConsumerGroupOffsetTest > testResetOffsetsToEarliestOnTopicsAndPartitions PASSED

kafka.admin.ResetConsumerGroupOffsetTest > testResetOffsetsToEarliestOnTopics STARTED

kafka.admin.ResetConsumerGroupOffsetTest > testResetOffsetsToEarliestOnTopics PASSED

kafka.admin.ReassignPartitionsCommandArgsTest > shouldFailIfBlankArg STARTED

kafka.admin.ReassignPartitionsCommandArgsTest > shouldFailIfBlankArg PASSED

kafka.admin.ReassignPartitionsCommandArgsTest > shouldNotAllowVerifyWithoutReassignmentOption STARTED

kafka.admin.ReassignPartitionsCommandArgsTest > shouldNotAllowVerifyWithoutReassignmentOption PASSED

kafka.admin.ReassignPartitionsCommandArgsTest > shouldNotAllowGenerateWithoutBrokersOption STARTED

kafka.admin.ReassignPartitionsCommandArgsTest > shouldNotAllowGenerateWithoutBrokersOption PASSED

kafka.admin.ReassignPartitionsCommandArgsTest > shouldNotAllowTopicsOptionWithVerify STARTED

kafka.admin.ReassignPartitionsCommandArgsTest > shouldNotAllowTopicsOptionWithVerify PASSED

kafka.admin.ReassignPartitionsCommandArgsTest > shouldNotAllowGenerateWithThrottleOption STARTED

kafka.admin.ReassignPartitionsCommandArgsTest > shouldNotAllowGenerateWithThrottleOption PASSED

kafka.admin.ReassignPartitionsCommandArgsTest > shouldFailIfNoArgs STARTED

kafka.admin.ReassignPartitionsCommandArgsTest > shouldFailIfNoArgs PASSED

kafka.admin.ReassignPartitionsCommandArgsTest > shouldNotAllowExecuteWithoutReassignmentOption STARTED

kafka.admin.ReassignPartitionsCommandArgsTest > shouldNotAllowExecuteWithoutReassignmentOption PASSED

kafka.admin.ReassignPartitionsCommandArgsTest > shouldNotAllowBrokersListWithVerifyOption STARTED

kafka.admin.ReassignPartitionsCommandArgsTest > shouldNotAllowBrokersListWithVerifyOption PASSED

kafka.admin.ReassignPartitionsCommandArgsTest > shouldCorrectlyParseValidMinimumExecuteOptions STARTED

kafka.admin.ReassignPartitionsCommandArgsTest > shouldCorrectlyParseValidMinimumExecuteOptions PASSED

kafka.admin.ReassignPartitionsCommandArgsTest > shouldNotAllowGenerateWithReassignmentOption STARTED

kafka.admin.ReassignPartitionsCommandArgsTest > shouldNotAllowGenerateWithReassignmentOption PASSED

kafka.admin.ReassignPartitionsCommandArgsTest > shouldCorrectlyParseValidMinimumGenerateOptions STARTED

kafka.admin.ReassignPartitionsCommandArgsTest > shouldCorrectlyParseValidMinimumGenerateOptions PASSED

kafka.admin.ReassignPartitionsCommandArgsTest > shouldNotAllowGenerateWithoutBrokersAndTopicsOptions STARTED

kafka.admin.ReassignPartitionsCommandArgsTest > shouldNotAllowGenerateWithoutBrokersAndTopicsOptions PASSED

kafka.admin.ReassignPartitionsCommandArgsTest > shouldNotAllowThrottleWithVerifyOption STARTED

kafka.admin.ReassignPartitionsCommandArgsTest > shouldNotAllowThrottleWithVerifyOption PASSED

kafka.admin.ReassignPartitionsCommandArgsTest > shouldUseDefaultsIfEnabled STARTED

kafka.admin.ReassignPartitionsCommandArgsTest > shouldUseDefaultsIfEnabled PASSED

kafka.admin.ReassignPartitionsCommandArgsTest > shouldAllowThrottleOptionOnExecute STARTED

kafka.admin.ReassignPartitionsCommandArgsTest > shouldAllowThrottleOptionOnExecute PASSED

kafka.admin.ReassignPartitionsCommandArgsTest > shouldNotAllowExecuteWithBrokers STARTED

kafka.admin.ReassignPartitionsCommandArgsTest > shouldNotAllowExecuteWithBrokers PASSED

kafka.admin.ReassignPartitionsCommandArgsTest > shouldNotAllowExecuteWithTopicsOption STARTED

kafka.admin.ReassignPartitionsCommandArgsTest > shouldNotAllowExecuteWithTopicsOption PASSED

kafka.admin.ReassignPartitionsCommandArgsTest > shouldCorrectlyParseValidMinimumVerifyOptions STARTED

kafka.admin.ReassignPartitionsCommandArgsTest > shouldCorrectlyParseValidMinimumVerifyOptions PASSED

kafka.admin.ReassignPartitionsCommandArgsTest > shouldNotAllowGenerateWithoutTopicsOption STARTED

kafka.admin.ReassignPartitionsCommandArgsTest > shouldNotAllowGenerateWithoutTopicsOption PASSED

kafka.admin.BrokerApiVersionsCommandTest > checkBrokerApiVersionCommandOutput STARTED

kafka.admin.BrokerApiVersionsCommandTest > checkBrokerApiVersionCommandOutput PASSED

kafka.admin.TopicCommandTest > testCreateIfNotExists STARTED

kafka.admin.TopicCommandTest > testCreateIfNotExists PASSED

kafka.admin.TopicCommandTest > testCreateAlterTopicWithRackAware STARTED

kafka.admin.TopicCommandTest > testCreateAlterTopicWithRackAware PASSED

kafka.admin.TopicCommandTest > testTopicDeletion STARTED

kafka.admin.TopicCommandTest > testTopicDeletion PASSED

kafka.admin.TopicCommandTest > testConfigPreservationAcrossPartitionAlteration STARTED

kafka.admin.TopicCommandTest > testConfigPreservationAcrossPartitionAlteration PASSED

kafka.admin.TopicCommandTest > testAlterIfExists STARTED

kafka.admin.TopicCommandTest > testAlterIfExists PASSED

kafka.admin.TopicCommandTest > testDescribeAndListTopicsMarkedForDeletion STARTED

kafka.admin.TopicCommandTest > testDescribeAndListTopicsMarkedForDeletion PASSED

kafka.admin.TopicCommandTest > testDeleteIfExists STARTED

kafka.admin.TopicCommandTest > testDeleteIfExists PASSED

kafka.admin.AdminZkClientTest > testGetBrokerMetadatas STARTED

kafka.admin.AdminZkClientTest > testGetBrokerMetadatas PASSED

kafka.admin.AdminZkClientTest > testBootstrapClientIdConfig STARTED

kafka.admin.AdminZkClientTest > testBootstrapClientIdConfig PASSED

kafka.admin.AdminZkClientTest > testTopicConfigChange STARTED

kafka.admin.AdminZkClientTest > testTopicConfigChange PASSED

kafka.admin.AdminZkClientTest > testManualReplicaAssignment STARTED

kafka.admin.AdminZkClientTest > testManualReplicaAssignment PASSED

kafka.admin.AdminZkClientTest > testConcurrentTopicCreation STARTED

kafka.admin.AdminZkClientTest > testConcurrentTopicCreation PASSED

kafka.admin.AdminZkClientTest > shouldPropagateDynamicBrokerConfigs STARTED

kafka.admin.AdminZkClientTest > shouldPropagateDynamicBrokerConfigs PASSED

kafka.admin.AdminZkClientTest > testTopicCreationWithCollision STARTED

kafka.admin.AdminZkClientTest > testTopicCreationWithCollision PASSED

kafka.admin.AdminZkClientTest > testTopicCreationInZK STARTED

kafka.admin.AdminZkClientTest > testTopicCreationInZK PASSED

unit.kafka.admin.DeleteConsumerGroupTest > testDeleteCmdInvalidGroupId STARTED

unit.kafka.admin.DeleteConsumerGroupTest > testDeleteCmdInvalidGroupId PASSED

unit.kafka.admin.DeleteConsumerGroupTest > testDeleteNonEmptyGroup STARTED

unit.kafka.admin.DeleteConsumerGroupTest > testDeleteNonEmptyGroup PASSED

unit.kafka.admin.DeleteConsumerGroupTest > testDeleteCmdWithMixOfSuccessAndError STARTED

unit.kafka.admin.DeleteConsumerGroupTest > testDeleteCmdWithMixOfSuccessAndError PASSED

unit.kafka.admin.DeleteConsumerGroupTest > testDeleteWithShortInitialization STARTED

unit.kafka.admin.DeleteConsumerGroupTest > testDeleteWithShortInitialization PASSED

unit.kafka.admin.DeleteConsumerGroupTest > testDeleteCmdWithShortInitialization STARTED

unit.kafka.admin.DeleteConsumerGroupTest > testDeleteCmdWithShortInitialization PASSED

unit.kafka.admin.DeleteConsumerGroupTest > testDeleteWithTopicOption STARTED

unit.kafka.admin.DeleteConsumerGroupTest > testDeleteWithTopicOption PASSED

unit.kafka.admin.DeleteConsumerGroupTest > testDeleteNonExistingGroup STARTED

unit.kafka.admin.DeleteConsumerGroupTest > testDeleteNonExistingGroup PASSED

unit.kafka.admin.DeleteConsumerGroupTest > testDeleteCmdNonEmptyGroup STARTED

unit.kafka.admin.DeleteConsumerGroupTest > testDeleteCmdNonEmptyGroup PASSED

unit.kafka.admin.DeleteConsumerGroupTest > testDeleteCmdNonExistingGroup STARTED

unit.kafka.admin.DeleteConsumerGroupTest > testDeleteCmdNonExistingGroup PASSED

unit.kafka.admin.DeleteConsumerGroupTest > testDeleteEmptyGroup STARTED

unit.kafka.admin.DeleteConsumerGroupTest > testDeleteEmptyGroup PASSED

unit.kafka.admin.DeleteConsumerGroupTest > testDeleteWithMixOfSuccessAndError STARTED

unit.kafka.admin.DeleteConsumerGroupTest > testDeleteWithMixOfSuccessAndError PASSED

unit.kafka.admin.DeleteConsumerGroupTest > testDeleteCmdEmptyGroup STARTED

unit.kafka.admin.DeleteConsumerGroupTest > testDeleteCmdEmptyGroup PASSED

unit.kafka.admin.DeleteConsumerGroupTest > testDeleteInvalidGroupId STARTED

unit.kafka.admin.DeleteConsumerGroupTest > testDeleteInvalidGroupId PASSED

1898 tests completed, 1 failed, 6 skipped
:kafka-1.1-jdk7:core:test FAILED
:test_core_2_11 FAILED

FAILURE: Build failed with an exception.

* What went wrong:
Execution failed for task ':kafka-1.1-jdk7:core:test'.
> There were failing tests. See the report at: file://<https://builds.apache.org/job/kafka-1.1-jdk7/ws/core/build/reports/tests/test/index.html>

* Try:
Run with --stacktrace option to get the stack trace. Run with --info or --debug option to get more log output. Run with --scan to get full insights.

* Get more help at https://help.gradle.org

Deprecated Gradle features were used in this build, making it incompatible with Gradle 5.0.
See https://docs.gradle.org/4.5.1/userguide/command_line_interface.html#sec:command_line_warnings

BUILD FAILED in 1h 6m 10s
22 actionable tasks: 2 executed, 20 up-to-date
Build step 'Execute shell' marked build as failure
[FINDBUGS] Collecting findbugs analysis files...
Setting GRADLE_3_5_HOME=/home/jenkins/tools/gradle/3.5
[FINDBUGS] Searching for all files in <https://builds.apache.org/job/kafka-1.1-jdk7/ws/> that match the pattern **/build/reports/findbugs/*.xml
[FINDBUGS] Parsing 1 file in <https://builds.apache.org/job/kafka-1.1-jdk7/ws/>
[FINDBUGS] Successfully parsed file <https://builds.apache.org/job/kafka-1.1-jdk7/ws/core/build/reports/findbugs/main.xml> with 0 unique warnings and 0 duplicates.
Setting GRADLE_3_5_HOME=/home/jenkins/tools/gradle/3.5
Setting GRADLE_3_5_HOME=/home/jenkins/tools/gradle/3.5
<Git Blamer> Using GitBlamer to create author and commit information for all warnings.
<Git Blamer> GIT_COMMIT=22d6e214635ea4017472765e9edcf07adfb2cd6b, workspace=<https://builds.apache.org/job/kafka-1.1-jdk7/ws/>
[FINDBUGS] Computing warning deltas based on reference build #123
Recording test results
Setting GRADLE_3_5_HOME=/home/jenkins/tools/gradle/3.5
Setting GRADLE_3_5_HOME=/home/jenkins/tools/gradle/3.5
Not sending mail to unregistered user ismael@juma.me.uk

Jenkins build is back to normal : kafka-1.1-jdk7 #126

Posted by Apache Jenkins Server <je...@builds.apache.org>.
See <https://builds.apache.org/job/kafka-1.1-jdk7/126/display/redirect?page=changes>


Build failed in Jenkins: kafka-1.1-jdk7 #125

Posted by Apache Jenkins Server <je...@builds.apache.org>.
See <https://builds.apache.org/job/kafka-1.1-jdk7/125/display/redirect?page=changes>

Changes:

[jason] KAFKA-6854; Handle batches deleted during log cleaning of logs with txns

------------------------------------------
[...truncated 417.96 KB...]

kafka.log.LogCleanerIntegrationTest > testCleansCombinedCompactAndDeleteTopic[1] PASSED

kafka.log.LogCleanerIntegrationTest > testCleaningNestedMessagesWithMultipleVersions[1] STARTED

kafka.log.LogCleanerIntegrationTest > testCleaningNestedMessagesWithMultipleVersions[1] PASSED

kafka.log.LogCleanerIntegrationTest > cleanerTest[1] STARTED

kafka.log.LogCleanerIntegrationTest > cleanerTest[1] PASSED

kafka.log.LogCleanerIntegrationTest > testCleanerWithMessageFormatV0[1] STARTED

kafka.log.LogCleanerIntegrationTest > testCleanerWithMessageFormatV0[1] PASSED

kafka.log.LogCleanerIntegrationTest > cleanerConfigUpdateTest[2] STARTED

kafka.log.LogCleanerIntegrationTest > cleanerConfigUpdateTest[2] PASSED

kafka.log.LogCleanerIntegrationTest > testCleansCombinedCompactAndDeleteTopic[2] STARTED

kafka.log.LogCleanerIntegrationTest > testCleansCombinedCompactAndDeleteTopic[2] PASSED

kafka.log.LogCleanerIntegrationTest > testCleaningNestedMessagesWithMultipleVersions[2] STARTED

kafka.log.LogCleanerIntegrationTest > testCleaningNestedMessagesWithMultipleVersions[2] PASSED

kafka.log.LogCleanerIntegrationTest > cleanerTest[2] STARTED

kafka.log.LogCleanerIntegrationTest > cleanerTest[2] PASSED

kafka.log.LogCleanerIntegrationTest > testCleanerWithMessageFormatV0[2] STARTED

kafka.log.LogCleanerIntegrationTest > testCleanerWithMessageFormatV0[2] PASSED

kafka.log.LogCleanerIntegrationTest > cleanerConfigUpdateTest[3] STARTED

kafka.log.LogCleanerIntegrationTest > cleanerConfigUpdateTest[3] PASSED

kafka.log.LogCleanerIntegrationTest > testCleansCombinedCompactAndDeleteTopic[3] STARTED

kafka.log.LogCleanerIntegrationTest > testCleansCombinedCompactAndDeleteTopic[3] PASSED

kafka.log.LogCleanerIntegrationTest > testCleaningNestedMessagesWithMultipleVersions[3] STARTED

kafka.log.LogCleanerIntegrationTest > testCleaningNestedMessagesWithMultipleVersions[3] PASSED

kafka.log.LogCleanerIntegrationTest > cleanerTest[3] STARTED
ERROR: Could not install GRADLE_3_5_HOME
java.lang.NullPointerException
	at hudson.plugins.toolenv.ToolEnvBuildWrapper$1.buildEnvVars(ToolEnvBuildWrapper.java:46)
	at hudson.model.AbstractBuild.getEnvironment(AbstractBuild.java:895)
	at hudson.plugins.git.GitSCM.getParamExpandedRepos(GitSCM.java:458)
	at hudson.plugins.git.GitSCM.compareRemoteRevisionWithImpl(GitSCM.java:666)
	at hudson.plugins.git.GitSCM.compareRemoteRevisionWith(GitSCM.java:631)
	at hudson.scm.SCM.compareRemoteRevisionWith(SCM.java:391)
	at hudson.scm.SCM.poll(SCM.java:408)
	at hudson.model.AbstractProject._poll(AbstractProject.java:1384)
	at hudson.model.AbstractProject.poll(AbstractProject.java:1287)
	at hudson.triggers.SCMTrigger$Runner.runPolling(SCMTrigger.java:594)
	at hudson.triggers.SCMTrigger$Runner.run(SCMTrigger.java:640)
	at hudson.util.SequentialExecutionQueue$QueueEntry.run(SequentialExecutionQueue.java:119)
	at java.util.concurrent.Executors$RunnableAdapter.call(Executors.java:511)
	at java.util.concurrent.FutureTask.run(FutureTask.java:266)
	at java.util.concurrent.ThreadPoolExecutor.runWorker(ThreadPoolExecutor.java:1149)
	at java.util.concurrent.ThreadPoolExecutor$Worker.run(ThreadPoolExecutor.java:624)
	at java.lang.Thread.run(Thread.java:748)

kafka.log.LogCleanerIntegrationTest > cleanerTest[3] PASSED

kafka.log.LogCleanerIntegrationTest > testCleanerWithMessageFormatV0[3] STARTED

kafka.log.LogCleanerIntegrationTest > testCleanerWithMessageFormatV0[3] PASSED

kafka.log.ProducerStateManagerTest > testCoordinatorFencing STARTED

kafka.log.ProducerStateManagerTest > testCoordinatorFencing PASSED

kafka.log.ProducerStateManagerTest > testTruncate STARTED

kafka.log.ProducerStateManagerTest > testTruncate PASSED

kafka.log.ProducerStateManagerTest > testLoadFromTruncatedSnapshotFile STARTED

kafka.log.ProducerStateManagerTest > testLoadFromTruncatedSnapshotFile PASSED

kafka.log.ProducerStateManagerTest > testRemoveExpiredPidsOnReload STARTED

kafka.log.ProducerStateManagerTest > testRemoveExpiredPidsOnReload PASSED

kafka.log.ProducerStateManagerTest > testOutOfSequenceAfterControlRecordEpochBump STARTED

kafka.log.ProducerStateManagerTest > testOutOfSequenceAfterControlRecordEpochBump PASSED

kafka.log.ProducerStateManagerTest > testFirstUnstableOffsetAfterTruncation STARTED

kafka.log.ProducerStateManagerTest > testFirstUnstableOffsetAfterTruncation PASSED

kafka.log.ProducerStateManagerTest > testTakeSnapshot STARTED

kafka.log.ProducerStateManagerTest > testTakeSnapshot PASSED

kafka.log.ProducerStateManagerTest > testDeleteSnapshotsBefore STARTED

kafka.log.ProducerStateManagerTest > testDeleteSnapshotsBefore PASSED

kafka.log.ProducerStateManagerTest > testNonMatchingTxnFirstOffsetMetadataNotCached STARTED

kafka.log.ProducerStateManagerTest > testNonMatchingTxnFirstOffsetMetadataNotCached PASSED

kafka.log.ProducerStateManagerTest > testFirstUnstableOffsetAfterEviction STARTED

kafka.log.ProducerStateManagerTest > testFirstUnstableOffsetAfterEviction PASSED

kafka.log.ProducerStateManagerTest > testNoValidationOnFirstEntryWhenLoadingLog STARTED

kafka.log.ProducerStateManagerTest > testNoValidationOnFirstEntryWhenLoadingLog PASSED

kafka.log.ProducerStateManagerTest > testLoadFromEmptySnapshotFile STARTED

kafka.log.ProducerStateManagerTest > testLoadFromEmptySnapshotFile PASSED

kafka.log.ProducerStateManagerTest > testProducersWithOngoingTransactionsDontExpire STARTED

kafka.log.ProducerStateManagerTest > testProducersWithOngoingTransactionsDontExpire PASSED

kafka.log.ProducerStateManagerTest > testBasicIdMapping STARTED

kafka.log.ProducerStateManagerTest > testBasicIdMapping PASSED

kafka.log.ProducerStateManagerTest > updateProducerTransactionState STARTED

kafka.log.ProducerStateManagerTest > updateProducerTransactionState PASSED

kafka.log.ProducerStateManagerTest > testRecoverFromSnapshot STARTED

kafka.log.ProducerStateManagerTest > testRecoverFromSnapshot PASSED

kafka.log.ProducerStateManagerTest > testPrepareUpdateDoesNotMutate STARTED

kafka.log.ProducerStateManagerTest > testPrepareUpdateDoesNotMutate PASSED

kafka.log.ProducerStateManagerTest > testSequenceNotValidatedForGroupMetadataTopic STARTED

kafka.log.ProducerStateManagerTest > testSequenceNotValidatedForGroupMetadataTopic PASSED

kafka.log.ProducerStateManagerTest > testLoadFromSnapshotRemovesNonRetainedProducers STARTED

kafka.log.ProducerStateManagerTest > testLoadFromSnapshotRemovesNonRetainedProducers PASSED

kafka.log.ProducerStateManagerTest > testFirstUnstableOffset STARTED

kafka.log.ProducerStateManagerTest > testFirstUnstableOffset PASSED

kafka.log.ProducerStateManagerTest > testTxnFirstOffsetMetadataCached STARTED

kafka.log.ProducerStateManagerTest > testTxnFirstOffsetMetadataCached PASSED

kafka.log.ProducerStateManagerTest > testCoordinatorFencedAfterReload STARTED

kafka.log.ProducerStateManagerTest > testCoordinatorFencedAfterReload PASSED

kafka.log.ProducerStateManagerTest > testControlRecordBumpsEpoch STARTED

kafka.log.ProducerStateManagerTest > testControlRecordBumpsEpoch PASSED

kafka.log.ProducerStateManagerTest > testAcceptAppendWithoutProducerStateOnReplica STARTED

kafka.log.ProducerStateManagerTest > testAcceptAppendWithoutProducerStateOnReplica PASSED

kafka.log.ProducerStateManagerTest > testLoadFromCorruptSnapshotFile STARTED

kafka.log.ProducerStateManagerTest > testLoadFromCorruptSnapshotFile PASSED

kafka.log.ProducerStateManagerTest > testProducerSequenceWrapAround STARTED

kafka.log.ProducerStateManagerTest > testProducerSequenceWrapAround PASSED

kafka.log.ProducerStateManagerTest > testPidExpirationTimeout STARTED

kafka.log.ProducerStateManagerTest > testPidExpirationTimeout PASSED

kafka.log.ProducerStateManagerTest > testAcceptAppendWithSequenceGapsOnReplica STARTED

kafka.log.ProducerStateManagerTest > testAcceptAppendWithSequenceGapsOnReplica PASSED

kafka.log.ProducerStateManagerTest > testOldEpochForControlRecord STARTED

kafka.log.ProducerStateManagerTest > testOldEpochForControlRecord PASSED

kafka.log.ProducerStateManagerTest > testTruncateAndReloadRemovesOutOfRangeSnapshots STARTED

kafka.log.ProducerStateManagerTest > testTruncateAndReloadRemovesOutOfRangeSnapshots PASSED

kafka.log.ProducerStateManagerTest > testStartOffset STARTED

kafka.log.ProducerStateManagerTest > testStartOffset PASSED

kafka.log.ProducerStateManagerTest > testProducerSequenceInvalidWrapAround STARTED

kafka.log.ProducerStateManagerTest > testProducerSequenceInvalidWrapAround PASSED

kafka.log.ProducerStateManagerTest > testTruncateHead STARTED

kafka.log.ProducerStateManagerTest > testTruncateHead PASSED

kafka.log.ProducerStateManagerTest > testNonTransactionalAppendWithOngoingTransaction STARTED

kafka.log.ProducerStateManagerTest > testNonTransactionalAppendWithOngoingTransaction PASSED

kafka.log.ProducerStateManagerTest > testSkipSnapshotIfOffsetUnchanged STARTED

kafka.log.ProducerStateManagerTest > testSkipSnapshotIfOffsetUnchanged PASSED

1899 tests completed, 1 failed, 6 skipped
:kafka-1.1-jdk7:core:test FAILED
:test_core_2_11 FAILED

FAILURE: Build failed with an exception.

* What went wrong:
Execution failed for task ':kafka-1.1-jdk7:core:test'.
> There were failing tests. See the report at: file://<https://builds.apache.org/job/kafka-1.1-jdk7/ws/core/build/reports/tests/test/index.html>

* Try:
Run with --stacktrace option to get the stack trace. Run with --info or --debug option to get more log output. Run with --scan to get full insights.

* Get more help at https://help.gradle.org

Deprecated Gradle features were used in this build, making it incompatible with Gradle 5.0.
See https://docs.gradle.org/4.5.1/userguide/command_line_interface.html#sec:command_line_warnings

BUILD FAILED in 59m 46s
22 actionable tasks: 2 executed, 20 up-to-date
Build step 'Execute shell' marked build as failure
[FINDBUGS] Collecting findbugs analysis files...
Setting GRADLE_3_5_HOME=/home/jenkins/tools/gradle/3.5
[FINDBUGS] Searching for all files in <https://builds.apache.org/job/kafka-1.1-jdk7/ws/> that match the pattern **/build/reports/findbugs/*.xml
[FINDBUGS] Parsing 1 file in <https://builds.apache.org/job/kafka-1.1-jdk7/ws/>
[FINDBUGS] Successfully parsed file <https://builds.apache.org/job/kafka-1.1-jdk7/ws/core/build/reports/findbugs/main.xml> with 0 unique warnings and 0 duplicates.
Setting GRADLE_3_5_HOME=/home/jenkins/tools/gradle/3.5
Setting GRADLE_3_5_HOME=/home/jenkins/tools/gradle/3.5
<Git Blamer> Using GitBlamer to create author and commit information for all warnings.
<Git Blamer> GIT_COMMIT=962eef014bc56e30a308933ac220afeffd52918b, workspace=<https://builds.apache.org/job/kafka-1.1-jdk7/ws/>
[FINDBUGS] Computing warning deltas based on reference build #123
Recording test results
Setting GRADLE_3_5_HOME=/home/jenkins/tools/gradle/3.5
Setting GRADLE_3_5_HOME=/home/jenkins/tools/gradle/3.5
Not sending mail to unregistered user ismael@juma.me.uk