You are viewing a plain text version of this content. The canonical link for it is here.
Posted to dev@poi.apache.org by Apache Jenkins Server <je...@builds.apache.org> on 2015/09/08 02:15:05 UTC
Build failed in Jenkins: POI-JDK8 #564
See <https://builds.apache.org/job/POI-JDK8/564/changes>
Changes:
[kiwiwings] Bug 58326 - Forbidden APIs patches - second set of changes for charset settings
[kiwiwings] forbidden apis fixes
------------------------------------------
[...truncated 95 lines...]
U src/testcases/org/apache/poi/hpsf/basic/TestWriteWellKnown.java
U src/testcases/org/apache/poi/hssf/extractor/TestExcelExtractor.java
U src/testcases/org/apache/poi/hssf/usermodel/TestHSSFDateUtil.java
U src/testcases/org/apache/poi/hssf/usermodel/TestCellStyle.java
U src/testcases/org/apache/poi/hssf/usermodel/TestHSSFCell.java
U src/testcases/org/apache/poi/hssf/usermodel/TestFormulaEvaluatorBugs.java
U src/testcases/org/apache/poi/hssf/usermodel/TestHSSFDataFormatter.java
U src/testcases/org/apache/poi/hssf/usermodel/TestText.java
U src/testcases/org/apache/poi/hssf/usermodel/TestBugs.java
U src/testcases/org/apache/poi/hssf/usermodel/TestReadWriteChart.java
U src/testcases/org/apache/poi/ss/formula/eval/TestFormulasFromSpreadsheet.java
U src/testcases/org/apache/poi/ss/formula/functions/TestEDate.java
U src/testcases/org/apache/poi/ss/formula/functions/TestTime.java
U src/testcases/org/apache/poi/ss/formula/functions/TestEOMonth.java
U src/testcases/org/apache/poi/ss/formula/functions/TestDays360.java
U src/testcases/org/apache/poi/ss/formula/functions/TestText.java
U src/testcases/org/apache/poi/ss/formula/atp/TestNetworkdaysFunction.java
U src/testcases/org/apache/poi/ss/formula/atp/TestYearFracCalculatorFromSpreadsheet.java
U src/testcases/org/apache/poi/ss/formula/atp/TestWorkdayFunction.java
U src/testcases/org/apache/poi/ss/formula/atp/TestYearFracCalculator.java
U src/testcases/org/apache/poi/ss/formula/atp/TestDateParser.java
U src/testcases/org/apache/poi/ss/formula/atp/TestWorkdayCalculator.java
U src/testcases/org/apache/poi/ss/format/TestCellFormat.java
U src/testcases/org/apache/poi/ss/format/CellFormatTestBase.java
U src/testcases/org/apache/poi/ss/util/TestDateFormatConverter.java
U src/testcases/org/apache/poi/ss/usermodel/BaseTestSheetAutosizeColumn.java
U src/testcases/org/apache/poi/ss/usermodel/BaseTestCell.java
U src/testcases/org/apache/poi/ss/usermodel/TestDateUtil.java
U src/testcases/org/apache/poi/ss/usermodel/TestDataFormatter.java
U build.xml
Fetching 'https://svn.apache.org/repos/asf/poi/site/forrest.properties' at -1 into '<https://builds.apache.org/job/POI-JDK8/ws/forrest.properties'>
Fetching 'https://svn.apache.org/repos/asf/poi/site/src/documentation' at -1 into '<https://builds.apache.org/job/POI-JDK8/ws/src/documentation'>
At revision 1701713
At revision 1701713
no change for http://svn.apache.org/repos/asf/poi/trunk/forrest.properties since the previous build
no change for https://svn.apache.org/repos/asf/poi/site/src/documentation since the previous build
[EnvInject] - Executing scripts and injecting environment variables after the SCM step.
[EnvInject] - Injecting as environment variables the properties content
LANG=en_US.UTF-8
[EnvInject] - Variables injected successfully.
[POI-JDK8] $ /home/jenkins/tools/ant/latest/bin/ant -Dcoverage.enabled=true clean jenkins
Buildfile: <https://builds.apache.org/job/POI-JDK8/ws/build.xml>
clean:
[delete] Deleting directory <https://builds.apache.org/job/POI-JDK8/ws/build>
check-jars:
fetch-jars:
check-ooxml-jars:
fetch-ooxml-jars:
init:
[mkdir] Created dir: <https://builds.apache.org/job/POI-JDK8/ws/build>
[mkdir] Created dir: <https://builds.apache.org/job/POI-JDK8/ws/build/classes>
[mkdir] Created dir: <https://builds.apache.org/job/POI-JDK8/ws/build/test-classes>
[mkdir] Created dir: <https://builds.apache.org/job/POI-JDK8/ws/build/test-results>
[mkdir] Created dir: <https://builds.apache.org/job/POI-JDK8/ws/build/scratchpad-classes>
[mkdir] Created dir: <https://builds.apache.org/job/POI-JDK8/ws/build/scratchpad-test-classes>
[mkdir] Created dir: <https://builds.apache.org/job/POI-JDK8/ws/build/scratchpad-test-results>
[mkdir] Created dir: <https://builds.apache.org/job/POI-JDK8/ws/build/geometry-java>
[mkdir] Created dir: <https://builds.apache.org/job/POI-JDK8/ws/build/ooxml-classes>
[mkdir] Created dir: <https://builds.apache.org/job/POI-JDK8/ws/build/ooxml-test-classes>
[mkdir] Created dir: <https://builds.apache.org/job/POI-JDK8/ws/build/ooxml-test-results>
[mkdir] Created dir: <https://builds.apache.org/job/POI-JDK8/ws/build/excelant-classes>
[mkdir] Created dir: <https://builds.apache.org/job/POI-JDK8/ws/build/excelant-test-classes>
[mkdir] Created dir: <https://builds.apache.org/job/POI-JDK8/ws/build/excelant-test-results>
[mkdir] Created dir: <https://builds.apache.org/job/POI-JDK8/ws/build/examples-classes>
[mkdir] Created dir: <https://builds.apache.org/job/POI-JDK8/ws/build/integration-test-classes>
[mkdir] Created dir: <https://builds.apache.org/job/POI-JDK8/564/artifact/build/integration-test-results>
[mkdir] Created dir: <https://builds.apache.org/job/POI-JDK8/ws/build/dist>
[mkdir] Created dir: <https://builds.apache.org/job/POI-JDK8/ws/build/tmp/site/build/site>
[echo] Using Java: 1.8.0_20/1.8.0_20-b26/25.20-b23/Java HotSpot(TM) 64-Bit Server VM from Oracle Corporation on Linux: 3.13.0-36-lowlatency
compile-main:
[javac] Compiling 1179 source files to <https://builds.apache.org/job/POI-JDK8/ws/build/classes>
[javac] warning: [options] bootstrap class path not set in conjunction with -source 1.6
[javac] Note: Some input files use or override a deprecated API.
[javac] Note: Recompile with -Xlint:deprecation for details.
[javac] Note: Some input files use unchecked or unsafe operations.
[javac] Note: Recompile with -Xlint:unchecked for details.
[javac] 1 warning
[javac] Compiling 515 source files to <https://builds.apache.org/job/POI-JDK8/ws/build/test-classes>
[javac] warning: [options] bootstrap class path not set in conjunction with -source 1.6
[javac] Note: Some input files use or override a deprecated API.
[javac] Note: Recompile with -Xlint:deprecation for details.
[javac] Note: Some input files use unchecked or unsafe operations.
[javac] Note: Recompile with -Xlint:unchecked for details.
[javac] 1 warning
[copy] Copying 4 files to <https://builds.apache.org/job/POI-JDK8/ws/build/classes>
check-ooxml-xsds:
fetch-ooxml-xsds:
generate-geometry:
compile-scratchpad:
[javac] Compiling 506 source files to <https://builds.apache.org/job/POI-JDK8/ws/build/scratchpad-classes>
[javac] warning: [options] bootstrap class path not set in conjunction with -source 1.6
[javac] Note: Some input files use or override a deprecated API.
[javac] Note: Recompile with -Xlint:deprecation for details.
[javac] Note: Some input files use unchecked or unsafe operations.
[javac] Note: Recompile with -Xlint:unchecked for details.
[javac] 1 warning
[javac] Compiling 182 source files to <https://builds.apache.org/job/POI-JDK8/ws/build/scratchpad-test-classes>
[javac] warning: [options] bootstrap class path not set in conjunction with -source 1.6
[javac] Note: Some input files use or override a deprecated API.
[javac] Note: Recompile with -Xlint:deprecation for details.
[javac] Note: <https://builds.apache.org/job/POI-JDK8/ws/src/scratchpad/testcases/org/apache/poi/hslf/TestReWriteSanity.java> uses unchecked or unsafe operations.
[javac] Note: Recompile with -Xlint:unchecked for details.
[javac] 1 warning
[copy] Copying 2 files to <https://builds.apache.org/job/POI-JDK8/ws/build/scratchpad-classes>
check-compiled-ooxml-xsds:
compile-ooxml-xsds:
compile-ooxml:
[javac] Compiling 350 source files to <https://builds.apache.org/job/POI-JDK8/ws/build/ooxml-classes>
[javac] warning: [options] bootstrap class path not set in conjunction with -source 1.6
[javac] Note: Some input files use or override a deprecated API.
[javac] Note: Recompile with -Xlint:deprecation for details.
[javac] 1 warning
[javac] Compiling 186 source files to <https://builds.apache.org/job/POI-JDK8/ws/build/ooxml-test-classes>
[javac] warning: [options] bootstrap class path not set in conjunction with -source 1.6
[javac] Note: Some input files use or override a deprecated API.
[javac] Note: Recompile with -Xlint:deprecation for details.
[javac] 1 warning
[copy] Copying 2 files to <https://builds.apache.org/job/POI-JDK8/ws/build/ooxml-classes>
compile-examples:
[javac] Compiling 137 source files to <https://builds.apache.org/job/POI-JDK8/ws/build/examples-classes>
[javac] warning: [options] bootstrap class path not set in conjunction with -source 1.6
[javac] Note: Some input files use or override a deprecated API.
[javac] Note: Recompile with -Xlint:deprecation for details.
[javac] Note: Some input files use unchecked or unsafe operations.
[javac] Note: Recompile with -Xlint:unchecked for details.
[javac] 1 warning
[copy] Copying 1 file to <https://builds.apache.org/job/POI-JDK8/ws/build/examples-classes>
compile-excelant:
[javac] Compiling 14 source files to <https://builds.apache.org/job/POI-JDK8/ws/build/excelant-classes>
[javac] warning: [options] bootstrap class path not set in conjunction with -source 1.6
[javac] Note: <https://builds.apache.org/job/POI-JDK8/ws/src/excelant/java/org/apache/poi/ss/excelant/util/ExcelAntWorkbookUtil.java> uses or overrides a deprecated API.
[javac] Note: Recompile with -Xlint:deprecation for details.
[javac] 1 warning
[javac] Compiling 13 source files to <https://builds.apache.org/job/POI-JDK8/ws/build/excelant-test-classes>
[javac] warning: [options] bootstrap class path not set in conjunction with -source 1.6
[javac] 1 warning
[copy] Copying 1 file to <https://builds.apache.org/job/POI-JDK8/ws/build/excelant-classes>
compile:
compile-ooxml-lite:
[mkdir] Created dir: <https://builds.apache.org/job/POI-JDK8/ws/build/ooxml-lite-merged>
[jar] Building jar: <https://builds.apache.org/job/POI-JDK8/ws/build/ooxml-lite-merged/ooxml-lite-merged.jar>
[java] Java HotSpot(TM) 64-Bit Server VM warning: ignoring option MaxPermSize=256m; support was removed in 8.0
[java] Collecting unit tests from <https://builds.apache.org/job/POI-JDK8/ws/build/ooxml-test-classes>
[java] Found 168 classes
[java] SLF4J: Failed to load class "org.slf4j.impl.StaticLoggerBinder".
[java] SLF4J: Defaulting to no-operation (NOP) logger implementation
[java] SLF4J: See http://www.slf4j.org/codes.html#StaticLoggerBinder for further details.
[java] .....................................................................I.......................................................................................................................................................Name: /word/document.xml - Content Type: application/vnd.openxmlformats-officedocument.wordprocessingml.document.main+xml
[java] JAXP: find factoryId =javax.xml.stream.XMLInputFactory
[java] JAXP: found system property, value=com.sun.xml.internal.stream.XMLInputFactoryImpl
[java] JAXP: created new instance of class com.sun.xml.internal.stream.XMLInputFactoryImpl using ClassLoader: null
[java] [Fatal Error] :1:1: JAXP00010001: The parser has encountered more than "4096" entity expansions in this document; this is the limit imposed by the JDK.
[java] [Fatal Error] :1:1: JAXP00010001: The parser has encountered more than "4096" entity expansions in this document; this is the limit imposed by the JDK.
[java] Warning - Row 13 has no cell 1, can't figure out test name
[java] ...................................................................................................................II...........................................................................................................................................................................................................I......I......................I...................................................................................................................................................................................................................................................................................................................................................................................................................................................................................................................................................................................................................................................................Done
[java] ...........<?xml version="1.0" encoding="UTF-8"?>
[java] <worksheet xmlns="http://schemas.openxmlformats.org/spreadsheetml/2006/main"><dimension ref="A1"/><sheetViews><sheetView workbookViewId="0" tabSelected="true"/></sheetViews><sheetFormatPr defaultRowHeight="15.0"/><sheetData/><pageMargins bottom="0.75" footer="0.3" header="0.3" left="0.7" right="0.7" top="0.75"/></worksheet>
[java] ................................III.II.......I...............org.apache.poi.ss.usermodel.CellValue [12.0]
[java] org.apache.poi.ss.usermodel.CellValue [12.0]
[java] .....org.apache.poi.ss.usermodel.CellValue [1.0]
[java] org.apache.poi.ss.usermodel.CellValue [1.0]
[java] .org.apache.poi.ss.usermodel.CellValue [2.0]
[java] org.apache.poi.ss.usermodel.CellValue [2.0]
[java] .org.apache.poi.ss.usermodel.CellValue [2.0]
[java] .org.apache.poi.ss.usermodel.CellValue [2.0]
[java] .org.apache.poi.ss.usermodel.CellValue [2.0]
[java] .org.apache.poi.ss.usermodel.CellValue [3.0]
[java] .............................I...........................................................................................................................Setting col: 0 and row 0
[java] Setting col: 1 and row 1
[java] .........................................................................................................................................................................I......................................................................E...................
[java] Time: 87.46
[java] There was 1 failure:
[java] 1) testDateFormat(org.apache.poi.ss.format.TestCellFormatPart)
[java] org.junit.ComparisonFailure: format "h:m:s" expected:<"1[4]:35:27"> but was:<"1[3]:35:27">
[java] at org.junit.Assert.assertEquals(Assert.java:115)
[java] at org.apache.poi.ss.format.CellFormatTestBase$CellValue.equivalent(CellFormatTestBase.java:93)
[java] at org.apache.poi.ss.format.CellFormatTestBase.tryColor(CellFormatTestBase.java:245)
[java] at org.apache.poi.ss.format.CellFormatTestBase.tryFormat(CellFormatTestBase.java:219)
[java] at org.apache.poi.ss.format.CellFormatTestBase.runFormatTests(CellFormatTestBase.java:127)
[java] at org.apache.poi.ss.format.TestCellFormatPart.testDateFormat(TestCellFormatPart.java:105)
[java] at sun.reflect.NativeMethodAccessorImpl.invoke0(Native Method)
[java] at sun.reflect.NativeMethodAccessorImpl.invoke(NativeMethodAccessorImpl.java:62)
[java] at sun.reflect.DelegatingMethodAccessorImpl.invoke(DelegatingMethodAccessorImpl.java:43)
[java] at java.lang.reflect.Method.invoke(Method.java:483)
[java] at org.junit.runners.model.FrameworkMethod$1.runReflectiveCall(FrameworkMethod.java:50)
[java] at org.junit.internal.runners.model.ReflectiveCallable.run(ReflectiveCallable.java:12)
[java] at org.junit.runners.model.FrameworkMethod.invokeExplosively(FrameworkMethod.java:47)
[java] at org.junit.internal.runners.statements.InvokeMethod.evaluate(InvokeMethod.java:17)
[java] at org.junit.runners.ParentRunner.runLeaf(ParentRunner.java:325)
[java] at org.junit.runners.BlockJUnit4ClassRunner.runChild(BlockJUnit4ClassRunner.java:78)
[java] at org.junit.runners.BlockJUnit4ClassRunner.runChild(BlockJUnit4ClassRunner.java:57)
[java] at org.junit.runners.ParentRunner$3.run(ParentRunner.java:290)
[java] at org.junit.runners.ParentRunner$1.schedule(ParentRunner.java:71)
[java] at org.junit.runners.ParentRunner.runChildren(ParentRunner.java:288)
[java] at org.junit.runners.ParentRunner.access$000(ParentRunner.java:58)
[java] at org.junit.runners.ParentRunner$2.evaluate(ParentRunner.java:268)
[java] at org.junit.internal.runners.statements.RunBefores.evaluate(RunBefores.java:26)
[java] at org.junit.internal.runners.statements.RunAfters.evaluate(RunAfters.java:27)
[java] at org.junit.runners.ParentRunner.run(ParentRunner.java:363)
[java] at org.junit.runners.Suite.runChild(Suite.java:128)
[java] at org.junit.runners.Suite.runChild(Suite.java:27)
[java] at org.junit.runners.ParentRunner$3.run(ParentRunner.java:290)
[java] at org.junit.runners.ParentRunner$1.schedule(ParentRunner.java:71)
[java] at org.junit.runners.ParentRunner.runChildren(ParentRunner.java:288)
[java] at org.junit.runners.ParentRunner.access$000(ParentRunner.java:58)
[java] at org.junit.runners.ParentRunner$2.evaluate(ParentRunner.java:268)
[java] at org.junit.runners.ParentRunner.run(ParentRunner.java:363)
[java] at org.junit.runner.JUnitCore.run(JUnitCore.java:137)
[java] at org.junit.runner.JUnitCore.run(JUnitCore.java:115)
[java] at org.junit.runner.JUnitCore.run(JUnitCore.java:105)
[java] at org.junit.runner.JUnitCore.run(JUnitCore.java:94)
[java] at org.apache.poi.util.OOXMLLite.build(OOXMLLite.java:103)
[java] at org.apache.poi.util.OOXMLLite.main(OOXMLLite.java:86)
[java]
[java] FAILURES!!!
[java] Tests run: 1695, Failures: 1
[java]
[java] Exception in thread "main" java.lang.RuntimeException: Tests did not succeed, cannot build ooxml-lite jar
[java] at org.apache.poi.util.OOXMLLite.build(OOXMLLite.java:105)
[java] at org.apache.poi.util.OOXMLLite.main(OOXMLLite.java:86)
BUILD FAILED
<https://builds.apache.org/job/POI-JDK8/ws/build.xml>:1201: Java returned: 1
Total time: 2 minutes 29 seconds
Build step 'Invoke Ant' marked build as failure
[FINDBUGS] Skipping publisher since build result is FAILURE
[WARNINGS] Skipping publisher since build result is FAILURE
Archiving artifacts
Recording test results
---------------------------------------------------------------------
To unsubscribe, e-mail: dev-unsubscribe@poi.apache.org
For additional commands, e-mail: dev-help@poi.apache.org
Jenkins build is back to normal : POI-JDK8 #567
Posted by Apache Jenkins Server <je...@builds.apache.org>.
See <https://builds.apache.org/job/POI-JDK8/567/changes>
---------------------------------------------------------------------
To unsubscribe, e-mail: dev-unsubscribe@poi.apache.org
For additional commands, e-mail: dev-help@poi.apache.org
Build failed in Jenkins: POI-JDK8 #566
Posted by Apache Jenkins Server <je...@builds.apache.org>.
See <https://builds.apache.org/job/POI-JDK8/566/changes>
Changes:
[dnorth] Patch from https://bz.apache.org/bugzilla/show_bug.cgi?id=58347 - s/arg/filename for a more descriptive filename
------------------------------------------
[...truncated 6017 lines...]
[junit] Running org.apache.poi.poifs.storage.TestHeaderBlockWriting
[junit] Tests run: 4, Failures: 0, Errors: 0, Skipped: 0, Time elapsed: 0.003 sec
[junit] Running org.apache.poi.poifs.storage.TestPropertyBlock
[junit] Tests run: 1, Failures: 0, Errors: 0, Skipped: 0, Time elapsed: 0.003 sec
[junit] Running org.apache.poi.poifs.storage.TestRawDataBlock
[junit] Tests run: 4, Failures: 0, Errors: 0, Skipped: 0, Time elapsed: 0.034 sec
[junit] Running org.apache.poi.poifs.storage.TestRawDataBlockList
[junit] Tests run: 3, Failures: 0, Errors: 0, Skipped: 0, Time elapsed: 0.015 sec
[junit] Running org.apache.poi.poifs.storage.TestSmallBlockTableReader
[junit] Tests run: 1, Failures: 0, Errors: 0, Skipped: 0, Time elapsed: 0.002 sec
[junit] Running org.apache.poi.poifs.storage.TestSmallBlockTableWriter
[junit] Tests run: 1, Failures: 0, Errors: 0, Skipped: 0, Time elapsed: 0.001 sec
[junit] Running org.apache.poi.poifs.storage.TestSmallDocumentBlock
[junit] Tests run: 5, Failures: 0, Errors: 0, Skipped: 0, Time elapsed: 0.036 sec
[junit] Running org.apache.poi.poifs.storage.TestSmallDocumentBlockList
[junit] Tests run: 1, Failures: 0, Errors: 0, Skipped: 0, Time elapsed: 0.002 sec
[junit] Running org.apache.poi.sl.TestCommonSL
[junit] Tests run: 1, Failures: 0, Errors: 0, Skipped: 1, Time elapsed: 0.001 sec
[junit] Running org.apache.poi.sl.draw.geom.TestPresetGeometries
[junit] URL: <https://builds.apache.org/job/POI-JDK8/ws/build/classes/org/apache/poi/sl/draw/geom/presetShapeDefinitions.xml>
[junit] Tests run: 2, Failures: 0, Errors: 0, Skipped: 0, Time elapsed: 0.862 sec
[junit] Running org.apache.poi.ss.TestSpreadsheetVersion
[junit] Tests run: 2, Failures: 0, Errors: 0, Skipped: 0, Time elapsed: 0.002 sec
[junit] Running org.apache.poi.ss.format.TestCellFormat
[junit] 123456 3/5
[junit] Tests run: 37, Failures: 0, Errors: 0, Skipped: 0, Time elapsed: 0.107 sec
[junit] Running org.apache.poi.ss.format.TestCellFormatCondition
[junit] Tests run: 1, Failures: 0, Errors: 0, Skipped: 0, Time elapsed: 0.001 sec
[junit] Running org.apache.poi.ss.format.TestCellFormatResult
[junit] Tests run: 1, Failures: 0, Errors: 0, Skipped: 0, Time elapsed: 0.001 sec
[junit] Running org.apache.poi.ss.formula.TestCellCacheEntry
[junit] Tests run: 1, Failures: 0, Errors: 0, Skipped: 0, Time elapsed: 0.001 sec
[junit] Running org.apache.poi.ss.formula.TestEvaluationCache
[junit] Tests run: 8, Failures: 0, Errors: 0, Skipped: 0, Time elapsed: 2.483 sec
[junit] Running org.apache.poi.ss.formula.TestFormulaShifter
[junit] Tests run: 2, Failures: 0, Errors: 0, Skipped: 0, Time elapsed: 0.003 sec
[junit] Running org.apache.poi.ss.formula.TestFunctionRegistry
[junit] Tests run: 2, Failures: 0, Errors: 0, Skipped: 0, Time elapsed: 0.004 sec
[junit] Running org.apache.poi.ss.formula.TestMissingWorkbook
[junit] Tests run: 3, Failures: 0, Errors: 0, Skipped: 0, Time elapsed: 0.006 sec
[junit] Running org.apache.poi.ss.formula.TestPlainCellCache
[junit] Tests run: 1, Failures: 0, Errors: 0, Skipped: 0, Time elapsed: 2.272 sec
[junit] Running org.apache.poi.ss.formula.TestSheetNameFormatter
[junit] Tests run: 4, Failures: 0, Errors: 0, Skipped: 0, Time elapsed: 0.003 sec
[junit] Running org.apache.poi.ss.formula.TestWorkbookEvaluator
[junit] Tests run: 7, Failures: 0, Errors: 0, Skipped: 0, Time elapsed: 0.012 sec
[junit] Running org.apache.poi.ss.formula.atp.TestDateParser
[junit] Tests run: 5, Failures: 0, Errors: 0, Skipped: 0, Time elapsed: 0.004 sec
[junit] Running org.apache.poi.ss.formula.atp.TestIfError
[junit] Tests run: 1, Failures: 0, Errors: 0, Skipped: 0, Time elapsed: 0.002 sec
[junit] Running org.apache.poi.ss.formula.atp.TestMRound
[junit] Tests run: 1, Failures: 0, Errors: 0, Skipped: 0, Time elapsed: 0.002 sec
[junit] Running org.apache.poi.ss.formula.atp.TestNetworkdaysFunction
[junit] Tests run: 8, Failures: 0, Errors: 0, Skipped: 0, Time elapsed: 0.021 sec
[junit] Running org.apache.poi.ss.formula.atp.TestPercentile
[junit] Tests run: 8, Failures: 0, Errors: 0, Skipped: 0, Time elapsed: 0.005 sec
[junit] Running org.apache.poi.ss.formula.atp.TestRandBetween
[junit] Tests run: 6, Failures: 0, Errors: 0, Skipped: 0, Time elapsed: 0.012 sec
[junit] Running org.apache.poi.ss.formula.atp.TestWorkdayCalculator
[junit] Tests run: 11, Failures: 0, Errors: 0, Skipped: 0, Time elapsed: 0.004 sec
[junit] Running org.apache.poi.ss.formula.atp.TestWorkdayFunction
[junit] Tests run: 12, Failures: 0, Errors: 0, Skipped: 0, Time elapsed: 0.007 sec
[junit] Running org.apache.poi.ss.formula.atp.TestYearFracCalculator
[junit] Tests run: 1, Failures: 0, Errors: 0, Skipped: 0, Time elapsed: 0.003 sec
[junit] Running org.apache.poi.ss.formula.atp.TestYearFracCalculatorFromSpreadsheet
[junit] Tests run: 1, Failures: 0, Errors: 0, Skipped: 0, Time elapsed: 0.016 sec
[junit] Running org.apache.poi.ss.formula.constant.TestConstantValueParser
[junit] Tests run: 3, Failures: 0, Errors: 0, Skipped: 0, Time elapsed: 0.002 sec
[junit] Running org.apache.poi.ss.formula.eval.TestAreaEval
[junit] Tests run: 1, Failures: 0, Errors: 0, Skipped: 0, Time elapsed: 0.001 sec
[junit] Running org.apache.poi.ss.formula.eval.TestDivideEval
[junit] Tests run: 3, Failures: 0, Errors: 0, Skipped: 0, Time elapsed: 0.003 sec
[junit] Running org.apache.poi.ss.formula.eval.TestEqualEval
[junit] Tests run: 6, Failures: 0, Errors: 0, Skipped: 0, Time elapsed: 0.002 sec
[junit] Running org.apache.poi.ss.formula.eval.TestExternalFunction
[junit] Tests run: 1, Failures: 0, Errors: 0, Skipped: 0, Time elapsed: 0.003 sec
[junit] Running org.apache.poi.ss.formula.eval.TestFormulaBugs
[junit] Tests run: 3, Failures: 0, Errors: 0, Skipped: 0, Time elapsed: 0.004 sec
[junit] Running org.apache.poi.ss.formula.eval.TestFormulasFromSpreadsheet
[junit] Tests run: 379, Failures: 0, Errors: 0, Skipped: 0, Time elapsed: 0.195 sec
[junit] Running org.apache.poi.ss.formula.eval.TestHSSFCircularReferences
[junit] Tests run: 4, Failures: 0, Errors: 0, Skipped: 0, Time elapsed: 0.005 sec
[junit] Running org.apache.poi.ss.formula.eval.TestMinusZeroResult
[junit] Tests run: 4, Failures: 0, Errors: 0, Skipped: 0, Time elapsed: 0.002 sec
[junit] Running org.apache.poi.ss.formula.eval.TestMissingArgEval
[junit] Tests run: 2, Failures: 0, Errors: 0, Skipped: 0, Time elapsed: 0.002 sec
[junit] Warning - Row 13 has no cell 1, can't figure out test name
[junit] Running org.apache.poi.ss.formula.eval.TestMultiSheetEval
[junit] Tests run: 1, Failures: 0, Errors: 0, Skipped: 0, Time elapsed: 0.004 sec
[junit] Running org.apache.poi.ss.formula.eval.TestOperandResolver
[junit] Tests run: 4, Failures: 0, Errors: 0, Skipped: 0, Time elapsed: 0.003 sec
[junit] Running org.apache.poi.ss.formula.eval.TestPercentEval
[junit] Tests run: 3, Failures: 0, Errors: 0, Skipped: 0, Time elapsed: 0.001 sec
[junit] Running org.apache.poi.ss.formula.eval.TestRangeEval
[junit] Tests run: 2, Failures: 0, Errors: 0, Skipped: 0, Time elapsed: 0.005 sec
[junit] Running org.apache.poi.ss.formula.eval.TestUnaryPlusEval
[junit] Tests run: 1, Failures: 0, Errors: 0, Skipped: 0, Time elapsed: 0.001 sec
[junit] Running org.apache.poi.ss.formula.eval.forked.TestForkedEvaluator
[junit] Tests run: 2, Failures: 0, Errors: 0, Skipped: 0, Time elapsed: 0.009 sec
[junit] Running org.apache.poi.ss.formula.function.TestFunctionMetadataRegistry
[junit] Tests run: 1, Failures: 0, Errors: 0, Skipped: 0, Time elapsed: 0.001 sec
[junit] Running org.apache.poi.ss.formula.function.TestParseMissingBuiltInFuncs
[junit] Tests run: 7, Failures: 0, Errors: 0, Skipped: 0, Time elapsed: 0.003 sec
[junit] Running org.apache.poi.ss.formula.function.TestReadMissingBuiltInFuncs
[junit] Tests run: 7, Failures: 0, Errors: 0, Skipped: 0, Time elapsed: 0.003 sec
[junit] Running org.apache.poi.ss.formula.functions.TestAddress
[junit] Tests run: 1, Failures: 0, Errors: 0, Skipped: 0, Time elapsed: 0.004 sec
[junit] Running org.apache.poi.ss.formula.functions.TestAverage
[junit] Tests run: 3, Failures: 0, Errors: 0, Skipped: 0, Time elapsed: 0.002 sec
[junit] Running org.apache.poi.ss.formula.functions.TestBin2Dec
[junit] Tests run: 5, Failures: 0, Errors: 0, Skipped: 0, Time elapsed: 0.003 sec
[junit] Running org.apache.poi.ss.formula.functions.TestCalendarFieldFunction
[junit] Tests run: 4, Failures: 0, Errors: 0, Skipped: 0, Time elapsed: 0.006 sec
[junit] Running org.apache.poi.ss.formula.functions.TestClean
[junit] Tests run: 1, Failures: 0, Errors: 0, Skipped: 0, Time elapsed: 0.003 sec
[junit] Running org.apache.poi.ss.formula.functions.TestCode
[junit] Tests run: 2, Failures: 0, Errors: 0, Skipped: 0, Time elapsed: 0.001 sec
[junit] Running org.apache.poi.ss.formula.functions.TestCodeFunctionsFromSpreadsheet
[junit] Tests run: 1, Failures: 0, Errors: 0, Skipped: 0, Time elapsed: 0.002 sec
[junit] Running org.apache.poi.ss.formula.functions.TestComplex
[junit] Tests run: 2, Failures: 0, Errors: 0, Skipped: 0, Time elapsed: 0.002 sec
[junit] Running org.apache.poi.ss.formula.functions.TestComplexFunctionsFromSpreadsheet
[junit] Tests run: 1, Failures: 0, Errors: 0, Skipped: 0, Time elapsed: 0.003 sec
[junit] Running org.apache.poi.ss.formula.functions.TestCountFuncs
[junit] Tests run: 16, Failures: 0, Errors: 0, Skipped: 0, Time elapsed: 0.025 sec
[junit] Running org.apache.poi.ss.formula.functions.TestDGetFunctionsFromSpreadsheet
[junit] Tests run: 1, Failures: 0, Errors: 0, Skipped: 0, Time elapsed: 0.009 sec
[junit] Running org.apache.poi.ss.formula.functions.TestDStarFunctionsFromSpreadsheet
[junit] Tests run: 1, Failures: 0, Errors: 0, Skipped: 0, Time elapsed: 0.003 sec
[junit] Running org.apache.poi.ss.formula.functions.TestDate
[junit] Tests run: 3, Failures: 0, Errors: 0, Skipped: 0, Time elapsed: 0.003 sec
[junit] Running org.apache.poi.ss.formula.functions.TestDays360
[junit] Tests run: 2, Failures: 0, Errors: 0, Skipped: 0, Time elapsed: 0.009 sec
[junit] Running org.apache.poi.ss.formula.functions.TestDec2Bin
[junit] Tests run: 15, Failures: 0, Errors: 0, Skipped: 0, Time elapsed: 0.042 sec
[junit] Running org.apache.poi.ss.formula.functions.TestDec2Hex
[junit] Tests run: 12, Failures: 0, Errors: 0, Skipped: 0, Time elapsed: 0.051 sec
[junit] Running org.apache.poi.ss.formula.functions.TestDelta
[junit] Tests run: 2, Failures: 0, Errors: 0, Skipped: 0, Time elapsed: 0.001 sec
[junit] Running org.apache.poi.ss.formula.functions.TestDeltaFunctionsFromSpreadsheet
[junit] Tests run: 1, Failures: 0, Errors: 0, Skipped: 0, Time elapsed: 0.003 sec
[junit] Running org.apache.poi.ss.formula.functions.TestEDate
[junit] Tests run: 9, Failures: 0, Errors: 0, Skipped: 0, Time elapsed: 0.005 sec
[junit] Running org.apache.poi.ss.formula.functions.TestEOMonth
[junit] Tests run: 9, Failures: 0, Errors: 0, Skipped: 0, Time elapsed: 0.003 sec
[junit] Running org.apache.poi.ss.formula.functions.TestFactDoubleFunctionsFromSpreadsheet
[junit] Tests run: 1, Failures: 0, Errors: 0, Skipped: 0, Time elapsed: 0.002 sec
[junit] Running org.apache.poi.ss.formula.functions.TestFinanceLib
[junit] Tests run: 5, Failures: 0, Errors: 0, Skipped: 0, Time elapsed: 0.002 sec
[junit] Running org.apache.poi.ss.formula.functions.TestFind
[junit] Tests run: 1, Failures: 0, Errors: 0, Skipped: 0, Time elapsed: 0.002 sec
[junit] Running org.apache.poi.ss.formula.functions.TestFixed
[junit] Tests run: 2, Failures: 0, Errors: 0, Skipped: 0, Time elapsed: 0.004 sec
[junit] Running org.apache.poi.ss.formula.functions.TestFixedFunctionsFromSpreadsheet
[junit] Tests run: 1, Failures: 0, Errors: 0, Skipped: 0, Time elapsed: 0.007 sec
[junit] Running org.apache.poi.ss.formula.functions.TestHex2Dec
[junit] Tests run: 5, Failures: 0, Errors: 0, Skipped: 0, Time elapsed: 0.003 sec
[junit] Running org.apache.poi.ss.formula.functions.TestIPMT
[junit] Tests run: 1, Failures: 0, Errors: 0, Skipped: 0, Time elapsed: 0.003 sec
[junit] Running org.apache.poi.ss.formula.functions.TestImRealFunctionsFromSpreadsheet
[junit] Tests run: 1, Failures: 0, Errors: 0, Skipped: 0, Time elapsed: 0.003 sec
[junit] Running org.apache.poi.ss.formula.functions.TestImaginaryFunctionsFromSpreadsheet
[junit] Tests run: 1, Failures: 0, Errors: 0, Skipped: 0, Time elapsed: 0.002 sec
[junit] Running org.apache.poi.ss.formula.functions.TestIndex
[junit] Tests run: 3, Failures: 0, Errors: 0, Skipped: 0, Time elapsed: 0.002 sec
[junit] Running org.apache.poi.ss.formula.functions.TestIndexFunctionFromSpreadsheet
[junit] Tests run: 1, Failures: 0, Errors: 0, Skipped: 0, Time elapsed: 0.009 sec
[junit] Running org.apache.poi.ss.formula.functions.TestIndirect
[junit] Tests run: 2, Failures: 0, Errors: 0, Skipped: 0, Time elapsed: 0.005 sec
[junit] Running org.apache.poi.ss.formula.functions.TestIndirectFunctionFromSpreadsheet
[junit] Tests run: 1, Failures: 0, Errors: 0, Skipped: 0, Time elapsed: 0.003 sec
[junit] Running org.apache.poi.ss.formula.functions.TestIntercept
[junit] Tests run: 4, Failures: 0, Errors: 0, Skipped: 0, Time elapsed: 0.003 sec
[junit] Running org.apache.poi.ss.formula.functions.TestIrr
[junit] Tests run: 3, Failures: 0, Errors: 0, Skipped: 0, Time elapsed: 0.003 sec
[junit] Running org.apache.poi.ss.formula.functions.TestIsBlank
[junit] Tests run: 1, Failures: 0, Errors: 0, Skipped: 0, Time elapsed: 0.002 sec
[junit] Running org.apache.poi.ss.formula.functions.TestLeftRight
[junit] Tests run: 2, Failures: 0, Errors: 0, Skipped: 0, Time elapsed: 0.001 sec
[junit] Running org.apache.poi.ss.formula.functions.TestLen
[junit] Tests run: 3, Failures: 0, Errors: 0, Skipped: 0, Time elapsed: 0.001 sec
[junit] Running org.apache.poi.ss.formula.functions.TestLogicalFunction
[junit] Tests run: 2, Failures: 0, Errors: 0, Skipped: 0, Time elapsed: 0.001 sec
[junit] Running org.apache.poi.ss.formula.functions.TestLookupFunctionsFromSpreadsheet
[junit] Tests run: 1, Failures: 0, Errors: 0, Skipped: 0, Time elapsed: 0.025 sec
[junit] Running org.apache.poi.ss.formula.functions.TestMatch
[junit] Tests run: 8, Failures: 0, Errors: 0, Skipped: 0, Time elapsed: 0.005 sec
[junit] Running org.apache.poi.ss.formula.functions.TestMatchFunctionsFromSpreadsheet
[junit] Tests run: 1, Failures: 0, Errors: 0, Skipped: 0, Time elapsed: 0.002 sec
[junit] Running org.apache.poi.ss.formula.functions.TestMathX
[junit] Tests run: 24, Failures: 0, Errors: 0, Skipped: 0, Time elapsed: 0.006 sec
[junit] Running org.apache.poi.ss.formula.functions.TestMid
[junit] Tests run: 4, Failures: 0, Errors: 0, Skipped: 0, Time elapsed: 0.001 sec
[junit] Running org.apache.poi.ss.formula.functions.TestMirr
[junit] Tests run: 4, Failures: 0, Errors: 0, Skipped: 0, Time elapsed: 0.003 sec
[junit] Running org.apache.poi.ss.formula.functions.TestNper
[junit] Tests run: 2, Failures: 0, Errors: 0, Skipped: 0, Time elapsed: 0.001 sec
[junit] Running org.apache.poi.ss.formula.functions.TestNpv
[junit] Tests run: 2, Failures: 0, Errors: 0, Skipped: 0, Time elapsed: 0.002 sec
[junit] Running org.apache.poi.ss.formula.functions.TestOct2Dec
[junit] Tests run: 2, Failures: 0, Errors: 0, Skipped: 0, Time elapsed: 0.001 sec
[junit] Running org.apache.poi.ss.formula.functions.TestOffset
[junit] Tests run: 2, Failures: 0, Errors: 0, Skipped: 0, Time elapsed: 0.001 sec
[junit] Running org.apache.poi.ss.formula.functions.TestPPMT
[junit] Tests run: 1, Failures: 0, Errors: 0, Skipped: 0, Time elapsed: 0.001 sec
[junit] Running org.apache.poi.ss.formula.functions.TestPmt
[junit] Tests run: 2, Failures: 0, Errors: 0, Skipped: 0, Time elapsed: 0.001 sec
[junit] Running org.apache.poi.ss.formula.functions.TestPoisson
[junit] Tests run: 6, Failures: 0, Errors: 0, Skipped: 0, Time elapsed: 0.002 sec
[junit] Running org.apache.poi.ss.formula.functions.TestQuotient
[junit] Tests run: 2, Failures: 0, Errors: 0, Skipped: 0, Time elapsed: 0.001 sec
[junit] Running org.apache.poi.ss.formula.functions.TestQuotientFunctionsFromSpreadsheet
[junit] Tests run: 1, Failures: 0, Errors: 0, Skipped: 0, Time elapsed: 0.002 sec
[junit] Running org.apache.poi.ss.formula.functions.TestRank
[junit] Tests run: 1, Failures: 0, Errors: 0, Skipped: 0, Time elapsed: 0.003 sec
[junit] Running org.apache.poi.ss.formula.functions.TestReptFunctionsFromSpreadsheet
[junit] Tests run: 1, Failures: 0, Errors: 0, Skipped: 0, Time elapsed: 0.003 sec
[junit] Running org.apache.poi.ss.formula.functions.TestRomanFunctionsFromSpreadsheet
[junit] Tests run: 1, Failures: 0, Errors: 0, Skipped: 0, Time elapsed: 0.003 sec
[junit] Running org.apache.poi.ss.formula.functions.TestRoundFuncs
[junit] Tests run: 2, Failures: 0, Errors: 0, Skipped: 0, Time elapsed: 0.001 sec
[junit] Running org.apache.poi.ss.formula.functions.TestRowCol
[junit] Tests run: 4, Failures: 0, Errors: 0, Skipped: 0, Time elapsed: 0.002 sec
[junit] Running org.apache.poi.ss.formula.functions.TestSlope
[junit] Tests run: 3, Failures: 0, Errors: 0, Skipped: 0, Time elapsed: 0.001 sec
[junit] Running org.apache.poi.ss.formula.functions.TestStatsLib
[junit] Tests run: 9, Failures: 0, Errors: 0, Skipped: 0, Time elapsed: 0.001 sec
[junit] Running org.apache.poi.ss.formula.functions.TestSubtotal
[junit] Tests run: 10, Failures: 0, Errors: 0, Skipped: 0, Time elapsed: 0.006 sec
[junit] Running org.apache.poi.ss.formula.functions.TestSumif
[junit] Tests run: 3, Failures: 0, Errors: 0, Skipped: 0, Time elapsed: 0.002 sec
[junit] Running org.apache.poi.ss.formula.functions.TestSumifs
[junit] Tests run: 7, Failures: 0, Errors: 0, Skipped: 0, Time elapsed: 0.004 sec
[junit] Running org.apache.poi.ss.formula.functions.TestSumproduct
[junit] Tests run: 5, Failures: 0, Errors: 0, Skipped: 0, Time elapsed: 0.002 sec
[junit] Running org.apache.poi.ss.formula.functions.TestTFunc
[junit] Tests run: 5, Failures: 0, Errors: 0, Skipped: 0, Time elapsed: 0.001 sec
[junit] Running org.apache.poi.ss.formula.functions.TestText
[junit] Tests run: 4, Failures: 1, Errors: 0, Skipped: 0, Time elapsed: 0.01 sec
BUILD FAILED
<https://builds.apache.org/job/POI-JDK8/ws/build.xml>:1023: Tests failed
Total time: 6 minutes 41 seconds
Build step 'Invoke Ant' marked build as failure
[FINDBUGS] Skipping publisher since build result is FAILURE
[WARNINGS] Skipping publisher since build result is FAILURE
Archiving artifacts
Recording test results
---------------------------------------------------------------------
To unsubscribe, e-mail: dev-unsubscribe@poi.apache.org
For additional commands, e-mail: dev-help@poi.apache.org
Build failed in Jenkins: POI-JDK8 #565
Posted by Apache Jenkins Server <je...@builds.apache.org>.
See <https://builds.apache.org/job/POI-JDK8/565/changes>
Changes:
[kiwiwings] forbidden apis fixes - a few DateFormat clean ups ...
------------------------------------------
[...truncated 838 lines...]
[junit] Running org.apache.poi.poifs.storage.TestHeaderBlockWriting
[junit] Tests run: 4, Failures: 0, Errors: 0, Skipped: 0, Time elapsed: 0.003 sec
[junit] Running org.apache.poi.poifs.storage.TestPropertyBlock
[junit] Tests run: 1, Failures: 0, Errors: 0, Skipped: 0, Time elapsed: 0.002 sec
[junit] Running org.apache.poi.poifs.storage.TestRawDataBlock
[junit] Tests run: 4, Failures: 0, Errors: 0, Skipped: 0, Time elapsed: 0.033 sec
[junit] Running org.apache.poi.poifs.storage.TestRawDataBlockList
[junit] Tests run: 3, Failures: 0, Errors: 0, Skipped: 0, Time elapsed: 0.015 sec
[junit] Running org.apache.poi.poifs.storage.TestSmallBlockTableReader
[junit] Tests run: 1, Failures: 0, Errors: 0, Skipped: 0, Time elapsed: 0.002 sec
[junit] Running org.apache.poi.poifs.storage.TestSmallBlockTableWriter
[junit] Tests run: 1, Failures: 0, Errors: 0, Skipped: 0, Time elapsed: 0.001 sec
[junit] Running org.apache.poi.poifs.storage.TestSmallDocumentBlock
[junit] Tests run: 5, Failures: 0, Errors: 0, Skipped: 0, Time elapsed: 0.02 sec
[junit] Running org.apache.poi.poifs.storage.TestSmallDocumentBlockList
[junit] Tests run: 1, Failures: 0, Errors: 0, Skipped: 0, Time elapsed: 0.001 sec
[junit] Running org.apache.poi.sl.TestCommonSL
[junit] Tests run: 1, Failures: 0, Errors: 0, Skipped: 1, Time elapsed: 0.001 sec
[junit] Running org.apache.poi.sl.draw.geom.TestPresetGeometries
[junit] URL: <https://builds.apache.org/job/POI-JDK8/ws/build/classes/org/apache/poi/sl/draw/geom/presetShapeDefinitions.xml>
[junit] Tests run: 2, Failures: 0, Errors: 0, Skipped: 0, Time elapsed: 0.813 sec
[junit] Running org.apache.poi.ss.TestSpreadsheetVersion
[junit] Tests run: 2, Failures: 0, Errors: 0, Skipped: 0, Time elapsed: 0.001 sec
[junit] Running org.apache.poi.ss.format.TestCellFormat
[junit] 123456 3/5
[junit] Tests run: 37, Failures: 0, Errors: 0, Skipped: 0, Time elapsed: 0.095 sec
[junit] Running org.apache.poi.ss.format.TestCellFormatCondition
[junit] Tests run: 1, Failures: 0, Errors: 0, Skipped: 0, Time elapsed: 0.002 sec
[junit] Running org.apache.poi.ss.format.TestCellFormatResult
[junit] Tests run: 1, Failures: 0, Errors: 0, Skipped: 0, Time elapsed: 0.001 sec
[junit] Running org.apache.poi.ss.formula.TestCellCacheEntry
[junit] Tests run: 1, Failures: 0, Errors: 0, Skipped: 0, Time elapsed: 0.001 sec
[junit] Running org.apache.poi.ss.formula.TestEvaluationCache
[junit] Tests run: 8, Failures: 0, Errors: 0, Skipped: 0, Time elapsed: 2.372 sec
[junit] Running org.apache.poi.ss.formula.TestFormulaShifter
[junit] Tests run: 2, Failures: 0, Errors: 0, Skipped: 0, Time elapsed: 0.002 sec
[junit] Running org.apache.poi.ss.formula.TestFunctionRegistry
[junit] Tests run: 2, Failures: 0, Errors: 0, Skipped: 0, Time elapsed: 0.012 sec
[junit] Running org.apache.poi.ss.formula.TestMissingWorkbook
[junit] Tests run: 3, Failures: 0, Errors: 0, Skipped: 0, Time elapsed: 0.008 sec
[junit] Running org.apache.poi.ss.formula.TestPlainCellCache
[junit] Tests run: 1, Failures: 0, Errors: 0, Skipped: 0, Time elapsed: 2.13 sec
[junit] Running org.apache.poi.ss.formula.TestSheetNameFormatter
[junit] Tests run: 4, Failures: 0, Errors: 0, Skipped: 0, Time elapsed: 0.002 sec
[junit] Running org.apache.poi.ss.formula.TestWorkbookEvaluator
[junit] Tests run: 7, Failures: 0, Errors: 0, Skipped: 0, Time elapsed: 0.01 sec
[junit] Running org.apache.poi.ss.formula.atp.TestDateParser
[junit] Tests run: 5, Failures: 0, Errors: 0, Skipped: 0, Time elapsed: 0.005 sec
[junit] Running org.apache.poi.ss.formula.atp.TestIfError
[junit] Tests run: 1, Failures: 0, Errors: 0, Skipped: 0, Time elapsed: 0.002 sec
[junit] Running org.apache.poi.ss.formula.atp.TestMRound
[junit] Tests run: 1, Failures: 0, Errors: 0, Skipped: 0, Time elapsed: 0.001 sec
[junit] Running org.apache.poi.ss.formula.atp.TestNetworkdaysFunction
[junit] Tests run: 8, Failures: 0, Errors: 0, Skipped: 0, Time elapsed: 0.023 sec
[junit] Running org.apache.poi.ss.formula.atp.TestPercentile
[junit] Tests run: 8, Failures: 0, Errors: 0, Skipped: 0, Time elapsed: 0.006 sec
[junit] Running org.apache.poi.ss.formula.atp.TestRandBetween
[junit] Tests run: 6, Failures: 0, Errors: 0, Skipped: 0, Time elapsed: 0.009 sec
[junit] Running org.apache.poi.ss.formula.atp.TestWorkdayCalculator
[junit] Tests run: 11, Failures: 0, Errors: 0, Skipped: 0, Time elapsed: 0.005 sec
[junit] Running org.apache.poi.ss.formula.atp.TestWorkdayFunction
[junit] Tests run: 12, Failures: 0, Errors: 0, Skipped: 0, Time elapsed: 0.008 sec
[junit] Running org.apache.poi.ss.formula.atp.TestYearFracCalculator
[junit] Tests run: 1, Failures: 0, Errors: 0, Skipped: 0, Time elapsed: 0.003 sec
[junit] Running org.apache.poi.ss.formula.atp.TestYearFracCalculatorFromSpreadsheet
[junit] Tests run: 1, Failures: 0, Errors: 0, Skipped: 0, Time elapsed: 0.012 sec
[junit] Running org.apache.poi.ss.formula.constant.TestConstantValueParser
[junit] Tests run: 3, Failures: 0, Errors: 0, Skipped: 0, Time elapsed: 0.001 sec
[junit] Running org.apache.poi.ss.formula.eval.TestAreaEval
[junit] Tests run: 1, Failures: 0, Errors: 0, Skipped: 0, Time elapsed: 0.001 sec
[junit] Running org.apache.poi.ss.formula.eval.TestDivideEval
[junit] Tests run: 3, Failures: 0, Errors: 0, Skipped: 0, Time elapsed: 0.002 sec
[junit] Running org.apache.poi.ss.formula.eval.TestEqualEval
[junit] Tests run: 6, Failures: 0, Errors: 0, Skipped: 0, Time elapsed: 0.002 sec
[junit] Running org.apache.poi.ss.formula.eval.TestExternalFunction
[junit] Tests run: 1, Failures: 0, Errors: 0, Skipped: 0, Time elapsed: 0.003 sec
[junit] Running org.apache.poi.ss.formula.eval.TestFormulaBugs
[junit] Tests run: 3, Failures: 0, Errors: 0, Skipped: 0, Time elapsed: 0.004 sec
[junit] Running org.apache.poi.ss.formula.eval.TestFormulasFromSpreadsheet
[junit] Tests run: 379, Failures: 0, Errors: 0, Skipped: 0, Time elapsed: 0.191 sec
[junit] Running org.apache.poi.ss.formula.eval.TestHSSFCircularReferences
[junit] Tests run: 4, Failures: 0, Errors: 0, Skipped: 0, Time elapsed: 0.002 sec
[junit] Running org.apache.poi.ss.formula.eval.TestMinusZeroResult
[junit] Tests run: 4, Failures: 0, Errors: 0, Skipped: 0, Time elapsed: 0.002 sec
[junit] Running org.apache.poi.ss.formula.eval.TestMissingArgEval
[junit] Tests run: 2, Failures: 0, Errors: 0, Skipped: 0, Time elapsed: 0.002 sec
[junit] Running org.apache.poi.ss.formula.eval.TestMultiSheetEval
[junit] Tests run: 1, Failures: 0, Errors: 0, Skipped: 0, Time elapsed: 0.003 sec
[junit] Running org.apache.poi.ss.formula.eval.TestOperandResolver
[junit] Tests run: 4, Failures: 0, Errors: 0, Skipped: 0, Time elapsed: 0.001 sec
[junit] Running org.apache.poi.ss.formula.eval.TestPercentEval
[junit] Tests run: 3, Failures: 0, Errors: 0, Skipped: 0, Time elapsed: 0.001 sec
[junit] Running org.apache.poi.ss.formula.eval.TestRangeEval
[junit] Tests run: 2, Failures: 0, Errors: 0, Skipped: 0, Time elapsed: 0.005 sec
[junit] Running org.apache.poi.ss.formula.eval.TestUnaryPlusEval
[junit] Tests run: 1, Failures: 0, Errors: 0, Skipped: 0, Time elapsed: 0.001 sec
[junit] Running org.apache.poi.ss.formula.eval.forked.TestForkedEvaluator
[junit] Tests run: 2, Failures: 0, Errors: 0, Skipped: 0, Time elapsed: 0.008 sec
[junit] Running org.apache.poi.ss.formula.function.TestFunctionMetadataRegistry
[junit] Tests run: 1, Failures: 0, Errors: 0, Skipped: 0, Time elapsed: 0.001 sec
[junit] Warning - Row 13 has no cell 1, can't figure out test name
[junit] Running org.apache.poi.ss.formula.function.TestParseMissingBuiltInFuncs
[junit] Tests run: 7, Failures: 0, Errors: 0, Skipped: 0, Time elapsed: 0.002 sec
[junit] Running org.apache.poi.ss.formula.function.TestReadMissingBuiltInFuncs
[junit] Tests run: 7, Failures: 0, Errors: 0, Skipped: 0, Time elapsed: 0.002 sec
[junit] Running org.apache.poi.ss.formula.functions.TestAddress
[junit] Tests run: 1, Failures: 0, Errors: 0, Skipped: 0, Time elapsed: 0.002 sec
[junit] Running org.apache.poi.ss.formula.functions.TestAverage
[junit] Tests run: 3, Failures: 0, Errors: 0, Skipped: 0, Time elapsed: 0.001 sec
[junit] Running org.apache.poi.ss.formula.functions.TestBin2Dec
[junit] Tests run: 5, Failures: 0, Errors: 0, Skipped: 0, Time elapsed: 0.002 sec
[junit] Running org.apache.poi.ss.formula.functions.TestCalendarFieldFunction
[junit] Tests run: 4, Failures: 0, Errors: 0, Skipped: 0, Time elapsed: 0.005 sec
[junit] Running org.apache.poi.ss.formula.functions.TestClean
[junit] Tests run: 1, Failures: 0, Errors: 0, Skipped: 0, Time elapsed: 0.002 sec
[junit] Running org.apache.poi.ss.formula.functions.TestCode
[junit] Tests run: 2, Failures: 0, Errors: 0, Skipped: 0, Time elapsed: 0.001 sec
[junit] Running org.apache.poi.ss.formula.functions.TestCodeFunctionsFromSpreadsheet
[junit] Tests run: 1, Failures: 0, Errors: 0, Skipped: 0, Time elapsed: 0.002 sec
[junit] Running org.apache.poi.ss.formula.functions.TestComplex
[junit] Tests run: 2, Failures: 0, Errors: 0, Skipped: 0, Time elapsed: 0.001 sec
[junit] Running org.apache.poi.ss.formula.functions.TestComplexFunctionsFromSpreadsheet
[junit] Tests run: 1, Failures: 0, Errors: 0, Skipped: 0, Time elapsed: 0.002 sec
[junit] Running org.apache.poi.ss.formula.functions.TestCountFuncs
[junit] Tests run: 16, Failures: 0, Errors: 0, Skipped: 0, Time elapsed: 0.018 sec
[junit] Running org.apache.poi.ss.formula.functions.TestDGetFunctionsFromSpreadsheet
[junit] Tests run: 1, Failures: 0, Errors: 0, Skipped: 0, Time elapsed: 0.007 sec
[junit] Running org.apache.poi.ss.formula.functions.TestDStarFunctionsFromSpreadsheet
[junit] Tests run: 1, Failures: 0, Errors: 0, Skipped: 0, Time elapsed: 0.003 sec
[junit] Running org.apache.poi.ss.formula.functions.TestDate
[junit] Tests run: 3, Failures: 0, Errors: 0, Skipped: 0, Time elapsed: 0.003 sec
[junit] Running org.apache.poi.ss.formula.functions.TestDays360
[junit] Tests run: 2, Failures: 0, Errors: 0, Skipped: 0, Time elapsed: 0.015 sec
[junit] Running org.apache.poi.ss.formula.functions.TestDec2Bin
[junit] Tests run: 15, Failures: 0, Errors: 0, Skipped: 0, Time elapsed: 0.049 sec
[junit] Running org.apache.poi.ss.formula.functions.TestDec2Hex
[junit] Tests run: 12, Failures: 0, Errors: 0, Skipped: 0, Time elapsed: 0.044 sec
[junit] Running org.apache.poi.ss.formula.functions.TestDelta
[junit] Tests run: 2, Failures: 0, Errors: 0, Skipped: 0, Time elapsed: 0.001 sec
[junit] Running org.apache.poi.ss.formula.functions.TestDeltaFunctionsFromSpreadsheet
[junit] Tests run: 1, Failures: 0, Errors: 0, Skipped: 0, Time elapsed: 0.003 sec
[junit] Running org.apache.poi.ss.formula.functions.TestEDate
[junit] Tests run: 9, Failures: 0, Errors: 0, Skipped: 0, Time elapsed: 0.005 sec
[junit] Running org.apache.poi.ss.formula.functions.TestEOMonth
[junit] Tests run: 9, Failures: 0, Errors: 0, Skipped: 0, Time elapsed: 0.004 sec
[junit] Running org.apache.poi.ss.formula.functions.TestFactDoubleFunctionsFromSpreadsheet
[junit] Tests run: 1, Failures: 0, Errors: 0, Skipped: 0, Time elapsed: 0.003 sec
[junit] Running org.apache.poi.ss.formula.functions.TestFinanceLib
[junit] Tests run: 5, Failures: 0, Errors: 0, Skipped: 0, Time elapsed: 0.002 sec
[junit] Running org.apache.poi.ss.formula.functions.TestFind
[junit] Tests run: 1, Failures: 0, Errors: 0, Skipped: 0, Time elapsed: 0.002 sec
[junit] Running org.apache.poi.ss.formula.functions.TestFixed
[junit] Tests run: 2, Failures: 0, Errors: 0, Skipped: 0, Time elapsed: 0.004 sec
[junit] Running org.apache.poi.ss.formula.functions.TestFixedFunctionsFromSpreadsheet
[junit] Tests run: 1, Failures: 0, Errors: 0, Skipped: 0, Time elapsed: 0.004 sec
[junit] Running org.apache.poi.ss.formula.functions.TestHex2Dec
[junit] Tests run: 5, Failures: 0, Errors: 0, Skipped: 0, Time elapsed: 0.003 sec
[junit] Running org.apache.poi.ss.formula.functions.TestIPMT
[junit] Tests run: 1, Failures: 0, Errors: 0, Skipped: 0, Time elapsed: 0.002 sec
[junit] Running org.apache.poi.ss.formula.functions.TestImRealFunctionsFromSpreadsheet
[junit] Tests run: 1, Failures: 0, Errors: 0, Skipped: 0, Time elapsed: 0.003 sec
[junit] Running org.apache.poi.ss.formula.functions.TestImaginaryFunctionsFromSpreadsheet
[junit] Tests run: 1, Failures: 0, Errors: 0, Skipped: 0, Time elapsed: 0.004 sec
[junit] Running org.apache.poi.ss.formula.functions.TestIndex
[junit] Tests run: 3, Failures: 0, Errors: 0, Skipped: 0, Time elapsed: 0.003 sec
[junit] Running org.apache.poi.ss.formula.functions.TestIndexFunctionFromSpreadsheet
[junit] Tests run: 1, Failures: 0, Errors: 0, Skipped: 0, Time elapsed: 0.02 sec
[junit] Running org.apache.poi.ss.formula.functions.TestIndirect
[junit] Tests run: 2, Failures: 0, Errors: 0, Skipped: 0, Time elapsed: 0.005 sec
[junit] Running org.apache.poi.ss.formula.functions.TestIndirectFunctionFromSpreadsheet
[junit] Tests run: 1, Failures: 0, Errors: 0, Skipped: 0, Time elapsed: 0.003 sec
[junit] Running org.apache.poi.ss.formula.functions.TestIntercept
[junit] Tests run: 4, Failures: 0, Errors: 0, Skipped: 0, Time elapsed: 0.003 sec
[junit] Running org.apache.poi.ss.formula.functions.TestIrr
[junit] Tests run: 3, Failures: 0, Errors: 0, Skipped: 0, Time elapsed: 0.003 sec
[junit] Running org.apache.poi.ss.formula.functions.TestIsBlank
[junit] Tests run: 1, Failures: 0, Errors: 0, Skipped: 0, Time elapsed: 0.002 sec
[junit] Running org.apache.poi.ss.formula.functions.TestLeftRight
[junit] Tests run: 2, Failures: 0, Errors: 0, Skipped: 0, Time elapsed: 0.001 sec
[junit] Running org.apache.poi.ss.formula.functions.TestLen
[junit] Tests run: 3, Failures: 0, Errors: 0, Skipped: 0, Time elapsed: 0.001 sec
[junit] Running org.apache.poi.ss.formula.functions.TestLogicalFunction
[junit] Tests run: 2, Failures: 0, Errors: 0, Skipped: 0, Time elapsed: 0.002 sec
[junit] Running org.apache.poi.ss.formula.functions.TestLookupFunctionsFromSpreadsheet
[junit] Tests run: 1, Failures: 0, Errors: 0, Skipped: 0, Time elapsed: 0.023 sec
[junit] Running org.apache.poi.ss.formula.functions.TestMatch
[junit] Tests run: 8, Failures: 0, Errors: 0, Skipped: 0, Time elapsed: 0.004 sec
[junit] Running org.apache.poi.ss.formula.functions.TestMatchFunctionsFromSpreadsheet
[junit] Tests run: 1, Failures: 0, Errors: 0, Skipped: 0, Time elapsed: 0.003 sec
[junit] Running org.apache.poi.ss.formula.functions.TestMathX
[junit] Tests run: 24, Failures: 0, Errors: 0, Skipped: 0, Time elapsed: 0.007 sec
[junit] Running org.apache.poi.ss.formula.functions.TestMid
[junit] Tests run: 4, Failures: 0, Errors: 0, Skipped: 0, Time elapsed: 0.001 sec
[junit] Running org.apache.poi.ss.formula.functions.TestMirr
[junit] Tests run: 4, Failures: 0, Errors: 0, Skipped: 0, Time elapsed: 0.003 sec
[junit] Running org.apache.poi.ss.formula.functions.TestNper
[junit] Tests run: 2, Failures: 0, Errors: 0, Skipped: 0, Time elapsed: 0.001 sec
[junit] Running org.apache.poi.ss.formula.functions.TestNpv
[junit] Tests run: 2, Failures: 0, Errors: 0, Skipped: 0, Time elapsed: 0.002 sec
[junit] Running org.apache.poi.ss.formula.functions.TestOct2Dec
[junit] Tests run: 2, Failures: 0, Errors: 0, Skipped: 0, Time elapsed: 0.001 sec
[junit] Running org.apache.poi.ss.formula.functions.TestOffset
[junit] Tests run: 2, Failures: 0, Errors: 0, Skipped: 0, Time elapsed: 0 sec
[junit] Running org.apache.poi.ss.formula.functions.TestPPMT
[junit] Tests run: 1, Failures: 0, Errors: 0, Skipped: 0, Time elapsed: 0.001 sec
[junit] Running org.apache.poi.ss.formula.functions.TestPmt
[junit] Tests run: 2, Failures: 0, Errors: 0, Skipped: 0, Time elapsed: 0.001 sec
[junit] Running org.apache.poi.ss.formula.functions.TestPoisson
[junit] Tests run: 6, Failures: 0, Errors: 0, Skipped: 0, Time elapsed: 0.001 sec
[junit] Running org.apache.poi.ss.formula.functions.TestQuotient
[junit] Tests run: 2, Failures: 0, Errors: 0, Skipped: 0, Time elapsed: 0.001 sec
[junit] Running org.apache.poi.ss.formula.functions.TestQuotientFunctionsFromSpreadsheet
[junit] Tests run: 1, Failures: 0, Errors: 0, Skipped: 0, Time elapsed: 0.003 sec
[junit] Running org.apache.poi.ss.formula.functions.TestRank
[junit] Tests run: 1, Failures: 0, Errors: 0, Skipped: 0, Time elapsed: 0.003 sec
[junit] Running org.apache.poi.ss.formula.functions.TestReptFunctionsFromSpreadsheet
[junit] Tests run: 1, Failures: 0, Errors: 0, Skipped: 0, Time elapsed: 0.004 sec
[junit] Running org.apache.poi.ss.formula.functions.TestRomanFunctionsFromSpreadsheet
[junit] Tests run: 1, Failures: 0, Errors: 0, Skipped: 0, Time elapsed: 0.004 sec
[junit] Running org.apache.poi.ss.formula.functions.TestRoundFuncs
[junit] Tests run: 2, Failures: 0, Errors: 0, Skipped: 0, Time elapsed: 0.001 sec
[junit] Running org.apache.poi.ss.formula.functions.TestRowCol
[junit] Tests run: 4, Failures: 0, Errors: 0, Skipped: 0, Time elapsed: 0.001 sec
[junit] Running org.apache.poi.ss.formula.functions.TestSlope
[junit] Tests run: 3, Failures: 0, Errors: 0, Skipped: 0, Time elapsed: 0.001 sec
[junit] Running org.apache.poi.ss.formula.functions.TestStatsLib
[junit] Tests run: 9, Failures: 0, Errors: 0, Skipped: 0, Time elapsed: 0.002 sec
[junit] Running org.apache.poi.ss.formula.functions.TestSubtotal
[junit] Tests run: 10, Failures: 0, Errors: 0, Skipped: 0, Time elapsed: 0.006 sec
[junit] Running org.apache.poi.ss.formula.functions.TestSumif
[junit] Tests run: 3, Failures: 0, Errors: 0, Skipped: 0, Time elapsed: 0.001 sec
[junit] Running org.apache.poi.ss.formula.functions.TestSumifs
[junit] Tests run: 7, Failures: 0, Errors: 0, Skipped: 0, Time elapsed: 0.004 sec
[junit] Running org.apache.poi.ss.formula.functions.TestSumproduct
[junit] Tests run: 5, Failures: 0, Errors: 0, Skipped: 0, Time elapsed: 0.001 sec
[junit] Running org.apache.poi.ss.formula.functions.TestTFunc
[junit] Tests run: 5, Failures: 0, Errors: 0, Skipped: 0, Time elapsed: 0.001 sec
[junit] Running org.apache.poi.ss.formula.functions.TestText
[junit] Tests run: 4, Failures: 1, Errors: 0, Skipped: 0, Time elapsed: 0.008 sec
BUILD FAILED
<https://builds.apache.org/job/POI-JDK8/ws/build.xml>:1023: Tests failed
Total time: 3 minutes 43 seconds
Build step 'Invoke Ant' marked build as failure
[FINDBUGS] Skipping publisher since build result is FAILURE
[WARNINGS] Skipping publisher since build result is FAILURE
Archiving artifacts
Recording test results
---------------------------------------------------------------------
To unsubscribe, e-mail: dev-unsubscribe@poi.apache.org
For additional commands, e-mail: dev-help@poi.apache.org