You are viewing a plain text version of this content. The canonical link for it is here.
Posted to builds@solr.apache.org by Apache Jenkins Server <je...@builds.apache.org> on 2023/11/07 05:31:46 UTC
[JENKINS] Solr » Solr-Check-main-s390x - Build # 414 - Still Unstable!
Build: https://ci-builds.apache.org/job/Solr/job/Solr-Check-main-s390x/414/
2 tests failed.
FAILED: org.apache.solr.bench.DockMakerTest.testRealisticUnicode
Error Message:
java.lang.AssertionError: expected:<6> but was:<7>
Stack Trace:
java.lang.AssertionError: expected:<6> but was:<7>
at __randomizedtesting.SeedInfo.seed([44402D671376450F:14ACA9B4C0CD12A6]:0)
at org.junit.Assert.fail(Assert.java:89)
at org.junit.Assert.failNotEquals(Assert.java:835)
at org.junit.Assert.assertEquals(Assert.java:647)
at org.junit.Assert.assertEquals(Assert.java:633)
at org.apache.solr.bench.DockMakerTest.testRealisticUnicode(DockMakerTest.java:189)
at java.base/jdk.internal.reflect.NativeMethodAccessorImpl.invoke0(Native Method)
at java.base/jdk.internal.reflect.NativeMethodAccessorImpl.invoke(NativeMethodAccessorImpl.java:62)
at java.base/jdk.internal.reflect.DelegatingMethodAccessorImpl.invoke(DelegatingMethodAccessorImpl.java:43)
at java.base/java.lang.reflect.Method.invoke(Method.java:566)
at com.carrotsearch.randomizedtesting.RandomizedRunner.invoke(RandomizedRunner.java:1758)
at com.carrotsearch.randomizedtesting.RandomizedRunner$8.evaluate(RandomizedRunner.java:946)
at com.carrotsearch.randomizedtesting.RandomizedRunner$9.evaluate(RandomizedRunner.java:982)
at com.carrotsearch.randomizedtesting.RandomizedRunner$10.evaluate(RandomizedRunner.java:996)
at com.carrotsearch.randomizedtesting.rules.SystemPropertiesRestoreRule$1.evaluate(SystemPropertiesRestoreRule.java:80)
at org.junit.rules.RunRules.evaluate(RunRules.java:20)
at org.apache.lucene.tests.util.TestRuleSetupTeardownChained$1.evaluate(TestRuleSetupTeardownChained.java:48)
at org.apache.lucene.tests.util.AbstractBeforeAfterRule$1.evaluate(AbstractBeforeAfterRule.java:43)
at org.apache.lucene.tests.util.TestRuleThreadAndTestName$1.evaluate(TestRuleThreadAndTestName.java:45)
at org.apache.lucene.tests.util.TestRuleIgnoreAfterMaxFailures$1.evaluate(TestRuleIgnoreAfterMaxFailures.java:60)
at org.apache.lucene.tests.util.TestRuleMarkFailure$1.evaluate(TestRuleMarkFailure.java:44)
at org.junit.rules.RunRules.evaluate(RunRules.java:20)
at com.carrotsearch.randomizedtesting.rules.StatementAdapter.evaluate(StatementAdapter.java:36)
at com.carrotsearch.randomizedtesting.ThreadLeakControl$StatementRunner.run(ThreadLeakControl.java:390)
at com.carrotsearch.randomizedtesting.ThreadLeakControl.forkTimeoutingTask(ThreadLeakControl.java:843)
at com.carrotsearch.randomizedtesting.ThreadLeakControl$3.evaluate(ThreadLeakControl.java:490)
at com.carrotsearch.randomizedtesting.RandomizedRunner.runSingleTest(RandomizedRunner.java:955)
at com.carrotsearch.randomizedtesting.RandomizedRunner$5.evaluate(RandomizedRunner.java:840)
at com.carrotsearch.randomizedtesting.RandomizedRunner$6.evaluate(RandomizedRunner.java:891)
at com.carrotsearch.randomizedtesting.RandomizedRunner$7.evaluate(RandomizedRunner.java:902)
at com.carrotsearch.randomizedtesting.rules.StatementAdapter.evaluate(StatementAdapter.java:36)
at com.carrotsearch.randomizedtesting.rules.StatementAdapter.evaluate(StatementAdapter.java:36)
at org.apache.lucene.tests.util.AbstractBeforeAfterRule$1.evaluate(AbstractBeforeAfterRule.java:43)
at com.carrotsearch.randomizedtesting.rules.SystemPropertiesRestoreRule$1.evaluate(SystemPropertiesRestoreRule.java:80)
at org.junit.rules.RunRules.evaluate(RunRules.java:20)
at org.apache.lucene.tests.util.AbstractBeforeAfterRule$1.evaluate(AbstractBeforeAfterRule.java:43)
at com.carrotsearch.randomizedtesting.rules.StatementAdapter.evaluate(StatementAdapter.java:36)
at org.apache.lucene.tests.util.TestRuleStoreClassName$1.evaluate(TestRuleStoreClassName.java:38)
at com.carrotsearch.randomizedtesting.rules.NoShadowingOrOverridesOnMethodsRule$1.evaluate(NoShadowingOrOverridesOnMethodsRule.java:40)
at com.carrotsearch.randomizedtesting.rules.NoShadowingOrOverridesOnMethodsRule$1.evaluate(NoShadowingOrOverridesOnMethodsRule.java:40)
at com.carrotsearch.randomizedtesting.rules.StatementAdapter.evaluate(StatementAdapter.java:36)
at com.carrotsearch.randomizedtesting.rules.StatementAdapter.evaluate(StatementAdapter.java:36)
at org.apache.lucene.tests.util.TestRuleAssertionsRequired$1.evaluate(TestRuleAssertionsRequired.java:53)
at org.apache.lucene.tests.util.AbstractBeforeAfterRule$1.evaluate(AbstractBeforeAfterRule.java:43)
at org.apache.lucene.tests.util.TestRuleMarkFailure$1.evaluate(TestRuleMarkFailure.java:44)
at org.apache.lucene.tests.util.TestRuleIgnoreAfterMaxFailures$1.evaluate(TestRuleIgnoreAfterMaxFailures.java:60)
at org.apache.lucene.tests.util.TestRuleIgnoreTestSuites$1.evaluate(TestRuleIgnoreTestSuites.java:47)
at org.junit.rules.RunRules.evaluate(RunRules.java:20)
at com.carrotsearch.randomizedtesting.rules.StatementAdapter.evaluate(StatementAdapter.java:36)
at com.carrotsearch.randomizedtesting.ThreadLeakControl$StatementRunner.run(ThreadLeakControl.java:390)
at com.carrotsearch.randomizedtesting.ThreadLeakControl.lambda$forkTimeoutingTask$0(ThreadLeakControl.java:850)
at java.base/java.lang.Thread.run(Thread.java:829)
FAILED: org.apache.solr.cloud.ZkCLITest.testPutFileCompressed
Error Message:
Should get back what we put in ZK: array lengths differed, expected.length=824 actual.length=823; arrays first differed at element [783]; expected:<-88> but was:<12>
Stack Trace:
Should get back what we put in ZK: array lengths differed, expected.length=824 actual.length=823; arrays first differed at element [783]; expected:<-88> but was:<12>
at __randomizedtesting.SeedInfo.seed([44402D671376450F:D08D59929ACE9047]:0)
at org.junit.internal.ComparisonCriteria.arrayEquals(ComparisonCriteria.java:78)
at org.junit.internal.ComparisonCriteria.arrayEquals(ComparisonCriteria.java:28)
at org.junit.Assert.internalArrayEquals(Assert.java:534)
at org.junit.Assert.assertArrayEquals(Assert.java:343)
at org.apache.solr.cloud.ZkCLITest.testPutFileCompressed(ZkCLITest.java:246)
at java.base/jdk.internal.reflect.NativeMethodAccessorImpl.invoke0(Native Method)
at java.base/jdk.internal.reflect.NativeMethodAccessorImpl.invoke(NativeMethodAccessorImpl.java:62)
at java.base/jdk.internal.reflect.DelegatingMethodAccessorImpl.invoke(DelegatingMethodAccessorImpl.java:43)
at java.base/java.lang.reflect.Method.invoke(Method.java:566)
at com.carrotsearch.randomizedtesting.RandomizedRunner.invoke(RandomizedRunner.java:1758)
at com.carrotsearch.randomizedtesting.RandomizedRunner$8.evaluate(RandomizedRunner.java:946)
at com.carrotsearch.randomizedtesting.RandomizedRunner$9.evaluate(RandomizedRunner.java:982)
at com.carrotsearch.randomizedtesting.RandomizedRunner$10.evaluate(RandomizedRunner.java:996)
at com.carrotsearch.randomizedtesting.rules.SystemPropertiesRestoreRule$1.evaluate(SystemPropertiesRestoreRule.java:80)
at org.junit.rules.RunRules.evaluate(RunRules.java:20)
at org.apache.lucene.tests.util.TestRuleSetupTeardownChained$1.evaluate(TestRuleSetupTeardownChained.java:48)
at org.apache.lucene.tests.util.AbstractBeforeAfterRule$1.evaluate(AbstractBeforeAfterRule.java:43)
at org.apache.lucene.tests.util.TestRuleThreadAndTestName$1.evaluate(TestRuleThreadAndTestName.java:45)
at org.apache.lucene.tests.util.TestRuleIgnoreAfterMaxFailures$1.evaluate(TestRuleIgnoreAfterMaxFailures.java:60)
at org.apache.lucene.tests.util.TestRuleMarkFailure$1.evaluate(TestRuleMarkFailure.java:44)
at org.junit.rules.RunRules.evaluate(RunRules.java:20)
at com.carrotsearch.randomizedtesting.rules.StatementAdapter.evaluate(StatementAdapter.java:36)
at com.carrotsearch.randomizedtesting.ThreadLeakControl$StatementRunner.run(ThreadLeakControl.java:390)
at com.carrotsearch.randomizedtesting.ThreadLeakControl.forkTimeoutingTask(ThreadLeakControl.java:843)
at com.carrotsearch.randomizedtesting.ThreadLeakControl$3.evaluate(ThreadLeakControl.java:490)
at com.carrotsearch.randomizedtesting.RandomizedRunner.runSingleTest(RandomizedRunner.java:955)
at com.carrotsearch.randomizedtesting.RandomizedRunner$5.evaluate(RandomizedRunner.java:840)
at com.carrotsearch.randomizedtesting.RandomizedRunner$6.evaluate(RandomizedRunner.java:891)
at com.carrotsearch.randomizedtesting.RandomizedRunner$7.evaluate(RandomizedRunner.java:902)
at com.carrotsearch.randomizedtesting.rules.StatementAdapter.evaluate(StatementAdapter.java:36)
at com.carrotsearch.randomizedtesting.rules.StatementAdapter.evaluate(StatementAdapter.java:36)
at org.apache.lucene.tests.util.AbstractBeforeAfterRule$1.evaluate(AbstractBeforeAfterRule.java:43)
at com.carrotsearch.randomizedtesting.rules.SystemPropertiesRestoreRule$1.evaluate(SystemPropertiesRestoreRule.java:80)
at org.junit.rules.RunRules.evaluate(RunRules.java:20)
at org.apache.lucene.tests.util.AbstractBeforeAfterRule$1.evaluate(AbstractBeforeAfterRule.java:43)
at com.carrotsearch.randomizedtesting.rules.StatementAdapter.evaluate(StatementAdapter.java:36)
at org.apache.lucene.tests.util.TestRuleStoreClassName$1.evaluate(TestRuleStoreClassName.java:38)
at com.carrotsearch.randomizedtesting.rules.NoShadowingOrOverridesOnMethodsRule$1.evaluate(NoShadowingOrOverridesOnMethodsRule.java:40)
at com.carrotsearch.randomizedtesting.rules.NoShadowingOrOverridesOnMethodsRule$1.evaluate(NoShadowingOrOverridesOnMethodsRule.java:40)
at com.carrotsearch.randomizedtesting.rules.StatementAdapter.evaluate(StatementAdapter.java:36)
at com.carrotsearch.randomizedtesting.rules.StatementAdapter.evaluate(StatementAdapter.java:36)
at org.apache.lucene.tests.util.TestRuleAssertionsRequired$1.evaluate(TestRuleAssertionsRequired.java:53)
at org.apache.lucene.tests.util.AbstractBeforeAfterRule$1.evaluate(AbstractBeforeAfterRule.java:43)
at org.apache.lucene.tests.util.TestRuleMarkFailure$1.evaluate(TestRuleMarkFailure.java:44)
at org.apache.lucene.tests.util.TestRuleIgnoreAfterMaxFailures$1.evaluate(TestRuleIgnoreAfterMaxFailures.java:60)
at org.apache.lucene.tests.util.TestRuleIgnoreTestSuites$1.evaluate(TestRuleIgnoreTestSuites.java:47)
at org.junit.rules.RunRules.evaluate(RunRules.java:20)
at com.carrotsearch.randomizedtesting.rules.StatementAdapter.evaluate(StatementAdapter.java:36)
at com.carrotsearch.randomizedtesting.ThreadLeakControl$StatementRunner.run(ThreadLeakControl.java:390)
at com.carrotsearch.randomizedtesting.ThreadLeakControl.lambda$forkTimeoutingTask$0(ThreadLeakControl.java:850)
at java.base/java.lang.Thread.run(Thread.java:829)
Caused by: java.lang.AssertionError: expected:<-88> but was:<12>
at org.junit.Assert.fail(Assert.java:89)
at org.junit.Assert.failNotEquals(Assert.java:835)
at org.junit.Assert.assertEquals(Assert.java:120)
at org.junit.Assert.assertEquals(Assert.java:146)
at org.junit.internal.ExactComparisonCriteria.assertElementsEqual(ExactComparisonCriteria.java:8)
at org.junit.internal.ComparisonCriteria.arrayEquals(ComparisonCriteria.java:76)
... 50 more
Build Log:
[...truncated 3343 lines...]
ERROR: The following test(s) have failed:
- org.apache.solr.cloud.ZkCLITest.testPutFileCompressed (:solr:core)
Test output: /home/jenkins/jenkins-home/712657a4/workspace/Solr/Solr-Check-main-s390x/solr/core/build/test-results/test/outputs/OUTPUT-org.apache.solr.cloud.ZkCLITest.txt
Reproduce with: gradlew :solr:core:test --tests "org.apache.solr.cloud.ZkCLITest.testPutFileCompressed" -Ptests.jvms=4 -Ptests.haltonfailure=false "-Ptests.jvmargs=-XX:TieredStopAtLevel=1 -XX:+UseParallelGC -XX:ActiveProcessorCount=1 -XX:ReservedCodeCacheSize=120m" -Ptests.seed=44402D671376450F -Ptests.multiplier=2 -Ptests.badapples=false -Ptests.file.encoding=UTF-8
- org.apache.solr.bench.DockMakerTest.testRealisticUnicode (:solr:benchmark)
Test output: /home/jenkins/jenkins-home/712657a4/workspace/Solr/Solr-Check-main-s390x/solr/benchmark/build/test-results/test/outputs/OUTPUT-org.apache.solr.bench.DockMakerTest.txt
Reproduce with: gradlew :solr:benchmark:test --tests "org.apache.solr.bench.DockMakerTest.testRealisticUnicode" -Ptests.jvms=4 -Ptests.haltonfailure=false "-Ptests.jvmargs=-XX:TieredStopAtLevel=1 -XX:+UseParallelGC -XX:ActiveProcessorCount=1 -XX:ReservedCodeCacheSize=120m" -Ptests.seed=44402D671376450F -Ptests.multiplier=2 -Ptests.badapples=false -Ptests.file.encoding=UTF-8
Deprecated Gradle features were used in this build, making it incompatible with Gradle 9.0.
You can use '--warning-mode all' to show the individual deprecation warnings and determine if they come from your own scripts or plugins.
For more on this, please refer to https://docs.gradle.org/8.4/userguide/command_line_interface.html#sec:command_line_warnings in the Gradle documentation.
BUILD SUCCESSFUL in 46m 22s
584 actionable tasks: 584 executed
Publishing build scan...
https://ge.apache.org/s/5jjwubcsi5b4i
Build step 'Invoke Gradle script' changed build result to SUCCESS
Archiving artifacts
hudson.FilePath$ValidateAntFileMask$1Cancel
at hudson.FilePath$ValidateAntFileMask$1.isCaseSensitive(FilePath.java:3300)
at org.apache.tools.ant.DirectoryScanner.lambda$isIncluded$3(DirectoryScanner.java:1374)
at java.base/java.util.stream.MatchOps$1MatchSink.accept(MatchOps.java:90)
at java.base/java.util.Spliterators$ArraySpliterator.tryAdvance(Spliterators.java:958)
at java.base/java.util.stream.ReferencePipeline.forEachWithCancel(ReferencePipeline.java:127)
at java.base/java.util.stream.AbstractPipeline.copyIntoWithCancel(AbstractPipeline.java:502)
at java.base/java.util.stream.AbstractPipeline.copyInto(AbstractPipeline.java:488)
at java.base/java.util.stream.AbstractPipeline.wrapAndCopyInto(AbstractPipeline.java:474)
at java.base/java.util.stream.MatchOps$MatchOp.evaluateSequential(MatchOps.java:230)
at java.base/java.util.stream.MatchOps$MatchOp.evaluateSequential(MatchOps.java:196)
at java.base/java.util.stream.AbstractPipeline.evaluate(AbstractPipeline.java:234)
at java.base/java.util.stream.ReferencePipeline.anyMatch(ReferencePipeline.java:528)
at org.apache.tools.ant.DirectoryScanner.isIncluded(DirectoryScanner.java:1374)
at org.apache.tools.ant.DirectoryScanner.scandir(DirectoryScanner.java:1241)
at org.apache.tools.ant.DirectoryScanner.scandir(DirectoryScanner.java:1267)
at org.apache.tools.ant.DirectoryScanner.scandir(DirectoryScanner.java:1267)
at org.apache.tools.ant.DirectoryScanner.scandir(DirectoryScanner.java:1267)
at org.apache.tools.ant.DirectoryScanner.scandir(DirectoryScanner.java:1267)
at org.apache.tools.ant.DirectoryScanner.scandir(DirectoryScanner.java:1267)
at org.apache.tools.ant.DirectoryScanner.scandir(DirectoryScanner.java:1267)
at org.apache.tools.ant.DirectoryScanner.scandir(DirectoryScanner.java:1267)
at org.apache.tools.ant.DirectoryScanner.scandir(DirectoryScanner.java:1267)
at org.apache.tools.ant.DirectoryScanner.scandir(DirectoryScanner.java:1267)
at org.apache.tools.ant.DirectoryScanner.scandir(DirectoryScanner.java:1267)
at org.apache.tools.ant.DirectoryScanner.scandir(DirectoryScanner.java:1267)
at org.apache.tools.ant.DirectoryScanner.scandir(DirectoryScanner.java:1194)
at org.apache.tools.ant.DirectoryScanner.scandir(DirectoryScanner.java:1156)
at org.apache.tools.ant.DirectoryScanner.checkIncludePatterns(DirectoryScanner.java:954)
at org.apache.tools.ant.DirectoryScanner.scan(DirectoryScanner.java:912)
at hudson.FilePath$ValidateAntFileMask.hasMatch(FilePath.java:3313)
Caused: hudson.FilePath$FileMaskNoMatchesFoundException: no matches found within 10000
at hudson.FilePath$ValidateAntFileMask.hasMatch(FilePath.java:3318)
at hudson.FilePath$ValidateAntFileMask.invoke(FilePath.java:3196)
at hudson.FilePath$ValidateAntFileMask.invoke(FilePath.java:3174)
at hudson.FilePath$FileCallableWrapper.call(FilePath.java:3578)
Also: hudson.remoting.Channel$CallSiteStackTrace: Remote call to jenkins-s390x-4
at hudson.remoting.Channel.attachCallSiteStackTrace(Channel.java:1784)
at hudson.remoting.UserRequest$ExceptionResponse.retrieve(UserRequest.java:356)
at hudson.remoting.Channel.call(Channel.java:1000)
at hudson.FilePath.act(FilePath.java:1192)
at hudson.FilePath.act(FilePath.java:1181)
at hudson.FilePath.validateAntFileMask(FilePath.java:3171)
at hudson.tasks.ArtifactArchiver.perform(ArtifactArchiver.java:271)
at hudson.tasks.BuildStepCompatibilityLayer.perform(BuildStepCompatibilityLayer.java:80)
at hudson.tasks.BuildStepMonitor$1.perform(BuildStepMonitor.java:20)
at hudson.model.AbstractBuild$AbstractBuildExecution.perform(AbstractBuild.java:818)
at hudson.model.AbstractBuild$AbstractBuildExecution.performAllBuildSteps(AbstractBuild.java:767)
at hudson.model.Build$BuildExecution.post2(Build.java:179)
at hudson.model.AbstractBuild$AbstractBuildExecution.post(AbstractBuild.java:711)
at hudson.model.Run.execute(Run.java:1925)
at hudson.model.FreeStyleBuild.run(FreeStyleBuild.java:44)
at hudson.model.ResourceController.execute(ResourceController.java:101)
at hudson.model.Executor.run(Executor.java:442)
Caused: hudson.FilePath$TunneledInterruptedException
at hudson.FilePath$FileCallableWrapper.call(FilePath.java:3580)
at hudson.remoting.UserRequest.perform(UserRequest.java:211)
at hudson.remoting.UserRequest.perform(UserRequest.java:54)
at hudson.remoting.Request$2.run(Request.java:377)
at hudson.remoting.InterceptingExecutorService.lambda$wrap$0(InterceptingExecutorService.java:78)
at java.base/java.util.concurrent.FutureTask.run(FutureTask.java:264)
at java.base/java.util.concurrent.ThreadPoolExecutor.runWorker(ThreadPoolExecutor.java:1128)
at java.base/java.util.concurrent.ThreadPoolExecutor$Worker.run(ThreadPoolExecutor.java:628)
at java.base/java.lang.Thread.run(Thread.java:829)
Caused: java.lang.InterruptedException: hudson.FilePath$FileMaskNoMatchesFoundException: no matches found within 10000
at hudson.FilePath.act(FilePath.java:1194)
at hudson.FilePath.act(FilePath.java:1181)
at hudson.FilePath.validateAntFileMask(FilePath.java:3171)
at hudson.tasks.ArtifactArchiver.perform(ArtifactArchiver.java:271)
at hudson.tasks.BuildStepCompatibilityLayer.perform(BuildStepCompatibilityLayer.java:80)
at hudson.tasks.BuildStepMonitor$1.perform(BuildStepMonitor.java:20)
at hudson.model.AbstractBuild$AbstractBuildExecution.perform(AbstractBuild.java:818)
at hudson.model.AbstractBuild$AbstractBuildExecution.performAllBuildSteps(AbstractBuild.java:767)
at hudson.model.Build$BuildExecution.post2(Build.java:179)
at hudson.model.AbstractBuild$AbstractBuildExecution.post(AbstractBuild.java:711)
at hudson.model.Run.execute(Run.java:1925)
at hudson.model.FreeStyleBuild.run(FreeStyleBuild.java:44)
at hudson.model.ResourceController.execute(ResourceController.java:101)
at hudson.model.Executor.run(Executor.java:442)
No artifacts found that match the file pattern "**/*.events,heapdumps/**,**/hs_err_pid*". Configuration error?
Recording test results
[Checks API] No suitable checks publisher found.
Build step 'Publish JUnit test result report' changed build result to UNSTABLE
Email was triggered for: Unstable (Test Failures)
Sending email for trigger: Unstable (Test Failures)
[JENKINS] Solr » Solr-Check-main-s390x - Build # 417 - Still unstable!
Posted by Apache Jenkins Server <je...@builds.apache.org>.
Build: https://ci-builds.apache.org/job/Solr/job/Solr-Check-main-s390x/417/
1 tests failed.
FAILED: org.apache.solr.cloud.api.collections.TestCollectionAPI.test
Error Message:
org.junit.ComparisonFailure: collection health expected:<[GREEN]> but was:<[YELLOW]>
Stack Trace:
org.junit.ComparisonFailure: collection health expected:<[GREEN]> but was:<[YELLOW]>
at __randomizedtesting.SeedInfo.seed([17894C28095BC068:9FDD73F2A7A7AD90]:0)
at org.junit.Assert.assertEquals(Assert.java:117)
at org.apache.solr.cloud.api.collections.TestCollectionAPI.clusterStatusWithCollectionHealthState(TestCollectionAPI.java:424)
at org.apache.solr.cloud.api.collections.TestCollectionAPI.test(TestCollectionAPI.java:94)
at java.base/jdk.internal.reflect.NativeMethodAccessorImpl.invoke0(Native Method)
at java.base/jdk.internal.reflect.NativeMethodAccessorImpl.invoke(NativeMethodAccessorImpl.java:62)
at java.base/jdk.internal.reflect.DelegatingMethodAccessorImpl.invoke(DelegatingMethodAccessorImpl.java:43)
at java.base/java.lang.reflect.Method.invoke(Method.java:566)
at com.carrotsearch.randomizedtesting.RandomizedRunner.invoke(RandomizedRunner.java:1758)
at com.carrotsearch.randomizedtesting.RandomizedRunner$8.evaluate(RandomizedRunner.java:946)
at com.carrotsearch.randomizedtesting.RandomizedRunner$9.evaluate(RandomizedRunner.java:982)
at com.carrotsearch.randomizedtesting.RandomizedRunner$10.evaluate(RandomizedRunner.java:996)
at org.apache.solr.BaseDistributedSearchTestCase$ShardsRepeatRule$ShardsFixedStatement.callStatement(BaseDistributedSearchTestCase.java:1079)
at org.apache.solr.BaseDistributedSearchTestCase$ShardsRepeatRule$ShardsStatement.evaluate(BaseDistributedSearchTestCase.java:1050)
at com.carrotsearch.randomizedtesting.rules.SystemPropertiesRestoreRule$1.evaluate(SystemPropertiesRestoreRule.java:80)
at org.junit.rules.RunRules.evaluate(RunRules.java:20)
at org.apache.lucene.tests.util.TestRuleSetupTeardownChained$1.evaluate(TestRuleSetupTeardownChained.java:48)
at org.apache.lucene.tests.util.AbstractBeforeAfterRule$1.evaluate(AbstractBeforeAfterRule.java:43)
at org.apache.lucene.tests.util.TestRuleThreadAndTestName$1.evaluate(TestRuleThreadAndTestName.java:45)
at org.apache.lucene.tests.util.TestRuleIgnoreAfterMaxFailures$1.evaluate(TestRuleIgnoreAfterMaxFailures.java:60)
at org.apache.lucene.tests.util.TestRuleMarkFailure$1.evaluate(TestRuleMarkFailure.java:44)
at org.junit.rules.RunRules.evaluate(RunRules.java:20)
at com.carrotsearch.randomizedtesting.rules.StatementAdapter.evaluate(StatementAdapter.java:36)
at com.carrotsearch.randomizedtesting.ThreadLeakControl$StatementRunner.run(ThreadLeakControl.java:390)
at com.carrotsearch.randomizedtesting.ThreadLeakControl.forkTimeoutingTask(ThreadLeakControl.java:843)
at com.carrotsearch.randomizedtesting.ThreadLeakControl$3.evaluate(ThreadLeakControl.java:490)
at com.carrotsearch.randomizedtesting.RandomizedRunner.runSingleTest(RandomizedRunner.java:955)
at com.carrotsearch.randomizedtesting.RandomizedRunner$5.evaluate(RandomizedRunner.java:840)
at com.carrotsearch.randomizedtesting.RandomizedRunner$6.evaluate(RandomizedRunner.java:891)
at com.carrotsearch.randomizedtesting.RandomizedRunner$7.evaluate(RandomizedRunner.java:902)
at com.carrotsearch.randomizedtesting.rules.StatementAdapter.evaluate(StatementAdapter.java:36)
at com.carrotsearch.randomizedtesting.rules.StatementAdapter.evaluate(StatementAdapter.java:36)
at org.apache.lucene.tests.util.AbstractBeforeAfterRule$1.evaluate(AbstractBeforeAfterRule.java:43)
at com.carrotsearch.randomizedtesting.rules.SystemPropertiesRestoreRule$1.evaluate(SystemPropertiesRestoreRule.java:80)
at org.junit.rules.RunRules.evaluate(RunRules.java:20)
at org.apache.lucene.tests.util.AbstractBeforeAfterRule$1.evaluate(AbstractBeforeAfterRule.java:43)
at com.carrotsearch.randomizedtesting.rules.StatementAdapter.evaluate(StatementAdapter.java:36)
at org.apache.lucene.tests.util.TestRuleStoreClassName$1.evaluate(TestRuleStoreClassName.java:38)
at com.carrotsearch.randomizedtesting.rules.NoShadowingOrOverridesOnMethodsRule$1.evaluate(NoShadowingOrOverridesOnMethodsRule.java:40)
at com.carrotsearch.randomizedtesting.rules.NoShadowingOrOverridesOnMethodsRule$1.evaluate(NoShadowingOrOverridesOnMethodsRule.java:40)
at com.carrotsearch.randomizedtesting.rules.StatementAdapter.evaluate(StatementAdapter.java:36)
at com.carrotsearch.randomizedtesting.rules.StatementAdapter.evaluate(StatementAdapter.java:36)
at org.apache.lucene.tests.util.TestRuleAssertionsRequired$1.evaluate(TestRuleAssertionsRequired.java:53)
at org.apache.lucene.tests.util.AbstractBeforeAfterRule$1.evaluate(AbstractBeforeAfterRule.java:43)
at org.apache.lucene.tests.util.TestRuleMarkFailure$1.evaluate(TestRuleMarkFailure.java:44)
at org.apache.lucene.tests.util.TestRuleIgnoreAfterMaxFailures$1.evaluate(TestRuleIgnoreAfterMaxFailures.java:60)
at org.apache.lucene.tests.util.TestRuleIgnoreTestSuites$1.evaluate(TestRuleIgnoreTestSuites.java:47)
at org.junit.rules.RunRules.evaluate(RunRules.java:20)
at com.carrotsearch.randomizedtesting.rules.StatementAdapter.evaluate(StatementAdapter.java:36)
at com.carrotsearch.randomizedtesting.ThreadLeakControl$StatementRunner.run(ThreadLeakControl.java:390)
at com.carrotsearch.randomizedtesting.ThreadLeakControl.lambda$forkTimeoutingTask$0(ThreadLeakControl.java:850)
at java.base/java.lang.Thread.run(Thread.java:829)
Build Log:
[...truncated 4488 lines...]
ERROR: The following test(s) have failed:
- org.apache.solr.cloud.api.collections.TestCollectionAPI.test (:solr:core)
Test output: /home/jenkins/jenkins-home/712657a4/workspace/Solr/Solr-Check-main-s390x/solr/core/build/test-results/test/outputs/OUTPUT-org.apache.solr.cloud.api.collections.TestCollectionAPI.txt
Reproduce with: gradlew :solr:core:test --tests "org.apache.solr.cloud.api.collections.TestCollectionAPI.test" -Ptests.jvms=4 -Ptests.haltonfailure=false "-Ptests.jvmargs=-XX:TieredStopAtLevel=1 -XX:+UseParallelGC -XX:ActiveProcessorCount=1 -XX:ReservedCodeCacheSize=120m" -Ptests.seed=17894C28095BC068 -Ptests.multiplier=2 -Ptests.badapples=false -Ptests.file.encoding=UTF-8
Deprecated Gradle features were used in this build, making it incompatible with Gradle 9.0.
You can use '--warning-mode all' to show the individual deprecation warnings and determine if they come from your own scripts or plugins.
For more on this, please refer to https://docs.gradle.org/8.4/userguide/command_line_interface.html#sec:command_line_warnings in the Gradle documentation.
BUILD SUCCESSFUL in 1h 7m 33s
584 actionable tasks: 584 executed
Publishing build scan...
https://ge.apache.org/s/3oqemylg5eu44
Build step 'Invoke Gradle script' changed build result to SUCCESS
Archiving artifacts
hudson.FilePath$ValidateAntFileMask$1Cancel
at hudson.FilePath$ValidateAntFileMask$1.isCaseSensitive(FilePath.java:3300)
at org.apache.tools.ant.DirectoryScanner.lambda$isIncluded$3(DirectoryScanner.java:1374)
at java.base/java.util.stream.MatchOps$1MatchSink.accept(MatchOps.java:90)
at java.base/java.util.Spliterators$ArraySpliterator.tryAdvance(Spliterators.java:958)
at java.base/java.util.stream.ReferencePipeline.forEachWithCancel(ReferencePipeline.java:127)
at java.base/java.util.stream.AbstractPipeline.copyIntoWithCancel(AbstractPipeline.java:502)
at java.base/java.util.stream.AbstractPipeline.copyInto(AbstractPipeline.java:488)
at java.base/java.util.stream.AbstractPipeline.wrapAndCopyInto(AbstractPipeline.java:474)
at java.base/java.util.stream.MatchOps$MatchOp.evaluateSequential(MatchOps.java:230)
at java.base/java.util.stream.MatchOps$MatchOp.evaluateSequential(MatchOps.java:196)
at java.base/java.util.stream.AbstractPipeline.evaluate(AbstractPipeline.java:234)
at java.base/java.util.stream.ReferencePipeline.anyMatch(ReferencePipeline.java:528)
at org.apache.tools.ant.DirectoryScanner.isIncluded(DirectoryScanner.java:1374)
at org.apache.tools.ant.DirectoryScanner.scandir(DirectoryScanner.java:1260)
at org.apache.tools.ant.DirectoryScanner.scandir(DirectoryScanner.java:1267)
at org.apache.tools.ant.DirectoryScanner.scandir(DirectoryScanner.java:1267)
at org.apache.tools.ant.DirectoryScanner.scandir(DirectoryScanner.java:1267)
at org.apache.tools.ant.DirectoryScanner.scandir(DirectoryScanner.java:1267)
at org.apache.tools.ant.DirectoryScanner.scandir(DirectoryScanner.java:1267)
at org.apache.tools.ant.DirectoryScanner.scandir(DirectoryScanner.java:1267)
at org.apache.tools.ant.DirectoryScanner.scandir(DirectoryScanner.java:1267)
at org.apache.tools.ant.DirectoryScanner.scandir(DirectoryScanner.java:1267)
at org.apache.tools.ant.DirectoryScanner.scandir(DirectoryScanner.java:1267)
at org.apache.tools.ant.DirectoryScanner.scandir(DirectoryScanner.java:1267)
at org.apache.tools.ant.DirectoryScanner.scandir(DirectoryScanner.java:1267)
at org.apache.tools.ant.DirectoryScanner.scandir(DirectoryScanner.java:1194)
at org.apache.tools.ant.DirectoryScanner.scandir(DirectoryScanner.java:1156)
at org.apache.tools.ant.DirectoryScanner.checkIncludePatterns(DirectoryScanner.java:954)
at org.apache.tools.ant.DirectoryScanner.scan(DirectoryScanner.java:912)
at hudson.FilePath$ValidateAntFileMask.hasMatch(FilePath.java:3313)
Caused: hudson.FilePath$FileMaskNoMatchesFoundException: no matches found within 10000
at hudson.FilePath$ValidateAntFileMask.hasMatch(FilePath.java:3318)
at hudson.FilePath$ValidateAntFileMask.invoke(FilePath.java:3196)
at hudson.FilePath$ValidateAntFileMask.invoke(FilePath.java:3174)
at hudson.FilePath$FileCallableWrapper.call(FilePath.java:3578)
Also: hudson.remoting.Channel$CallSiteStackTrace: Remote call to jenkins-s390x-1
at hudson.remoting.Channel.attachCallSiteStackTrace(Channel.java:1784)
at hudson.remoting.UserRequest$ExceptionResponse.retrieve(UserRequest.java:356)
at hudson.remoting.Channel.call(Channel.java:1000)
at hudson.FilePath.act(FilePath.java:1192)
at hudson.FilePath.act(FilePath.java:1181)
at hudson.FilePath.validateAntFileMask(FilePath.java:3171)
at hudson.tasks.ArtifactArchiver.perform(ArtifactArchiver.java:271)
at hudson.tasks.BuildStepCompatibilityLayer.perform(BuildStepCompatibilityLayer.java:80)
at hudson.tasks.BuildStepMonitor$1.perform(BuildStepMonitor.java:20)
at hudson.model.AbstractBuild$AbstractBuildExecution.perform(AbstractBuild.java:818)
at hudson.model.AbstractBuild$AbstractBuildExecution.performAllBuildSteps(AbstractBuild.java:767)
at hudson.model.Build$BuildExecution.post2(Build.java:179)
at hudson.model.AbstractBuild$AbstractBuildExecution.post(AbstractBuild.java:711)
at hudson.model.Run.execute(Run.java:1925)
at hudson.model.FreeStyleBuild.run(FreeStyleBuild.java:44)
at hudson.model.ResourceController.execute(ResourceController.java:101)
at hudson.model.Executor.run(Executor.java:442)
Caused: hudson.FilePath$TunneledInterruptedException
at hudson.FilePath$FileCallableWrapper.call(FilePath.java:3580)
at hudson.remoting.UserRequest.perform(UserRequest.java:211)
at hudson.remoting.UserRequest.perform(UserRequest.java:54)
at hudson.remoting.Request$2.run(Request.java:377)
at hudson.remoting.InterceptingExecutorService.lambda$wrap$0(InterceptingExecutorService.java:78)
at java.base/java.util.concurrent.FutureTask.run(FutureTask.java:264)
at java.base/java.util.concurrent.ThreadPoolExecutor.runWorker(ThreadPoolExecutor.java:1128)
at java.base/java.util.concurrent.ThreadPoolExecutor$Worker.run(ThreadPoolExecutor.java:628)
at java.base/java.lang.Thread.run(Thread.java:829)
Caused: java.lang.InterruptedException: hudson.FilePath$FileMaskNoMatchesFoundException: no matches found within 10000
at hudson.FilePath.act(FilePath.java:1194)
at hudson.FilePath.act(FilePath.java:1181)
at hudson.FilePath.validateAntFileMask(FilePath.java:3171)
at hudson.tasks.ArtifactArchiver.perform(ArtifactArchiver.java:271)
at hudson.tasks.BuildStepCompatibilityLayer.perform(BuildStepCompatibilityLayer.java:80)
at hudson.tasks.BuildStepMonitor$1.perform(BuildStepMonitor.java:20)
at hudson.model.AbstractBuild$AbstractBuildExecution.perform(AbstractBuild.java:818)
at hudson.model.AbstractBuild$AbstractBuildExecution.performAllBuildSteps(AbstractBuild.java:767)
at hudson.model.Build$BuildExecution.post2(Build.java:179)
at hudson.model.AbstractBuild$AbstractBuildExecution.post(AbstractBuild.java:711)
at hudson.model.Run.execute(Run.java:1925)
at hudson.model.FreeStyleBuild.run(FreeStyleBuild.java:44)
at hudson.model.ResourceController.execute(ResourceController.java:101)
at hudson.model.Executor.run(Executor.java:442)
No artifacts found that match the file pattern "**/*.events,heapdumps/**,**/hs_err_pid*". Configuration error?
Recording test results
[Checks API] No suitable checks publisher found.
Build step 'Publish JUnit test result report' changed build result to UNSTABLE
Email was triggered for: Unstable (Test Failures)
Sending email for trigger: Unstable (Test Failures)
[JENKINS] Solr » Solr-Check-main-s390x - Build # 416 - Failure!
Posted by Apache Jenkins Server <je...@builds.apache.org>.
Build: https://ci-builds.apache.org/job/Solr/job/Solr-Check-main-s390x/416/
17 tests failed.
FAILED: org.apache.solr.cloud.DeleteReplicaTest.deleteReplicaAndVerifyDirectoryCleanup
Error Message:
org.apache.solr.common.SolrException: No registered leader was found after waiting for 4000ms , collection: deletereplica_test slice: shard1 saw state=DocCollection(deletereplica_test//collections/deletereplica_test/state.json/6 )={
"pullReplicas":"0",
"configName":"conf",
"replicationFactor":2,
"router":{"name":"compositeId"},
"nrtReplicas":2,
"tlogReplicas":"0",
"shards":{"shard1":{
"range":"80000000-7fffffff",
"state":"active",
"replicas":{"core_node4":{
"core":"deletereplica_test_shard1_replica_n2",
"node_name":"127.0.0.1:43031_solr",
"type":"NRT",
"state":"active",
"force_set_state":"false",
"base_url":"https://127.0.0.1:43031/solr"}}}}} with live_nodes=[127.0.0.1:33777_solr, 127.0.0.1:45211_solr, 127.0.0.1:44045_solr, 127.0.0.1:43031_solr]
Stack Trace:
org.apache.solr.common.SolrException: No registered leader was found after waiting for 4000ms , collection: deletereplica_test slice: shard1 saw state=DocCollection(deletereplica_test//collections/deletereplica_test/state.json/6 )={
"pullReplicas":"0",
"configName":"conf",
"replicationFactor":2,
"router":{"name":"compositeId"},
"nrtReplicas":2,
"tlogReplicas":"0",
"shards":{"shard1":{
"range":"80000000-7fffffff",
"state":"active",
"replicas":{"core_node4":{
"core":"deletereplica_test_shard1_replica_n2",
"node_name":"127.0.0.1:43031_solr",
"type":"NRT",
"state":"active",
"force_set_state":"false",
"base_url":"https://127.0.0.1:43031/solr"}}}}} with live_nodes=[127.0.0.1:33777_solr, 127.0.0.1:45211_solr, 127.0.0.1:44045_solr, 127.0.0.1:43031_solr]
at __randomizedtesting.SeedInfo.seed([A9ED8862B60D8E18:D90D0CD832422713]:0)
at app//org.apache.solr.common.cloud.ZkStateReader.getLeaderRetry(ZkStateReader.java:965)
at app//org.apache.solr.common.cloud.ZkStateReader.getLeaderRetry(ZkStateReader.java:930)
at app//org.apache.solr.cloud.DeleteReplicaTest.deleteReplicaAndVerifyDirectoryCleanup(DeleteReplicaTest.java:177)
at java.base@11.0.16.1/jdk.internal.reflect.NativeMethodAccessorImpl.invoke0(Native Method)
at java.base@11.0.16.1/jdk.internal.reflect.NativeMethodAccessorImpl.invoke(NativeMethodAccessorImpl.java:62)
at java.base@11.0.16.1/jdk.internal.reflect.DelegatingMethodAccessorImpl.invoke(DelegatingMethodAccessorImpl.java:43)
at java.base@11.0.16.1/java.lang.reflect.Method.invoke(Method.java:566)
at app//com.carrotsearch.randomizedtesting.RandomizedRunner.invoke(RandomizedRunner.java:1758)
at app//com.carrotsearch.randomizedtesting.RandomizedRunner$8.evaluate(RandomizedRunner.java:946)
at app//com.carrotsearch.randomizedtesting.RandomizedRunner$9.evaluate(RandomizedRunner.java:982)
at app//com.carrotsearch.randomizedtesting.RandomizedRunner$10.evaluate(RandomizedRunner.java:996)
at app//com.carrotsearch.randomizedtesting.rules.SystemPropertiesRestoreRule$1.evaluate(SystemPropertiesRestoreRule.java:80)
at app//org.junit.rules.RunRules.evaluate(RunRules.java:20)
at app//org.apache.lucene.tests.util.TestRuleSetupTeardownChained$1.evaluate(TestRuleSetupTeardownChained.java:48)
at app//org.apache.lucene.tests.util.AbstractBeforeAfterRule$1.evaluate(AbstractBeforeAfterRule.java:43)
at app//org.apache.lucene.tests.util.TestRuleThreadAndTestName$1.evaluate(TestRuleThreadAndTestName.java:45)
at app//org.apache.lucene.tests.util.TestRuleIgnoreAfterMaxFailures$1.evaluate(TestRuleIgnoreAfterMaxFailures.java:60)
at app//org.apache.lucene.tests.util.TestRuleMarkFailure$1.evaluate(TestRuleMarkFailure.java:44)
at app//org.junit.rules.RunRules.evaluate(RunRules.java:20)
at app//com.carrotsearch.randomizedtesting.rules.StatementAdapter.evaluate(StatementAdapter.java:36)
at app//com.carrotsearch.randomizedtesting.ThreadLeakControl$StatementRunner.run(ThreadLeakControl.java:390)
at app//com.carrotsearch.randomizedtesting.ThreadLeakControl.forkTimeoutingTask(ThreadLeakControl.java:843)
at app//com.carrotsearch.randomizedtesting.ThreadLeakControl$3.evaluate(ThreadLeakControl.java:490)
at app//com.carrotsearch.randomizedtesting.RandomizedRunner.runSingleTest(RandomizedRunner.java:955)
at app//com.carrotsearch.randomizedtesting.RandomizedRunner$5.evaluate(RandomizedRunner.java:840)
at app//com.carrotsearch.randomizedtesting.RandomizedRunner$6.evaluate(RandomizedRunner.java:891)
at app//com.carrotsearch.randomizedtesting.RandomizedRunner$7.evaluate(RandomizedRunner.java:902)
at app//com.carrotsearch.randomizedtesting.rules.StatementAdapter.evaluate(StatementAdapter.java:36)
at app//com.carrotsearch.randomizedtesting.rules.StatementAdapter.evaluate(StatementAdapter.java:36)
at app//org.apache.lucene.tests.util.AbstractBeforeAfterRule$1.evaluate(AbstractBeforeAfterRule.java:43)
at app//com.carrotsearch.randomizedtesting.rules.SystemPropertiesRestoreRule$1.evaluate(SystemPropertiesRestoreRule.java:80)
at app//org.junit.rules.RunRules.evaluate(RunRules.java:20)
at app//org.apache.lucene.tests.util.AbstractBeforeAfterRule$1.evaluate(AbstractBeforeAfterRule.java:43)
at app//com.carrotsearch.randomizedtesting.rules.StatementAdapter.evaluate(StatementAdapter.java:36)
at app//org.apache.lucene.tests.util.TestRuleStoreClassName$1.evaluate(TestRuleStoreClassName.java:38)
at app//com.carrotsearch.randomizedtesting.rules.NoShadowingOrOverridesOnMethodsRule$1.evaluate(NoShadowingOrOverridesOnMethodsRule.java:40)
at app//com.carrotsearch.randomizedtesting.rules.NoShadowingOrOverridesOnMethodsRule$1.evaluate(NoShadowingOrOverridesOnMethodsRule.java:40)
at app//com.carrotsearch.randomizedtesting.rules.StatementAdapter.evaluate(StatementAdapter.java:36)
at app//com.carrotsearch.randomizedtesting.rules.StatementAdapter.evaluate(StatementAdapter.java:36)
at app//org.apache.lucene.tests.util.TestRuleAssertionsRequired$1.evaluate(TestRuleAssertionsRequired.java:53)
at app//org.apache.lucene.tests.util.AbstractBeforeAfterRule$1.evaluate(AbstractBeforeAfterRule.java:43)
at app//org.apache.lucene.tests.util.TestRuleMarkFailure$1.evaluate(TestRuleMarkFailure.java:44)
at app//org.apache.lucene.tests.util.TestRuleIgnoreAfterMaxFailures$1.evaluate(TestRuleIgnoreAfterMaxFailures.java:60)
at app//org.apache.lucene.tests.util.TestRuleIgnoreTestSuites$1.evaluate(TestRuleIgnoreTestSuites.java:47)
at app//org.junit.rules.RunRules.evaluate(RunRules.java:20)
at app//com.carrotsearch.randomizedtesting.rules.StatementAdapter.evaluate(StatementAdapter.java:36)
at app//com.carrotsearch.randomizedtesting.ThreadLeakControl$StatementRunner.run(ThreadLeakControl.java:390)
at app//com.carrotsearch.randomizedtesting.ThreadLeakControl.lambda$forkTimeoutingTask$0(ThreadLeakControl.java:850)
at java.base@11.0.16.1/java.lang.Thread.run(Thread.java:829)
FAILED: org.apache.solr.cloud.OverseerTest.testReplay
Error Message:
java.util.concurrent.TimeoutException: Timeout waiting to see state for collection=collection1 :DocCollection(collection1//collections/collection1/state.json/1 )={
"pullReplicas":"0",
"replicationFactor":"1",
"router":{"name":"compositeId"},
"nrtReplicas":"1",
"tlogReplicas":"0",
"autoCreated":"true",
"shards":{"shard1":{
"range":"80000000-7fffffff",
"state":"active",
"replicas":{"core_node1":{
"core":"core1",
"node_name":"127.0.0.1:8983_solr",
"type":"NRT",
"state":"recovering",
"base_url":"http://127.0.0.1:8983/solr",
"roles":""}}}}}
Stack Trace:
java.util.concurrent.TimeoutException: Timeout waiting to see state for collection=collection1 :DocCollection(collection1//collections/collection1/state.json/1 )={
"pullReplicas":"0",
"replicationFactor":"1",
"router":{"name":"compositeId"},
"nrtReplicas":"1",
"tlogReplicas":"0",
"autoCreated":"true",
"shards":{"shard1":{
"range":"80000000-7fffffff",
"state":"active",
"replicas":{"core_node1":{
"core":"core1",
"node_name":"127.0.0.1:8983_solr",
"type":"NRT",
"state":"recovering",
"base_url":"http://127.0.0.1:8983/solr",
"roles":""}}}}}
at __randomizedtesting.SeedInfo.seed([A9ED8862B60D8E18:E1248026583EFF63]:0)
at org.apache.solr.common.cloud.ZkStateReader.waitForState(ZkStateReader.java:1830)
at org.apache.solr.cloud.OverseerTest.testReplay(OverseerTest.java:1649)
at java.base/jdk.internal.reflect.NativeMethodAccessorImpl.invoke0(Native Method)
at java.base/jdk.internal.reflect.NativeMethodAccessorImpl.invoke(NativeMethodAccessorImpl.java:62)
at java.base/jdk.internal.reflect.DelegatingMethodAccessorImpl.invoke(DelegatingMethodAccessorImpl.java:43)
at java.base/java.lang.reflect.Method.invoke(Method.java:566)
at com.carrotsearch.randomizedtesting.RandomizedRunner.invoke(RandomizedRunner.java:1758)
at com.carrotsearch.randomizedtesting.RandomizedRunner$8.evaluate(RandomizedRunner.java:946)
at com.carrotsearch.randomizedtesting.RandomizedRunner$9.evaluate(RandomizedRunner.java:982)
at com.carrotsearch.randomizedtesting.RandomizedRunner$10.evaluate(RandomizedRunner.java:996)
at com.carrotsearch.randomizedtesting.rules.SystemPropertiesRestoreRule$1.evaluate(SystemPropertiesRestoreRule.java:80)
at org.junit.rules.RunRules.evaluate(RunRules.java:20)
at org.apache.lucene.tests.util.TestRuleSetupTeardownChained$1.evaluate(TestRuleSetupTeardownChained.java:48)
at org.apache.lucene.tests.util.AbstractBeforeAfterRule$1.evaluate(AbstractBeforeAfterRule.java:43)
at org.apache.lucene.tests.util.TestRuleThreadAndTestName$1.evaluate(TestRuleThreadAndTestName.java:45)
at org.apache.lucene.tests.util.TestRuleIgnoreAfterMaxFailures$1.evaluate(TestRuleIgnoreAfterMaxFailures.java:60)
at org.apache.lucene.tests.util.TestRuleMarkFailure$1.evaluate(TestRuleMarkFailure.java:44)
at org.junit.rules.RunRules.evaluate(RunRules.java:20)
at com.carrotsearch.randomizedtesting.rules.StatementAdapter.evaluate(StatementAdapter.java:36)
at com.carrotsearch.randomizedtesting.ThreadLeakControl$StatementRunner.run(ThreadLeakControl.java:390)
at com.carrotsearch.randomizedtesting.ThreadLeakControl.forkTimeoutingTask(ThreadLeakControl.java:843)
at com.carrotsearch.randomizedtesting.ThreadLeakControl$3.evaluate(ThreadLeakControl.java:490)
at com.carrotsearch.randomizedtesting.RandomizedRunner.runSingleTest(RandomizedRunner.java:955)
at com.carrotsearch.randomizedtesting.RandomizedRunner$5.evaluate(RandomizedRunner.java:840)
at com.carrotsearch.randomizedtesting.RandomizedRunner$6.evaluate(RandomizedRunner.java:891)
at com.carrotsearch.randomizedtesting.RandomizedRunner$7.evaluate(RandomizedRunner.java:902)
at com.carrotsearch.randomizedtesting.rules.StatementAdapter.evaluate(StatementAdapter.java:36)
at com.carrotsearch.randomizedtesting.rules.StatementAdapter.evaluate(StatementAdapter.java:36)
at org.apache.lucene.tests.util.AbstractBeforeAfterRule$1.evaluate(AbstractBeforeAfterRule.java:43)
at com.carrotsearch.randomizedtesting.rules.SystemPropertiesRestoreRule$1.evaluate(SystemPropertiesRestoreRule.java:80)
at org.junit.rules.RunRules.evaluate(RunRules.java:20)
at org.apache.lucene.tests.util.AbstractBeforeAfterRule$1.evaluate(AbstractBeforeAfterRule.java:43)
at com.carrotsearch.randomizedtesting.rules.StatementAdapter.evaluate(StatementAdapter.java:36)
at org.apache.lucene.tests.util.TestRuleStoreClassName$1.evaluate(TestRuleStoreClassName.java:38)
at com.carrotsearch.randomizedtesting.rules.NoShadowingOrOverridesOnMethodsRule$1.evaluate(NoShadowingOrOverridesOnMethodsRule.java:40)
at com.carrotsearch.randomizedtesting.rules.NoShadowingOrOverridesOnMethodsRule$1.evaluate(NoShadowingOrOverridesOnMethodsRule.java:40)
at com.carrotsearch.randomizedtesting.rules.StatementAdapter.evaluate(StatementAdapter.java:36)
at com.carrotsearch.randomizedtesting.rules.StatementAdapter.evaluate(StatementAdapter.java:36)
at org.apache.lucene.tests.util.TestRuleAssertionsRequired$1.evaluate(TestRuleAssertionsRequired.java:53)
at org.apache.lucene.tests.util.AbstractBeforeAfterRule$1.evaluate(AbstractBeforeAfterRule.java:43)
at org.apache.lucene.tests.util.TestRuleMarkFailure$1.evaluate(TestRuleMarkFailure.java:44)
at org.apache.lucene.tests.util.TestRuleIgnoreAfterMaxFailures$1.evaluate(TestRuleIgnoreAfterMaxFailures.java:60)
at org.apache.lucene.tests.util.TestRuleIgnoreTestSuites$1.evaluate(TestRuleIgnoreTestSuites.java:47)
at org.junit.rules.RunRules.evaluate(RunRules.java:20)
at com.carrotsearch.randomizedtesting.rules.StatementAdapter.evaluate(StatementAdapter.java:36)
at com.carrotsearch.randomizedtesting.ThreadLeakControl$StatementRunner.run(ThreadLeakControl.java:390)
at com.carrotsearch.randomizedtesting.ThreadLeakControl.lambda$forkTimeoutingTask$0(ThreadLeakControl.java:850)
at java.base/java.lang.Thread.run(Thread.java:829)
FAILED: org.apache.solr.cloud.ReplicationFactorTest.test
Error Message:
org.apache.solr.client.solrj.impl.BaseHttpSolrClient$RemoteSolrException: Error from server at http://127.0.0.1:42383/solr: Underlying core creation failed while creating collection: repfacttest_c8n_2x2
Stack Trace:
org.apache.solr.client.solrj.impl.BaseHttpSolrClient$RemoteSolrException: Error from server at http://127.0.0.1:42383/solr: Underlying core creation failed while creating collection: repfacttest_c8n_2x2
at __randomizedtesting.SeedInfo.seed([A9ED8862B60D8E18:21B9B7B818F1E3E0]:0)
at app//org.apache.solr.client.solrj.impl.HttpSolrClient.executeMethod(HttpSolrClient.java:734)
at app//org.apache.solr.client.solrj.impl.HttpSolrClient.request(HttpSolrClient.java:253)
at app//org.apache.solr.client.solrj.impl.HttpSolrClient.request(HttpSolrClient.java:234)
at app//org.apache.solr.client.solrj.SolrClient.request(SolrClient.java:1193)
at app//org.apache.solr.cloud.AbstractFullDistribZkTestBase.createCollection(AbstractFullDistribZkTestBase.java:2097)
at app//org.apache.solr.cloud.AbstractFullDistribZkTestBase.createCollection(AbstractFullDistribZkTestBase.java:2135)
at app//org.apache.solr.cloud.AbstractFullDistribZkTestBase.createCollection(AbstractFullDistribZkTestBase.java:2023)
at app//org.apache.solr.cloud.ReplicationFactorTest.createCollectionWithRetry(ReplicationFactorTest.java:514)
at app//org.apache.solr.cloud.ReplicationFactorTest.testRf2NotUsingDirectUpdates(ReplicationFactorTest.java:111)
at app//org.apache.solr.cloud.ReplicationFactorTest.test(ReplicationFactorTest.java:95)
at java.base@11.0.16.1/jdk.internal.reflect.NativeMethodAccessorImpl.invoke0(Native Method)
at java.base@11.0.16.1/jdk.internal.reflect.NativeMethodAccessorImpl.invoke(NativeMethodAccessorImpl.java:62)
at java.base@11.0.16.1/jdk.internal.reflect.DelegatingMethodAccessorImpl.invoke(DelegatingMethodAccessorImpl.java:43)
at java.base@11.0.16.1/java.lang.reflect.Method.invoke(Method.java:566)
at app//com.carrotsearch.randomizedtesting.RandomizedRunner.invoke(RandomizedRunner.java:1758)
at app//com.carrotsearch.randomizedtesting.RandomizedRunner$8.evaluate(RandomizedRunner.java:946)
at app//com.carrotsearch.randomizedtesting.RandomizedRunner$9.evaluate(RandomizedRunner.java:982)
at app//com.carrotsearch.randomizedtesting.RandomizedRunner$10.evaluate(RandomizedRunner.java:996)
at app//org.apache.solr.BaseDistributedSearchTestCase$ShardsRepeatRule$ShardsFixedStatement.callStatement(BaseDistributedSearchTestCase.java:1079)
at app//org.apache.solr.BaseDistributedSearchTestCase$ShardsRepeatRule$ShardsStatement.evaluate(BaseDistributedSearchTestCase.java:1050)
at app//com.carrotsearch.randomizedtesting.rules.SystemPropertiesRestoreRule$1.evaluate(SystemPropertiesRestoreRule.java:80)
at app//org.junit.rules.RunRules.evaluate(RunRules.java:20)
at app//org.apache.lucene.tests.util.TestRuleSetupTeardownChained$1.evaluate(TestRuleSetupTeardownChained.java:48)
at app//org.apache.lucene.tests.util.AbstractBeforeAfterRule$1.evaluate(AbstractBeforeAfterRule.java:43)
at app//org.apache.lucene.tests.util.TestRuleThreadAndTestName$1.evaluate(TestRuleThreadAndTestName.java:45)
at app//org.apache.lucene.tests.util.TestRuleIgnoreAfterMaxFailures$1.evaluate(TestRuleIgnoreAfterMaxFailures.java:60)
at app//org.apache.lucene.tests.util.TestRuleMarkFailure$1.evaluate(TestRuleMarkFailure.java:44)
at app//org.junit.rules.RunRules.evaluate(RunRules.java:20)
at app//com.carrotsearch.randomizedtesting.rules.StatementAdapter.evaluate(StatementAdapter.java:36)
at app//com.carrotsearch.randomizedtesting.ThreadLeakControl$StatementRunner.run(ThreadLeakControl.java:390)
at app//com.carrotsearch.randomizedtesting.ThreadLeakControl.forkTimeoutingTask(ThreadLeakControl.java:843)
at app//com.carrotsearch.randomizedtesting.ThreadLeakControl$3.evaluate(ThreadLeakControl.java:490)
at app//com.carrotsearch.randomizedtesting.RandomizedRunner.runSingleTest(RandomizedRunner.java:955)
at app//com.carrotsearch.randomizedtesting.RandomizedRunner$5.evaluate(RandomizedRunner.java:840)
at app//com.carrotsearch.randomizedtesting.RandomizedRunner$6.evaluate(RandomizedRunner.java:891)
at app//com.carrotsearch.randomizedtesting.RandomizedRunner$7.evaluate(RandomizedRunner.java:902)
at app//com.carrotsearch.randomizedtesting.rules.StatementAdapter.evaluate(StatementAdapter.java:36)
at app//com.carrotsearch.randomizedtesting.rules.StatementAdapter.evaluate(StatementAdapter.java:36)
at app//org.apache.lucene.tests.util.AbstractBeforeAfterRule$1.evaluate(AbstractBeforeAfterRule.java:43)
at app//com.carrotsearch.randomizedtesting.rules.SystemPropertiesRestoreRule$1.evaluate(SystemPropertiesRestoreRule.java:80)
at app//org.junit.rules.RunRules.evaluate(RunRules.java:20)
at app//org.apache.lucene.tests.util.AbstractBeforeAfterRule$1.evaluate(AbstractBeforeAfterRule.java:43)
at app//com.carrotsearch.randomizedtesting.rules.StatementAdapter.evaluate(StatementAdapter.java:36)
at app//org.apache.lucene.tests.util.TestRuleStoreClassName$1.evaluate(TestRuleStoreClassName.java:38)
at app//com.carrotsearch.randomizedtesting.rules.NoShadowingOrOverridesOnMethodsRule$1.evaluate(NoShadowingOrOverridesOnMethodsRule.java:40)
at app//com.carrotsearch.randomizedtesting.rules.NoShadowingOrOverridesOnMethodsRule$1.evaluate(NoShadowingOrOverridesOnMethodsRule.java:40)
at app//com.carrotsearch.randomizedtesting.rules.StatementAdapter.evaluate(StatementAdapter.java:36)
at app//com.carrotsearch.randomizedtesting.rules.StatementAdapter.evaluate(StatementAdapter.java:36)
at app//org.apache.lucene.tests.util.TestRuleAssertionsRequired$1.evaluate(TestRuleAssertionsRequired.java:53)
at app//org.apache.lucene.tests.util.AbstractBeforeAfterRule$1.evaluate(AbstractBeforeAfterRule.java:43)
at app//org.apache.lucene.tests.util.TestRuleMarkFailure$1.evaluate(TestRuleMarkFailure.java:44)
at app//org.apache.lucene.tests.util.TestRuleIgnoreAfterMaxFailures$1.evaluate(TestRuleIgnoreAfterMaxFailures.java:60)
at app//org.apache.lucene.tests.util.TestRuleIgnoreTestSuites$1.evaluate(TestRuleIgnoreTestSuites.java:47)
at app//org.junit.rules.RunRules.evaluate(RunRules.java:20)
at app//com.carrotsearch.randomizedtesting.rules.StatementAdapter.evaluate(StatementAdapter.java:36)
at app//com.carrotsearch.randomizedtesting.ThreadLeakControl$StatementRunner.run(ThreadLeakControl.java:390)
at app//com.carrotsearch.randomizedtesting.ThreadLeakControl.lambda$forkTimeoutingTask$0(ThreadLeakControl.java:850)
at java.base@11.0.16.1/java.lang.Thread.run(Thread.java:829)
FAILED: org.apache.solr.cloud.TestRandomRequestDistribution.test
Error Message:
org.apache.solr.client.solrj.impl.BaseHttpSolrClient$RemoteSolrException: Error from server at http://127.0.0.1:45465/solr: Underlying core creation failed while creating collection: a1x2
Stack Trace:
org.apache.solr.client.solrj.impl.BaseHttpSolrClient$RemoteSolrException: Error from server at http://127.0.0.1:45465/solr: Underlying core creation failed while creating collection: a1x2
at __randomizedtesting.SeedInfo.seed([A9ED8862B60D8E18:21B9B7B818F1E3E0]:0)
at app//org.apache.solr.client.solrj.impl.HttpSolrClient.executeMethod(HttpSolrClient.java:734)
at app//org.apache.solr.client.solrj.impl.HttpSolrClient.request(HttpSolrClient.java:253)
at app//org.apache.solr.client.solrj.impl.HttpSolrClient.request(HttpSolrClient.java:234)
at app//org.apache.solr.client.solrj.impl.LBSolrClient.doRequest(LBSolrClient.java:386)
at app//org.apache.solr.client.solrj.impl.LBSolrClient.request(LBSolrClient.java:352)
at app//org.apache.solr.client.solrj.impl.CloudSolrClient.sendRequest(CloudSolrClient.java:1136)
at app//org.apache.solr.client.solrj.impl.CloudSolrClient.requestWithRetryOnStaleState(CloudSolrClient.java:835)
at app//org.apache.solr.client.solrj.impl.CloudSolrClient.request(CloudSolrClient.java:766)
at app//org.apache.solr.client.solrj.SolrRequest.process(SolrRequest.java:216)
at app//org.apache.solr.client.solrj.SolrRequest.process(SolrRequest.java:231)
at app//org.apache.solr.cloud.TestRandomRequestDistribution.testRequestTracking(TestRandomRequestDistribution.java:76)
at app//org.apache.solr.cloud.TestRandomRequestDistribution.test(TestRandomRequestDistribution.java:67)
at java.base@11.0.16.1/jdk.internal.reflect.NativeMethodAccessorImpl.invoke0(Native Method)
at java.base@11.0.16.1/jdk.internal.reflect.NativeMethodAccessorImpl.invoke(NativeMethodAccessorImpl.java:62)
at java.base@11.0.16.1/jdk.internal.reflect.DelegatingMethodAccessorImpl.invoke(DelegatingMethodAccessorImpl.java:43)
at java.base@11.0.16.1/java.lang.reflect.Method.invoke(Method.java:566)
at app//com.carrotsearch.randomizedtesting.RandomizedRunner.invoke(RandomizedRunner.java:1758)
at app//com.carrotsearch.randomizedtesting.RandomizedRunner$8.evaluate(RandomizedRunner.java:946)
at app//com.carrotsearch.randomizedtesting.RandomizedRunner$9.evaluate(RandomizedRunner.java:982)
at app//com.carrotsearch.randomizedtesting.RandomizedRunner$10.evaluate(RandomizedRunner.java:996)
at app//org.apache.solr.BaseDistributedSearchTestCase$ShardsRepeatRule$ShardsFixedStatement.callStatement(BaseDistributedSearchTestCase.java:1079)
at app//org.apache.solr.BaseDistributedSearchTestCase$ShardsRepeatRule$ShardsStatement.evaluate(BaseDistributedSearchTestCase.java:1050)
at app//com.carrotsearch.randomizedtesting.rules.SystemPropertiesRestoreRule$1.evaluate(SystemPropertiesRestoreRule.java:80)
at app//org.junit.rules.RunRules.evaluate(RunRules.java:20)
at app//org.apache.lucene.tests.util.TestRuleSetupTeardownChained$1.evaluate(TestRuleSetupTeardownChained.java:48)
at app//org.apache.lucene.tests.util.AbstractBeforeAfterRule$1.evaluate(AbstractBeforeAfterRule.java:43)
at app//org.apache.lucene.tests.util.TestRuleThreadAndTestName$1.evaluate(TestRuleThreadAndTestName.java:45)
at app//org.apache.lucene.tests.util.TestRuleIgnoreAfterMaxFailures$1.evaluate(TestRuleIgnoreAfterMaxFailures.java:60)
at app//org.apache.lucene.tests.util.TestRuleMarkFailure$1.evaluate(TestRuleMarkFailure.java:44)
at app//org.junit.rules.RunRules.evaluate(RunRules.java:20)
at app//com.carrotsearch.randomizedtesting.rules.StatementAdapter.evaluate(StatementAdapter.java:36)
at app//com.carrotsearch.randomizedtesting.ThreadLeakControl$StatementRunner.run(ThreadLeakControl.java:390)
at app//com.carrotsearch.randomizedtesting.ThreadLeakControl.forkTimeoutingTask(ThreadLeakControl.java:843)
at app//com.carrotsearch.randomizedtesting.ThreadLeakControl$3.evaluate(ThreadLeakControl.java:490)
at app//com.carrotsearch.randomizedtesting.RandomizedRunner.runSingleTest(RandomizedRunner.java:955)
at app//com.carrotsearch.randomizedtesting.RandomizedRunner$5.evaluate(RandomizedRunner.java:840)
at app//com.carrotsearch.randomizedtesting.RandomizedRunner$6.evaluate(RandomizedRunner.java:891)
at app//com.carrotsearch.randomizedtesting.RandomizedRunner$7.evaluate(RandomizedRunner.java:902)
at app//com.carrotsearch.randomizedtesting.rules.StatementAdapter.evaluate(StatementAdapter.java:36)
at app//com.carrotsearch.randomizedtesting.rules.StatementAdapter.evaluate(StatementAdapter.java:36)
at app//org.apache.lucene.tests.util.AbstractBeforeAfterRule$1.evaluate(AbstractBeforeAfterRule.java:43)
at app//com.carrotsearch.randomizedtesting.rules.SystemPropertiesRestoreRule$1.evaluate(SystemPropertiesRestoreRule.java:80)
at app//org.junit.rules.RunRules.evaluate(RunRules.java:20)
at app//org.apache.lucene.tests.util.AbstractBeforeAfterRule$1.evaluate(AbstractBeforeAfterRule.java:43)
at app//com.carrotsearch.randomizedtesting.rules.StatementAdapter.evaluate(StatementAdapter.java:36)
at app//org.apache.lucene.tests.util.TestRuleStoreClassName$1.evaluate(TestRuleStoreClassName.java:38)
at app//com.carrotsearch.randomizedtesting.rules.NoShadowingOrOverridesOnMethodsRule$1.evaluate(NoShadowingOrOverridesOnMethodsRule.java:40)
at app//com.carrotsearch.randomizedtesting.rules.NoShadowingOrOverridesOnMethodsRule$1.evaluate(NoShadowingOrOverridesOnMethodsRule.java:40)
at app//com.carrotsearch.randomizedtesting.rules.StatementAdapter.evaluate(StatementAdapter.java:36)
at app//com.carrotsearch.randomizedtesting.rules.StatementAdapter.evaluate(StatementAdapter.java:36)
at app//org.apache.lucene.tests.util.TestRuleAssertionsRequired$1.evaluate(TestRuleAssertionsRequired.java:53)
at app//org.apache.lucene.tests.util.AbstractBeforeAfterRule$1.evaluate(AbstractBeforeAfterRule.java:43)
at app//org.apache.lucene.tests.util.TestRuleMarkFailure$1.evaluate(TestRuleMarkFailure.java:44)
at app//org.apache.lucene.tests.util.TestRuleIgnoreAfterMaxFailures$1.evaluate(TestRuleIgnoreAfterMaxFailures.java:60)
at app//org.apache.lucene.tests.util.TestRuleIgnoreTestSuites$1.evaluate(TestRuleIgnoreTestSuites.java:47)
at app//org.junit.rules.RunRules.evaluate(RunRules.java:20)
at app//com.carrotsearch.randomizedtesting.rules.StatementAdapter.evaluate(StatementAdapter.java:36)
at app//com.carrotsearch.randomizedtesting.ThreadLeakControl$StatementRunner.run(ThreadLeakControl.java:390)
at app//com.carrotsearch.randomizedtesting.ThreadLeakControl.lambda$forkTimeoutingTask$0(ThreadLeakControl.java:850)
at java.base@11.0.16.1/java.lang.Thread.run(Thread.java:829)
FAILED: org.apache.solr.cloud.api.collections.LocalFSInstallShardTest.testParallelInstallToMultiShardCollection
Error Message:
org.apache.solr.client.solrj.SolrServerException: Timeout occurred while waiting response from server at: http://127.0.0.1:34015/solr
Stack Trace:
org.apache.solr.client.solrj.SolrServerException: Timeout occurred while waiting response from server at: http://127.0.0.1:34015/solr
at __randomizedtesting.SeedInfo.seed([A9ED8862B60D8E18:B9579EA4F7F21DA]:0)
at app//org.apache.solr.client.solrj.impl.HttpSolrClient.executeMethod(HttpSolrClient.java:743)
at app//org.apache.solr.client.solrj.impl.HttpSolrClient.request(HttpSolrClient.java:253)
at app//org.apache.solr.client.solrj.impl.HttpSolrClient.request(HttpSolrClient.java:234)
at app//org.apache.solr.client.solrj.impl.LBSolrClient.doRequest(LBSolrClient.java:386)
at app//org.apache.solr.client.solrj.impl.LBSolrClient.request(LBSolrClient.java:352)
at app//org.apache.solr.client.solrj.impl.CloudSolrClient.sendRequest(CloudSolrClient.java:1136)
at app//org.apache.solr.client.solrj.impl.CloudSolrClient.requestWithRetryOnStaleState(CloudSolrClient.java:835)
at app//org.apache.solr.client.solrj.impl.CloudSolrClient.request(CloudSolrClient.java:766)
at app//org.apache.solr.client.solrj.SolrRequest.process(SolrRequest.java:216)
at app//org.apache.solr.client.solrj.SolrRequest.process(SolrRequest.java:231)
at app//org.apache.solr.cloud.api.collections.AbstractInstallShardTest.enableReadOnly(AbstractInstallShardTest.java:339)
at app//org.apache.solr.cloud.api.collections.AbstractInstallShardTest.testParallelInstallToMultiShardCollection(AbstractInstallShardTest.java:198)
at java.base@11.0.16.1/jdk.internal.reflect.NativeMethodAccessorImpl.invoke0(Native Method)
at java.base@11.0.16.1/jdk.internal.reflect.NativeMethodAccessorImpl.invoke(NativeMethodAccessorImpl.java:62)
at java.base@11.0.16.1/jdk.internal.reflect.DelegatingMethodAccessorImpl.invoke(DelegatingMethodAccessorImpl.java:43)
at java.base@11.0.16.1/java.lang.reflect.Method.invoke(Method.java:566)
at app//com.carrotsearch.randomizedtesting.RandomizedRunner.invoke(RandomizedRunner.java:1758)
at app//com.carrotsearch.randomizedtesting.RandomizedRunner$8.evaluate(RandomizedRunner.java:946)
at app//com.carrotsearch.randomizedtesting.RandomizedRunner$9.evaluate(RandomizedRunner.java:982)
at app//com.carrotsearch.randomizedtesting.RandomizedRunner$10.evaluate(RandomizedRunner.java:996)
at app//com.carrotsearch.randomizedtesting.rules.SystemPropertiesRestoreRule$1.evaluate(SystemPropertiesRestoreRule.java:80)
at app//org.junit.rules.RunRules.evaluate(RunRules.java:20)
at app//org.apache.lucene.tests.util.TestRuleSetupTeardownChained$1.evaluate(TestRuleSetupTeardownChained.java:48)
at app//org.apache.lucene.tests.util.AbstractBeforeAfterRule$1.evaluate(AbstractBeforeAfterRule.java:43)
at app//org.apache.lucene.tests.util.TestRuleThreadAndTestName$1.evaluate(TestRuleThreadAndTestName.java:45)
at app//org.apache.lucene.tests.util.TestRuleIgnoreAfterMaxFailures$1.evaluate(TestRuleIgnoreAfterMaxFailures.java:60)
at app//org.apache.lucene.tests.util.TestRuleMarkFailure$1.evaluate(TestRuleMarkFailure.java:44)
at app//org.junit.rules.RunRules.evaluate(RunRules.java:20)
at app//com.carrotsearch.randomizedtesting.rules.StatementAdapter.evaluate(StatementAdapter.java:36)
at app//com.carrotsearch.randomizedtesting.ThreadLeakControl$StatementRunner.run(ThreadLeakControl.java:390)
at app//com.carrotsearch.randomizedtesting.ThreadLeakControl.forkTimeoutingTask(ThreadLeakControl.java:843)
at app//com.carrotsearch.randomizedtesting.ThreadLeakControl$3.evaluate(ThreadLeakControl.java:490)
at app//com.carrotsearch.randomizedtesting.RandomizedRunner.runSingleTest(RandomizedRunner.java:955)
at app//com.carrotsearch.randomizedtesting.RandomizedRunner$5.evaluate(RandomizedRunner.java:840)
at app//com.carrotsearch.randomizedtesting.RandomizedRunner$6.evaluate(RandomizedRunner.java:891)
at app//com.carrotsearch.randomizedtesting.RandomizedRunner$7.evaluate(RandomizedRunner.java:902)
at app//com.carrotsearch.randomizedtesting.rules.StatementAdapter.evaluate(StatementAdapter.java:36)
at app//com.carrotsearch.randomizedtesting.rules.StatementAdapter.evaluate(StatementAdapter.java:36)
at app//org.apache.lucene.tests.util.AbstractBeforeAfterRule$1.evaluate(AbstractBeforeAfterRule.java:43)
at app//com.carrotsearch.randomizedtesting.rules.SystemPropertiesRestoreRule$1.evaluate(SystemPropertiesRestoreRule.java:80)
at app//org.junit.rules.RunRules.evaluate(RunRules.java:20)
at app//org.apache.lucene.tests.util.AbstractBeforeAfterRule$1.evaluate(AbstractBeforeAfterRule.java:43)
at app//com.carrotsearch.randomizedtesting.rules.StatementAdapter.evaluate(StatementAdapter.java:36)
at app//org.apache.lucene.tests.util.TestRuleStoreClassName$1.evaluate(TestRuleStoreClassName.java:38)
at app//com.carrotsearch.randomizedtesting.rules.NoShadowingOrOverridesOnMethodsRule$1.evaluate(NoShadowingOrOverridesOnMethodsRule.java:40)
at app//com.carrotsearch.randomizedtesting.rules.NoShadowingOrOverridesOnMethodsRule$1.evaluate(NoShadowingOrOverridesOnMethodsRule.java:40)
at app//com.carrotsearch.randomizedtesting.rules.StatementAdapter.evaluate(StatementAdapter.java:36)
at app//com.carrotsearch.randomizedtesting.rules.StatementAdapter.evaluate(StatementAdapter.java:36)
at app//org.apache.lucene.tests.util.TestRuleAssertionsRequired$1.evaluate(TestRuleAssertionsRequired.java:53)
at app//org.apache.lucene.tests.util.AbstractBeforeAfterRule$1.evaluate(AbstractBeforeAfterRule.java:43)
at app//org.apache.lucene.tests.util.TestRuleMarkFailure$1.evaluate(TestRuleMarkFailure.java:44)
at app//org.apache.lucene.tests.util.TestRuleIgnoreAfterMaxFailures$1.evaluate(TestRuleIgnoreAfterMaxFailures.java:60)
at app//org.apache.lucene.tests.util.TestRuleIgnoreTestSuites$1.evaluate(TestRuleIgnoreTestSuites.java:47)
at app//org.junit.rules.RunRules.evaluate(RunRules.java:20)
at app//com.carrotsearch.randomizedtesting.rules.StatementAdapter.evaluate(StatementAdapter.java:36)
at app//com.carrotsearch.randomizedtesting.ThreadLeakControl$StatementRunner.run(ThreadLeakControl.java:390)
at app//com.carrotsearch.randomizedtesting.ThreadLeakControl.lambda$forkTimeoutingTask$0(ThreadLeakControl.java:850)
at java.base@11.0.16.1/java.lang.Thread.run(Thread.java:829)
Caused by: java.net.SocketTimeoutException: Read timed out
at java.base/java.net.SocketInputStream.socketRead0(Native Method)
at java.base/java.net.SocketInputStream.socketRead(SocketInputStream.java:115)
at java.base/java.net.SocketInputStream.read(SocketInputStream.java:168)
at java.base/java.net.SocketInputStream.read(SocketInputStream.java:140)
at org.apache.http.impl.io.SessionInputBufferImpl.streamRead(SessionInputBufferImpl.java:137)
at org.apache.http.impl.io.SessionInputBufferImpl.fillBuffer(SessionInputBufferImpl.java:153)
at org.apache.http.impl.io.SessionInputBufferImpl.readLine(SessionInputBufferImpl.java:280)
at org.apache.http.impl.conn.DefaultHttpResponseParser.parseHead(DefaultHttpResponseParser.java:138)
at org.apache.http.impl.conn.DefaultHttpResponseParser.parseHead(DefaultHttpResponseParser.java:56)
at org.apache.http.impl.io.AbstractMessageParser.parse(AbstractMessageParser.java:259)
at org.apache.http.impl.DefaultBHttpClientConnection.receiveResponseHeader(DefaultBHttpClientConnection.java:163)
at org.apache.http.impl.conn.CPoolProxy.receiveResponseHeader(CPoolProxy.java:157)
at org.apache.http.protocol.HttpRequestExecutor.doReceiveResponse(HttpRequestExecutor.java:273)
at org.apache.http.protocol.HttpRequestExecutor.execute(HttpRequestExecutor.java:125)
at org.apache.http.impl.execchain.MainClientExec.execute(MainClientExec.java:272)
at org.apache.http.impl.execchain.ProtocolExec.execute(ProtocolExec.java:186)
at org.apache.http.impl.execchain.RetryExec.execute(RetryExec.java:89)
at org.apache.http.impl.execchain.RedirectExec.execute(RedirectExec.java:110)
at org.apache.http.impl.client.InternalHttpClient.doExecute(InternalHttpClient.java:185)
at org.apache.http.impl.client.CloseableHttpClient.execute(CloseableHttpClient.java:83)
at org.apache.http.impl.client.CloseableHttpClient.execute(CloseableHttpClient.java:56)
at org.apache.solr.client.solrj.impl.HttpSolrClient.executeMethod(HttpSolrClient.java:590)
... 57 more
FAILED: org.apache.solr.cloud.api.collections.LocalFSInstallShardTest.classMethod
Error Message:
java.lang.AssertionError: ObjectTracker found 48 object(s) that were not released!!! [MMapDirectory, MMapDirectory, MMapDirectory, MMapDirectory, MMapDirectory, MMapDirectory, MMapDirectory, MMapDirectory, MMapDirectory, MMapDirectory, MMapDirectory, MMapDirectory, MMapDirectory, MMapDirectory, MMapDirectory, MMapDirectory, MMapDirectory, MMapDirectory, MMapDirectory, MMapDirectory, MMapDirectory, MMapDirectory, MMapDirectory, MMapDirectory, MMapDirectory, MMapDirectory, MMapDirectory, MMapDirectory, MMapDirectory, MMapDirectory, MMapDirectory, MMapDirectory, MMapDirectory, MMapDirectory, MMapDirectory, MMapDirectory, MMapDirectory, MMapDirectory, MMapDirectory, MMapDirectory, MMapDirectory, MMapDirectory, MMapDirectory, MMapDirectory, MMapDirectory, MMapDirectory, MMapDirectory, MMapDirectory]
org.apache.lucene.store.MMapDirectory:org.apache.solr.common.util.ObjectReleaseTracker$ObjectTrackerException: org.apache.lucene.store.MMapDirectory
at org.apache.solr.common.util.ObjectReleaseTracker.track(ObjectReleaseTracker.java:54)
at org.apache.solr.core.CachingDirectoryFactory.get(CachingDirectoryFactory.java:369)
at org.apache.solr.core.SolrCore.initSnapshotMetaDataManager(SolrCore.java:615)
at org.apache.solr.core.SolrCore.<init>(SolrCore.java:1130)
at org.apache.solr.core.SolrCore.<init>(SolrCore.java:1056)
at org.apache.solr.core.CoreContainer.createFromDescriptor(CoreContainer.java:1702)
at org.apache.solr.core.CoreContainer.create(CoreContainer.java:1568)
at org.apache.solr.handler.admin.CoreAdminOperation.lambda$static$0(CoreAdminOperation.java:121)
at org.apache.solr.handler.admin.CoreAdminOperation.execute(CoreAdminOperation.java:427)
at org.apache.solr.handler.admin.CoreAdminHandler$CallInfo.call(CoreAdminHandler.java:374)
at org.apache.solr.handler.admin.CoreAdminHandler.handleRequestBody(CoreAdminHandler.java:231)
at org.apache.solr.handler.RequestHandlerBase.handleRequest(RequestHandlerBase.java:226)
at org.apache.solr.servlet.HttpSolrCall.handleAdmin(HttpSolrCall.java:933)
at org.apache.solr.servlet.HttpSolrCall.handleAdminRequest(HttpSolrCall.java:881)
at org.apache.solr.servlet.HttpSolrCall.call(HttpSolrCall.java:540)
at org.apache.solr.servlet.SolrDispatchFilter.dispatch(SolrDispatchFilter.java:254)
at org.apache.solr.servlet.SolrDispatchFilter.lambda$doFilter$0(SolrDispatchFilter.java:215)
at org.apache.solr.servlet.ServletUtils.traceHttpRequestExecution2(ServletUtils.java:241)
at org.apache.solr.servlet.ServletUtils.rateLimitRequest(ServletUtils.java:211)
at org.apache.solr.servlet.SolrDispatchFilter.doFilter(SolrDispatchFilter.java:209)
at org.apache.solr.servlet.SolrDispatchFilter.doFilter(SolrDispatchFilter.java:192)
at org.eclipse.jetty.servlet.FilterHolder.doFilter(FilterHolder.java:202)
at org.eclipse.jetty.servlet.ServletHandler$Chain.doFilter(ServletHandler.java:1635)
at org.apache.solr.embedded.JettySolrRunner$DebugFilter.doFilter(JettySolrRunner.java:187)
at org.eclipse.jetty.servlet.FilterHolder.doFilter(FilterHolder.java:202)
at org.eclipse.jetty.servlet.ServletHandler$Chain.doFilter(ServletHandler.java:1635)
at org.eclipse.jetty.servlet.ServletHandler.doHandle(ServletHandler.java:527)
at org.eclipse.jetty.server.handler.ScopedHandler.nextHandle(ScopedHandler.java:221)
at org.eclipse.jetty.server.session.SessionHandler.doHandle(SessionHandler.java:1570)
at org.eclipse.jetty.server.handler.ScopedHandler.nextHandle(ScopedHandler.java:221)
at org.eclipse.jetty.server.handler.ContextHandler.doHandle(ContextHandler.java:1384)
at org.eclipse.jetty.server.handler.ScopedHandler.nextScope(ScopedHandler.java:176)
at org.eclipse.jetty.servlet.ServletHandler.doScope(ServletHandler.java:484)
at org.eclipse.jetty.server.session.SessionHandler.doScope(SessionHandler.java:1543)
at org.eclipse.jetty.server.handler.ScopedHandler.nextScope(ScopedHandler.java:174)
at org.eclipse.jetty.server.handler.ContextHandler.doScope(ContextHandler.java:1306)
at org.eclipse.jetty.server.handler.ScopedHandler.handle(ScopedHandler.java:129)
at org.eclipse.jetty.server.handler.HandlerWrapper.handle(HandlerWrapper.java:122)
at org.eclipse.jetty.rewrite.handler.RewriteHandler.handle(RewriteHandler.java:301)
at org.eclipse.jetty.server.handler.HandlerWrapper.handle(HandlerWrapper.java:122)
at org.eclipse.jetty.server.handler.gzip.GzipHandler.handle(GzipHandler.java:790)
at org.eclipse.jetty.server.handler.HandlerWrapper.handle(HandlerWrapper.java:122)
at org.eclipse.jetty.server.Server.handle(Server.java:563)
at org.eclipse.jetty.server.HttpChannel$RequestDispatchable.dispatch(HttpChannel.java:1598)
at org.eclipse.jetty.server.HttpChannel.dispatch(HttpChannel.java:753)
at org.eclipse.jetty.server.HttpChannel.handle(HttpChannel.java:501)
at org.eclipse.jetty.server.HttpChannel.run(HttpChannel.java:461)
at org.eclipse.jetty.util.thread.QueuedThreadPool.runJob(QueuedThreadPool.java:969)
at org.eclipse.jetty.util.thread.QueuedThreadPool$Runner.doRunJob(QueuedThreadPool.java:1194)
at org.eclipse.jetty.util.thread.QueuedThreadPool$Runner.run(QueuedThreadPool.java:1149)
at java.base/java.lang.Thread.run(Thread.java:829)
org.apache.lucene.store.MMapDirectory:org.apache.solr.common.util.ObjectReleaseTracker$ObjectTrackerException: org.apache.lucene.store.MMapDirectory
at org.apache.solr.common.util.ObjectReleaseTracker.track(ObjectReleaseTracker.java:54)
at org.apache.solr.core.CachingDirectoryFactory.get(CachingDirectoryFactory.java:369)
at org.apache.solr.core.SolrCore.initSnapshotMetaDataManager(SolrCore.java:615)
at org.apache.solr.core.SolrCore.<init>(SolrCore.java:1130)
at org.apache.solr.core.SolrCore.<init>(SolrCore.java:1056)
at org.apache.solr.core.CoreContainer.createFromDescriptor(CoreContainer.java:1702)
at org.apache.solr.core.CoreContainer.create(CoreContainer.java:1568)
at org.apache.solr.handler.admin.CoreAdminOperation.lambda$static$0(CoreAdminOperation.java:121)
at org.apache.solr.handler.admin.CoreAdminOperation.execute(CoreAdminOperation.java:427)
at org.apache.solr.handler.admin.CoreAdminHandler$CallInfo.call(CoreAdminHandler.java:374)
at org.apache.solr.handler.admin.CoreAdminHandler.handleRequestBody(CoreAdminHandler.java:231)
at org.apache.solr.handler.RequestHandlerBase.handleRequest(RequestHandlerBase.java:226)
at org.apache.solr.servlet.HttpSolrCall.handleAdmin(HttpSolrCall.java:933)
at org.apache.solr.servlet.HttpSolrCall.handleAdminRequest(HttpSolrCall.java:881)
at org.apache.solr.servlet.HttpSolrCall.call(HttpSolrCall.java:540)
at org.apache.solr.servlet.SolrDispatchFilter.dispatch(SolrDispatchFilter.java:254)
at org.apache.solr.servlet.SolrDispatchFilter.lambda$doFilter$0(SolrDispatchFilter.java:215)
at org.apache.solr.servlet.ServletUtils.traceHttpRequestExecution2(ServletUtils.java:241)
at org.apache.solr.servlet.ServletUtils.rateLimitRequest(ServletUtils.java:211)
at org.apache.solr.servlet.SolrDispatchFilter.doFilter(SolrDispatchFilter.java:209)
at org.apache.solr.servlet.SolrDispatchFilter.doFilter(SolrDispatchFilter.java:192)
at org.eclipse.jetty.servlet.FilterHolder.doFilter(FilterHolder.java:202)
at org.eclipse.jetty.servlet.ServletHandler$Chain.doFilter(ServletHandler.java:1635)
at org.apache.solr.embedded.JettySolrRunner$DebugFilter.doFilter(JettySolrRunner.java:187)
at org.eclipse.jetty.servlet.FilterHolder.doFilter(FilterHolder.java:202)
at org.eclipse.jetty.servlet.ServletHandler$Chain.doFilter(ServletHandler.java:1635)
at org.eclipse.jetty.servlet.ServletHandler.doHandle(ServletHandler.java:527)
at org.eclipse.jetty.server.handler.ScopedHandler.nextHandle(ScopedHandler.java:221)
at org.eclipse.jetty.server.session.SessionHandler.doHandle(SessionHandler.java:1570)
at org.eclipse.jetty.server.handler.ScopedHandler.nextHandle(ScopedHandler.java:221)
at org.eclipse.jetty.server.handler.ContextHandler.doHandle(ContextHandler.java:1384)
at org.eclipse.jetty.server.handler.ScopedHandler.nextScope(ScopedHandler.java:176)
at org.eclipse.jetty.servlet.ServletHandler.doScope(ServletHandler.java:484)
at org.eclipse.jetty.server.session.SessionHandler.doScope(SessionHandler.java:1543)
at org.eclipse.jetty.server.handler.ScopedHandler.nextScope(ScopedHandler.java:174)
at org.eclipse.jetty.server.handler.ContextHandler.doScope(ContextHandler.java:1306)
at org.eclipse.jetty.server.handler.ScopedHandler.handle(ScopedHandler.java:129)
at org.eclipse.jetty.server.handler.HandlerWrapper.handle(HandlerWrapper.java:122)
at org.eclipse.jetty.rewrite.handler.RewriteHandler.handle(RewriteHandler.java:301)
at org.eclipse.jetty.server.handler.HandlerWrapper.handle(HandlerWrapper.java:122)
at org.eclipse.jetty.server.handler.gzip.GzipHandler.handle(GzipHandler.java:790)
at org.eclipse.jetty.server.handler.HandlerWrapper.handle(HandlerWrapper.java:122)
at org.eclipse.jetty.server.Server.handle(Server.java:563)
at org.eclipse.jetty.server.HttpChannel$RequestDispatchable.dispatch(HttpChannel.java:1598)
at org.eclipse.jetty.server.HttpChannel.dispatch(HttpChannel.java:753)
at org.eclipse.jetty.server.HttpChannel.handle(HttpChannel.java:501)
at org.eclipse.jetty.server.HttpChannel.run(HttpChannel.java:461)
at org.eclipse.jetty.util.thread.QueuedThreadPool.runJob(QueuedThreadPool.java:969)
at org.eclipse.jetty.util.thread.QueuedThreadPool$Runner.doRunJob(QueuedThreadPool.java:1194)
at org.eclipse.jetty.util.thread.QueuedThreadPool$Runner.run(QueuedThreadPool.java:1149)
at java.base/java.lang.Thread.run(Thread.java:829)
org.apache.lucene.store.MMapDirectory:org.apache.solr.common.util.ObjectReleaseTracker$ObjectTrackerException: org.apache.lucene.store.MMapDirectory
at org.apache.solr.common.util.ObjectReleaseTracker.track(ObjectReleaseTracker.java:54)
at org.apache.solr.core.CachingDirectoryFactory.get(CachingDirectoryFactory.java:369)
at org.apache.solr.core.SolrCore.initSnapshotMetaDataManager(SolrCore.java:615)
at org.apache.solr.core.SolrCore.<init>(SolrCore.java:1130)
at org.apache.solr.core.SolrCore.<init>(SolrCore.java:1056)
at org.apache.solr.core.CoreContainer.createFromDescriptor(CoreContainer.java:1702)
at org.apache.solr.core.CoreContainer.create(CoreContainer.java:1568)
at org.apache.solr.handler.admin.CoreAdminOperation.lambda$static$0(CoreAdminOperation.java:121)
at org.apache.solr.handler.admin.CoreAdminOperation.execute(CoreAdminOperation.java:427)
at org.apache.solr.handler.admin.CoreAdminHandler$CallInfo.call(CoreAdminHandler.java:374)
at org.apache.solr.handler.admin.CoreAdminHandler.handleRequestBody(CoreAdminHandler.java:231)
at org.apache.solr.handler.RequestHandlerBase.handleRequest(RequestHandlerBase.java:226)
at org.apache.solr.servlet.HttpSolrCall.handleAdmin(HttpSolrCall.java:933)
at org.apache.solr.servlet.HttpSolrCall.handleAdminRequest(HttpSolrCall.java:881)
at org.apache.solr.servlet.HttpSolrCall.call(HttpSolrCall.java:540)
at org.apache.solr.servlet.SolrDispatchFilter.dispatch(SolrDispatchFilter.java:254)
at org.apache.solr.servlet.SolrDispatchFilter.lambda$doFilter$0(SolrDispatchFilter.java:215)
at org.apache.solr.servlet.ServletUtils.traceHttpRequestExecution2(ServletUtils.java:241)
at org.apache.solr.servlet.ServletUtils.rateLimitRequest(ServletUtils.java:211)
at org.apache.solr.servlet.SolrDispatchFilter.doFilter(SolrDispatchFilter.java:209)
at org.apache.solr.servlet.SolrDispatchFilter.doFilter(SolrDispatchFilter.java:192)
at org.eclipse.jetty.servlet.FilterHolder.doFilter(FilterHolder.java:202)
at org.eclipse.jetty.servlet.ServletHandler$Chain.doFilter(ServletHandler.java:1635)
at org.apache.solr.embedded.JettySolrRunner$DebugFilter.doFilter(JettySolrRunner.java:187)
at org.eclipse.jetty.servlet.FilterHolder.doFilter(FilterHolder.java:202)
at org.eclipse.jetty.servlet.ServletHandler$Chain.doFilter(ServletHandler.java:1635)
at org.eclipse.jetty.servlet.ServletHandler.doHandle(ServletHandler.java:527)
at org.eclipse.jetty.server.handler.ScopedHandler.nextHandle(ScopedHandler.java:221)
at org.eclipse.jetty.server.session.SessionHandler.doHandle(SessionHandler.java:1570)
at org.eclipse.jetty.server.handler.ScopedHandler.nextHandle(ScopedHandler.java:221)
at org.eclipse.jetty.server.handler.ContextHandler.doHandle(ContextHandler.java:1384)
at org.eclipse.jetty.server.handler.ScopedHandler.nextScope(ScopedHandler.java:176)
at org.eclipse.jetty.servlet.ServletHandler.doScope(ServletHandler.java:484)
at org.eclipse.jetty.server.session.SessionHandler.doScope(SessionHandler.java:1543)
at org.eclipse.jetty.server.handler.ScopedHandler.nextScope(ScopedHandler.java:174)
at org.eclipse.jetty.server.handler.ContextHandler.doScope(ContextHandler.java:1306)
at org.eclipse.jetty.server.handler.ScopedHandler.handle(ScopedHandler.java:129)
at org.eclipse.jetty.server.handler.HandlerWrapper.handle(HandlerWrapper.java:122)
at org.eclipse.jetty.rewrite.handler.RewriteHandler.handle(RewriteHandler.java:301)
at org.eclipse.jetty.server.handler.HandlerWrapper.handle(HandlerWrapper.java:122)
at org.eclipse.jetty.server.handler.gzip.GzipHandler.handle(GzipHandler.java:790)
at org.eclipse.jetty.server.handler.HandlerWrapper.handle(HandlerWrapper.java:122)
at org.eclipse.jetty.server.Server.handle(Server.java:563)
at org.eclipse.jetty.server.HttpChannel$RequestDispatchable.dispatch(HttpChannel.java:1598)
at org.eclipse.jetty.server.HttpChannel.dispatch(HttpChannel.java:753)
at org.eclipse.jetty.server.HttpChannel.handle(HttpChannel.java:501)
at org.eclipse.jetty.server.HttpChannel.run(HttpChannel.java:461)
at org.eclipse.jetty.util.thread.QueuedThreadPool.runJob(QueuedThreadPool.java:969)
at org.eclipse.jetty.util.thread.QueuedThreadPool$Runner.doRunJob(QueuedThreadPool.java:1194)
at org.eclipse.jetty.util.thread.QueuedThreadPool$Runner.run(QueuedThreadPool.java:1149)
at java.base/java.lang.Thread.run(Thread.java:829)
org.apache.lucene.store.MMapDirectory:org.apache.solr.common.util.ObjectReleaseTracker$ObjectTrackerException: org.apache.lucene.store.MMapDirectory
at org.apache.solr.common.util.ObjectReleaseTracker.track(ObjectReleaseTracker.java:54)
at org.apache.solr.core.CachingDirectoryFactory.get(CachingDirectoryFactory.java:369)
at org.apache.solr.core.SolrCore.initSnapshotMetaDataManager(SolrCore.java:615)
at org.apache.solr.core.SolrCore.<init>(SolrCore.java:1130)
at org.apache.solr.core.SolrCore.<init>(SolrCore.java:1056)
at org.apache.solr.core.CoreContainer.createFromDescriptor(CoreContainer.java:1702)
at org.apache.solr.core.CoreContainer.create(CoreContainer.java:1568)
at org.apache.solr.handler.admin.CoreAdminOperation.lambda$static$0(CoreAdminOperation.java:121)
at org.apache.solr.handler.admin.CoreAdminOperation.execute(CoreAdminOperation.java:427)
at org.apache.solr.handler.admin.CoreAdminHandler$CallInfo.call(CoreAdminHandler.java:374)
at org.apache.solr.handler.admin.CoreAdminHandler.handleRequestBody(CoreAdminHandler.java:231)
at org.apache.solr.handler.RequestHandlerBase.handleRequest(RequestHandlerBase.java:226)
at org.apache.solr.servlet.HttpSolrCall.handleAdmin(HttpSolrCall.java:933)
at org.apache.solr.servlet.HttpSolrCall.handleAdminRequest(HttpSolrCall.java:881)
at org.apache.solr.servlet.HttpSolrCall.call(HttpSolrCall.java:540)
at org.apache.solr.servlet.SolrDispatchFilter.dispatch(SolrDispatchFilter.java:254)
at org.apache.solr.servlet.SolrDispatchFilter.lambda$doFilter$0(SolrDispatchFilter.java:215)
at org.apache.solr.servlet.ServletUtils.traceHttpRequestExecution2(ServletUtils.java:241)
at org.apache.solr.servlet.ServletUtils.rateLimitRequest(ServletUtils.java:211)
at org.apache.solr.servlet.SolrDispatchFilter.doFilter(SolrDispatchFilter.java:209)
at org.apache.solr.servlet.SolrDispatchFilter.doFilter(SolrDispatchFilter.java:192)
at org.eclipse.jetty.servlet.FilterHolder.doFilter(FilterHolder.java:202)
at org.eclipse.jetty.servlet.ServletHandler$Chain.doFilter(ServletHandler.java:1635)
at org.apache.solr.embedded.JettySolrRunner$DebugFilter.doFilter(JettySolrRunner.java:187)
at org.eclipse.jetty.servlet.FilterHolder.doFilter(FilterHolder.java:202)
at org.eclipse.jetty.servlet.ServletHandler$Chain.doFilter(ServletHandler.java:1635)
at org.eclipse.jetty.servlet.ServletHandler.doHandle(ServletHandler.java:527)
at org.eclipse.jetty.server.handler.ScopedHandler.nextHandle(ScopedHandler.java:221)
at org.eclipse.jetty.server.session.SessionHandler.doHandle(SessionHandler.java:1570)
at org.eclipse.jetty.server.handler.ScopedHandler.nextHandle(ScopedHandler.java:221)
at org.eclipse.jetty.server.handler.ContextHandler.doHandle(ContextHandler.java:1384)
at org.eclipse.jetty.server.handler.ScopedHandler.nextScope(ScopedHandler.java:176)
at org.eclipse.jetty.servlet.ServletHandler.doScope(ServletHandler.java:484)
at org.eclipse.jetty.server.session.SessionHandler.doScope(SessionHandler.java:1543)
at org.eclipse.jetty.server.handler.ScopedHandler.nextScope(ScopedHandler.java:174)
at org.eclipse.jetty.server.handler.ContextHandler.doScope(ContextHandler.java:1306)
at org.eclipse.jetty.server.handler.ScopedHandler.handle(ScopedHandler.java:129)
at org.eclipse.jetty.server.handler.HandlerWrapper.handle(HandlerWrapper.java:122)
at org.eclipse.jetty.rewrite.handler.RewriteHandler.handle(RewriteHandler.java:301)
at org.eclipse.jetty.server.handler.HandlerWrapper.handle(HandlerWrapper.java:122)
at org.eclipse.jetty.server.handler.gzip.GzipHandler.handle(GzipHandler.java:790)
at org.eclipse.jetty.server.handler.HandlerWrapper.handle(HandlerWrapper.java:122)
at org.eclipse.jetty.server.Server.handle(Server.java:563)
at org.eclipse.jetty.server.HttpChannel$RequestDispatchable.dispatch(HttpChannel.java:1598)
at org.eclipse.jetty.server.HttpChannel.dispatch(HttpChannel.java:753)
at org.eclipse.jetty.server.HttpChannel.handle(HttpChannel.java:501)
at org.eclipse.jetty.server.HttpChannel.run(HttpChannel.java:461)
at org.eclipse.jetty.util.thread.QueuedThreadPool.runJob(QueuedThreadPool.java:969)
at org.eclipse.jetty.util.thread.QueuedThreadPool$Runner.doRunJob(QueuedThreadPool.java:1194)
at org.eclipse.jetty.util.thread.QueuedThreadPool$Runner.run(QueuedThreadPool.java:1149)
at java.base/java.lang.Thread.run(Thread.java:829)
org.apache.lucene.store.MMapDirectory:org.apache.solr.common.util.ObjectReleaseTracker$ObjectTrackerException: org.apache.lucene.store.MMapDirectory
at org.apache.solr.common.util.ObjectReleaseTracker.track(ObjectReleaseTracker.java:54)
at org.apache.solr.core.CachingDirectoryFactory.get(CachingDirectoryFactory.java:369)
at org.apache.solr.core.SolrCore.getNewIndexDir(SolrCore.java:420)
at org.apache.solr.core.SolrCore.initIndex(SolrCore.java:865)
at org.apache.solr.core.SolrCore.<init>(SolrCore.java:1134)
at org.apache.solr.core.SolrCore.<init>(SolrCore.java:1056)
at org.apache.solr.core.CoreContainer.createFromDescriptor(CoreContainer.java:1702)
at org.apache.solr.core.CoreContainer.create(CoreContainer.java:1568)
at org.apache.solr.handler.admin.CoreAdminOperation.lambda$static$0(CoreAdminOperation.java:121)
at org.apache.solr.handler.admin.CoreAdminOperation.execute(CoreAdminOperation.java:427)
at org.apache.solr.handler.admin.CoreAdminHandler$CallInfo.call(CoreAdminHandler.java:374)
at org.apache.solr.handler.admin.CoreAdminHandler.handleRequestBody(CoreAdminHandler.java:231)
at org.apache.solr.handler.RequestHandlerBase.handleRequest(RequestHandlerBase.java:226)
at org.apache.solr.servlet.HttpSolrCall.handleAdmin(HttpSolrCall.java:933)
at org.apache.solr.servlet.HttpSolrCall.handleAdminRequest(HttpSolrCall.java:881)
at org.apache.solr.servlet.HttpSolrCall.call(HttpSolrCall.java:540)
at org.apache.solr.servlet.SolrDispatchFilter.dispatch(SolrDispatchFilter.java:254)
at org.apache.solr.servlet.SolrDispatchFilter.lambda$doFilter$0(SolrDispatchFilter.java:215)
at org.apache.solr.servlet.ServletUtils.traceHttpRequestExecution2(ServletUtils.java:241)
at org.apache.solr.servlet.ServletUtils.rateLimitRequest(ServletUtils.java:211)
at org.apache.solr.servlet.SolrDispatchFilter.doFilter(SolrDispatchFilter.java:209)
at org.apache.solr.servlet.SolrDispatchFilter.doFilter(SolrDispatchFilter.java:192)
at org.eclipse.jetty.servlet.FilterHolder.doFilter(FilterHolder.java:202)
at org.eclipse.jetty.servlet.ServletHandler$Chain.doFilter(ServletHandler.java:1635)
at org.apache.solr.embedded.JettySolrRunner$DebugFilter.doFilter(JettySolrRunner.java:187)
at org.eclipse.jetty.servlet.FilterHolder.doFilter(FilterHolder.java:202)
at org.eclipse.jetty.servlet.ServletHandler$Chain.doFilter(ServletHandler.java:1635)
at org.eclipse.jetty.servlet.ServletHandler.doHandle(ServletHandler.java:527)
at org.eclipse.jetty.server.handler.ScopedHandler.nextHandle(ScopedHandler.java:221)
at org.eclipse.jetty.server.session.SessionHandler.doHandle(SessionHandler.java:1570)
at org.eclipse.jetty.server.handler.ScopedHandler.nextHandle(ScopedHandler.java:221)
at org.eclipse.jetty.server.handler.ContextHandler.doHandle(ContextHandler.java:1384)
at org.eclipse.jetty.server.handler.ScopedHandler.nextScope(ScopedHandler.java:176)
at org.eclipse.jetty.servlet.ServletHandler.doScope(ServletHandler.java:484)
at org.eclipse.jetty.server.session.SessionHandler.doScope(SessionHandler.java:1543)
at org.eclipse.jetty.server.handler.ScopedHandler.nextScope(ScopedHandler.java:174)
at org.eclipse.jetty.server.handler.ContextHandler.doScope(ContextHandler.java:1306)
at org.eclipse.jetty.server.handler.ScopedHandler.handle(ScopedHandler.java:129)
at org.eclipse.jetty.server.handler.HandlerWrapper.handle(HandlerWrapper.java:122)
at org.eclipse.jetty.rewrite.handler.RewriteHandler.handle(RewriteHandler.java:301)
at org.eclipse.jetty.server.handler.HandlerWrapper.handle(HandlerWrapper.java:122)
at org.eclipse.jetty.server.handler.gzip.GzipHandler.handle(GzipHandler.java:790)
at org.eclipse.jetty.server.handler.HandlerWrapper.handle(HandlerWrapper.java:122)
at org.eclipse.jetty.server.Server.handle(Server.java:563)
at org.eclipse.jetty.server.HttpChannel$RequestDispatchable.dispatch(HttpChannel.java:1598)
at org.eclipse.jetty.server.HttpChannel.dispatch(HttpChannel.java:753)
at org.eclipse.jetty.server.HttpChannel.handle(HttpChannel.java:501)
at org.eclipse.jetty.server.HttpChannel.run(HttpChannel.java:461)
at org.eclipse.jetty.util.thread.QueuedThreadPool.runJob(QueuedThreadPool.java:969)
at org.eclipse.jetty.util.thread.QueuedThreadPool$Runner.doRunJob(QueuedThreadPool.java:1194)
at org.eclipse.jetty.util.thread.QueuedThreadPool$Runner.run(QueuedThreadPool.java:1149)
at java.base/java.lang.Thread.run(Thread.java:829)
org.apache.lucene.store.MMapDirectory:org.apache.solr.common.util.ObjectReleaseTracker$ObjectTrackerException: org.apache.lucene.store.MMapDirectory
at org.apache.solr.common.util.ObjectReleaseTracker.track(ObjectReleaseTracker.java:54)
at org.apache.solr.core.CachingDirectoryFactory.get(CachingDirectoryFactory.java:369)
at org.apache.solr.core.SolrCore.getNewIndexDir(SolrCore.java:420)
at org.apache.solr.core.SolrCore.initIndex(SolrCore.java:865)
at org.apache.solr.core.SolrCore.<init>(SolrCore.java:1134)
at org.apache.solr.core.SolrCore.<init>(SolrCore.java:1056)
at org.apache.solr.core.CoreContainer.createFromDescriptor(CoreContainer.java:1702)
at org.apache.solr.core.CoreContainer.create(CoreContainer.java:1568)
at org.apache.solr.handler.admin.CoreAdminOperation.lambda$static$0(CoreAdminOperation.java:121)
at org.apache.solr.handler.admin.CoreAdminOperation.execute(CoreAdminOperation.java:427)
at org.apache.solr.handler.admin.CoreAdminHandler$CallInfo.call(CoreAdminHandler.java:374)
at org.apache.solr.handler.admin.CoreAdminHandler.handleRequestBody(CoreAdminHandler.java:231)
at org.apache.solr.handler.RequestHandlerBase.handleRequest(RequestHandlerBase.java:226)
at org.apache.solr.servlet.HttpSolrCall.handleAdmin(HttpSolrCall.java:933)
at org.apache.solr.servlet.HttpSolrCall.handleAdminRequest(HttpSolrCall.java:881)
at org.apache.solr.servlet.HttpSolrCall.call(HttpSolrCall.java:540)
at org.apache.solr.servlet.SolrDispatchFilter.dispatch(SolrDispatchFilter.java:254)
at org.apache.solr.servlet.SolrDispatchFilter.lambda$doFilter$0(SolrDispatchFilter.java:215)
at org.apache.solr.servlet.ServletUtils.traceHttpRequestExecution2(ServletUtils.java:241)
at org.apache.solr.servlet.ServletUtils.rateLimitRequest(ServletUtils.java:211)
at org.apache.solr.servlet.SolrDispatchFilter.doFilter(SolrDispatchFilter.java:209)
at org.apache.solr.servlet.SolrDispatchFilter.doFilter(SolrDispatchFilter.java:192)
at org.eclipse.jetty.servlet.FilterHolder.doFilter(FilterHolder.java:202)
at org.eclipse.jetty.servlet.ServletHandler$Chain.doFilter(ServletHandler.java:1635)
at org.apache.solr.embedded.JettySolrRunner$DebugFilter.doFilter(JettySolrRunner.java:187)
at org.eclipse.jetty.servlet.FilterHolder.doFilter(FilterHolder.java:202)
at org.eclipse.jetty.servlet.ServletHandler$Chain.doFilter(ServletHandler.java:1635)
at org.eclipse.jetty.servlet.ServletHandler.doHandle(ServletHandler.java:527)
at org.eclipse.jetty.server.handler.ScopedHandler.nextHandle(ScopedHandler.java:221)
at org.eclipse.jetty.server.session.SessionHandler.doHandle(SessionHandler.java:1570)
at org.eclipse.jetty.server.handler.ScopedHandler.nextHandle(ScopedHandler.java:221)
at org.eclipse.jetty.server.handler.ContextHandler.doHandle(ContextHandler.java:1384)
at org.eclipse.jetty.server.handler.ScopedHandler.nextScope(ScopedHandler.java:176)
at org.eclipse.jetty.servlet.ServletHandler.doScope(ServletHandler.java:484)
at org.eclipse.jetty.server.session.SessionHandler.doScope(SessionHandler.java:1543)
at org.eclipse.jetty.server.handler.ScopedHandler.nextScope(ScopedHandler.java:174)
at org.eclipse.jetty.server.handler.ContextHandler.doScope(ContextHandler.java:1306)
at org.eclipse.jetty.server.handler.ScopedHandler.handle(ScopedHandler.java:129)
at org.eclipse.jetty.server.handler.HandlerWrapper.handle(HandlerWrapper.java:122)
at org.eclipse.jetty.rewrite.handler.RewriteHandler.handle(RewriteHandler.java:301)
at org.eclipse.jetty.server.handler.HandlerWrapper.handle(HandlerWrapper.java:122)
at org.eclipse.jetty.server.handler.gzip.GzipHandler.handle(GzipHandler.java:790)
at org.eclipse.jetty.server.handler.HandlerWrapper.handle(HandlerWrapper.java:122)
at org.eclipse.jetty.server.Server.handle(Server.java:563)
at org.eclipse.jetty.server.HttpChannel$RequestDispatchable.dispatch(HttpChannel.java:1598)
at org.eclipse.jetty.server.HttpChannel.dispatch(HttpChannel.java:753)
at org.eclipse.jetty.server.HttpChannel.handle(HttpChannel.java:501)
at org.eclipse.jetty.server.HttpChannel.run(HttpChannel.java:461)
at org.eclipse.jetty.util.thread.QueuedThreadPool.runJob(QueuedThreadPool.java:969)
at org.eclipse.jetty.util.thread.QueuedThreadPool$Runner.doRunJob(QueuedThreadPool.java:1194)
at org.eclipse.jetty.util.thread.QueuedThreadPool$Runner.run(QueuedThreadPool.java:1149)
at java.base/java.lang.Thread.run(Thread.java:829)
org.apache.lucene.store.MMapDirectory:org.apache.solr.common.util.ObjectReleaseTracker$ObjectTrackerException: org.apache.lucene.store.MMapDirectory
at org.apache.solr.common.util.ObjectReleaseTracker.track(ObjectReleaseTracker.java:54)
at org.apache.solr.core.CachingDirectoryFactory.get(CachingDirectoryFactory.java:369)
at org.apache.solr.update.SolrIndexWriter.create(SolrIndexWriter.java:108)
at org.apache.solr.core.SolrCore.initIndex(SolrCore.java:904)
at org.apache.solr.core.SolrCore.<init>(SolrCore.java:1134)
at org.apache.solr.core.SolrCore.<init>(SolrCore.java:1056)
at org.apache.solr.core.CoreContainer.createFromDescriptor(CoreContainer.java:1702)
at org.apache.solr.core.CoreContainer.create(CoreContainer.java:1568)
at org.apache.solr.handler.admin.CoreAdminOperation.lambda$static$0(CoreAdminOperation.java:121)
at org.apache.solr.handler.admin.CoreAdminOperation.execute(CoreAdminOperation.java:427)
at org.apache.solr.handler.admin.CoreAdminHandler$CallInfo.call(CoreAdminHandler.java:374)
at org.apache.solr.handler.admin.CoreAdminHandler.handleRequestBody(CoreAdminHandler.java:231)
at org.apache.solr.handler.RequestHandlerBase.handleRequest(RequestHandlerBase.java:226)
at org.apache.solr.servlet.HttpSolrCall.handleAdmin(HttpSolrCall.java:933)
at org.apache.solr.servlet.HttpSolrCall.handleAdminRequest(HttpSolrCall.java:881)
at org.apache.solr.servlet.HttpSolrCall.call(HttpSolrCall.java:540)
at org.apache.solr.servlet.SolrDispatchFilter.dispatch(SolrDispatchFilter.java:254)
at org.apache.solr.servlet.SolrDispatchFilter.lambda$doFilter$0(SolrDispatchFilter.java:215)
at org.apache.solr.servlet.ServletUtils.traceHttpRequestExecution2(ServletUtils.java:241)
at org.apache.solr.servlet.ServletUtils.rateLimitRequest(ServletUtils.java:211)
at org.apache.solr.servlet.SolrDispatchFilter.doFilter(SolrDispatchFilter.java:209)
at org.apache.solr.servlet.SolrDispatchFilter.doFilter(SolrDispatchFilter.java:192)
at org.eclipse.jetty.servlet.FilterHolder.doFilter(FilterHolder.java:202)
at org.eclipse.jetty.servlet.ServletHandler$Chain.doFilter(ServletHandler.java:1635)
at org.apache.solr.embedded.JettySolrRunner$DebugFilter.doFilter(JettySolrRunner.java:187)
at org.eclipse.jetty.servlet.FilterHolder.doFilter(FilterHolder.java:202)
at org.eclipse.jetty.servlet.ServletHandler$Chain.doFilter(ServletHandler.java:1635)
at org.eclipse.jetty.servlet.ServletHandler.doHandle(ServletHandler.java:527)
at org.eclipse.jetty.server.handler.ScopedHandler.nextHandle(ScopedHandler.java:221)
at org.eclipse.jetty.server.session.SessionHandler.doHandle(SessionHandler.java:1570)
at org.eclipse.jetty.server.handler.ScopedHandler.nextHandle(ScopedHandler.java:221)
at org.eclipse.jetty.server.handler.ContextHandler.doHandle(ContextHandler.java:1384)
at org.eclipse.jetty.server.handler.ScopedHandler.nextScope(ScopedHandler.java:176)
at org.eclipse.jetty.servlet.ServletHandler.doScope(ServletHandler.java:484)
at org.eclipse.jetty.server.session.SessionHandler.doScope(SessionHandler.java:1543)
at org.eclipse.jetty.server.handler.ScopedHandler.nextScope(ScopedHandler.java:174)
at org.eclipse.jetty.server.handler.ContextHandler.doScope(ContextHandler.java:1306)
at org.eclipse.jetty.server.handler.ScopedHandler.handle(ScopedHandler.java:129)
at org.eclipse.jetty.server.handler.HandlerWrapper.handle(HandlerWrapper.java:122)
at org.eclipse.jetty.rewrite.handler.RewriteHandler.handle(RewriteHandler.java:301)
at org.eclipse.jetty.server.handler.HandlerWrapper.handle(HandlerWrapper.java:122)
at org.eclipse.jetty.server.handler.gzip.GzipHandler.handle(GzipHandler.java:790)
at org.eclipse.jetty.server.handler.HandlerWrapper.handle(HandlerWrapper.java:122)
at org.eclipse.jetty.server.Server.handle(Server.java:563)
at org.eclipse.jetty.server.HttpChannel$RequestDispatchable.dispatch(HttpChannel.java:1598)
at org.eclipse.jetty.server.HttpChannel.dispatch(HttpChannel.java:753)
at org.eclipse.jetty.server.HttpChannel.handle(HttpChannel.java:501)
at org.eclipse.jetty.server.HttpChannel.run(HttpChannel.java:461)
at org.eclipse.jetty.util.thread.QueuedThreadPool.runJob(QueuedThreadPool.java:969)
at org.eclipse.jetty.util.thread.QueuedThreadPool$Runner.doRunJob(QueuedThreadPool.java:1194)
at org.eclipse.jetty.util.thread.QueuedThreadPool$Runner.run(QueuedThreadPool.java:1149)
at java.base/java.lang.Thread.run(Thread.java:829)
org.apache.lucene.store.MMapDirectory:org.apache.solr.common.util.ObjectReleaseTracker$ObjectTrackerException: org.apache.lucene.store.MMapDirectory
at org.apache.solr.common.util.ObjectReleaseTracker.track(ObjectReleaseTracker.java:54)
at org.apache.solr.core.CachingDirectoryFactory.get(CachingDirectoryFactory.java:369)
at org.apache.solr.core.SolrCore.getNewIndexDir(SolrCore.java:420)
at org.apache.solr.core.SolrCore.initIndex(SolrCore.java:865)
at org.apache.solr.core.SolrCore.<init>(SolrCore.java:1134)
at org.apache.solr.core.SolrCore.<init>(SolrCore.java:1056)
at org.apache.solr.core.CoreContainer.createFromDescriptor(CoreContainer.java:1702)
at org.apache.solr.core.CoreContainer.create(CoreContainer.java:1568)
at org.apache.solr.handler.admin.CoreAdminOperation.lambda$static$0(CoreAdminOperation.java:121)
at org.apache.solr.handler.admin.CoreAdminOperation.execute(CoreAdminOperation.java:427)
at org.apache.solr.handler.admin.CoreAdminHandler$CallInfo.call(CoreAdminHandler.java:374)
at org.apache.solr.handler.admin.CoreAdminHandler.handleRequestBody(CoreAdminHandler.java:231)
at org.apache.solr.handler.RequestHandlerBase.handleRequest(RequestHandlerBase.java:226)
at org.apache.solr.servlet.HttpSolrCall.handleAdmin(HttpSolrCall.java:933)
at org.apache.solr.servlet.HttpSolrCall.handleAdminRequest(HttpSolrCall.java:881)
at org.apache.solr.servlet.HttpSolrCall.call(HttpSolrCall.java:540)
at org.apache.solr.servlet.SolrDispatchFilter.dispatch(SolrDispatchFilter.java:254)
at org.apache.solr.servlet.SolrDispatchFilter.lambda$doFilter$0(SolrDispatchFilter.java:215)
at org.apache.solr.servlet.ServletUtils.traceHttpRequestExecution2(ServletUtils.java:241)
at org.apache.solr.servlet.ServletUtils.rateLimitRequest(ServletUtils.java:211)
at org.apache.solr.servlet.SolrDispatchFilter.doFilter(SolrDispatchFilter.java:209)
at org.apache.solr.servlet.SolrDispatchFilter.doFilter(SolrDispatchFilter.java:192)
at org.eclipse.jetty.servlet.FilterHolder.doFilter(FilterHolder.java:202)
at org.eclipse.jetty.servlet.ServletHandler$Chain.doFilter(ServletHandler.java:1635)
at org.apache.solr.embedded.JettySolrRunner$DebugFilter.doFilter(JettySolrRunner.java:187)
at org.eclipse.jetty.servlet.FilterHolder.doFilter(FilterHolder.java:202)
at org.eclipse.jetty.servlet.ServletHandler$Chain.doFilter(ServletHandler.java:1635)
at org.eclipse.jetty.servlet.ServletHandler.doHandle(ServletHandler.java:527)
at org.eclipse.jetty.server.handler.ScopedHandler.nextHandle(ScopedHandler.java:221)
at org.eclipse.jetty.server.session.SessionHandler.doHandle(SessionHandler.java:1570)
at org.eclipse.jetty.server.handler.ScopedHandler.nextHandle(ScopedHandler.java:221)
at org.eclipse.jetty.server.handler.ContextHandler.doHandle(ContextHandler.java:1384)
at org.eclipse.jetty.server.handler.ScopedHandler.nextScope(ScopedHandler.java:176)
at org.eclipse.jetty.servlet.ServletHandler.doScope(ServletHandler.java:484)
at org.eclipse.jetty.server.session.SessionHandler.doScope(SessionHandler.java:1543)
at org.eclipse.jetty.server.handler.ScopedHandler.nextScope(ScopedHandler.java:174)
at org.eclipse.jetty.server.handler.ContextHandler.doScope(ContextHandler.java:1306)
at org.eclipse.jetty.server.handler.ScopedHandler.handle(ScopedHandler.java:129)
at org.eclipse.jetty.server.handler.HandlerWrapper.handle(HandlerWrapper.java:122)
at org.eclipse.jetty.rewrite.handler.RewriteHandler.handle(RewriteHandler.java:301)
at org.eclipse.jetty.server.handler.HandlerWrapper.handle(HandlerWrapper.java:122)
at org.eclipse.jetty.server.handler.gzip.GzipHandler.handle(GzipHandler.java:790)
at org.eclipse.jetty.server.handler.HandlerWrapper.handle(HandlerWrapper.java:122)
at org.eclipse.jetty.server.Server.handle(Server.java:563)
at org.eclipse.jetty.server.HttpChannel$RequestDispatchable.dispatch(HttpChannel.java:1598)
at org.eclipse.jetty.server.HttpChannel.dispatch(HttpChannel.java:753)
at org.eclipse.jetty.server.HttpChannel.handle(HttpChannel.java:501)
at org.eclipse.jetty.server.HttpChannel.run(HttpChannel.java:461)
at org.eclipse.jetty.util.thread.QueuedThreadPool.runJob(QueuedThreadPool.java:969)
at org.eclipse.jetty.util.thread.QueuedThreadPool$Runner.doRunJob(QueuedThreadPool.java:1194)
at org.eclipse.jetty.util.thread.QueuedThreadPool$Runner.run(QueuedThreadPool.java:1149)
at java.base/java.lang.Thread.run(Thread.java:829)
org.apache.lucene.store.MMapDirectory:org.apache.solr.common.util.ObjectReleaseTracker$ObjectTrackerException: org.apache.lucene.store.MMapDirectory
at org.apache.solr.common.util.ObjectReleaseTracker.track(ObjectReleaseTracker.java:54)
at org.apache.solr.core.CachingDirectoryFactory.get(CachingDirectoryFactory.java:369)
at org.apache.solr.core.SolrCore.initSnapshotMetaDataManager(SolrCore.java:615)
at org.apache.solr.core.SolrCore.<init>(SolrCore.java:1130)
at org.apache.solr.core.SolrCore.<init>(SolrCore.java:1056)
at org.apache.solr.core.CoreContainer.createFromDescriptor(CoreContainer.java:1702)
at org.apache.solr.core.CoreContainer.create(CoreContainer.java:1568)
at org.apache.solr.handler.admin.CoreAdminOperation.lambda$static$0(CoreAdminOperation.java:121)
at org.apache.solr.handler.admin.CoreAdminOperation.execute(CoreAdminOperation.java:427)
at org.apache.solr.handler.admin.CoreAdminHandler$CallInfo.call(CoreAdminHandler.java:374)
at org.apache.solr.handler.admin.CoreAdminHandler.handleRequestBody(CoreAdminHandler.java:231)
at org.apache.solr.handler.RequestHandlerBase.handleRequest(RequestHandlerBase.java:226)
at org.apache.solr.servlet.HttpSolrCall.handleAdmin(HttpSolrCall.java:933)
at org.apache.solr.servlet.HttpSolrCall.handleAdminRequest(HttpSolrCall.java:881)
at org.apache.solr.servlet.HttpSolrCall.call(HttpSolrCall.java:540)
at org.apache.solr.servlet.SolrDispatchFilter.dispatch(SolrDispatchFilter.java:254)
at org.apache.solr.servlet.SolrDispatchFilter.lambda$doFilter$0(SolrDispatchFilter.java:215)
at org.apache.solr.servlet.ServletUtils.traceHttpRequestExecution2(ServletUtils.java:241)
at org.apache.solr.servlet.ServletUtils.rateLimitRequest(ServletUtils.java:211)
at org.apache.solr.servlet.SolrDispatchFilter.doFilter(SolrDispatchFilter.java:209)
at org.apache.solr.servlet.SolrDispatchFilter.doFilter(SolrDispatchFilter.java:192)
at org.eclipse.jetty.servlet.FilterHolder.doFilter(FilterHolder.java:202)
at org.eclipse.jetty.servlet.ServletHandler$Chain.doFilter(ServletHandler.java:1635)
at org.apache.solr.embedded.JettySolrRunner$DebugFilter.doFilter(JettySolrRunner.java:187)
at org.eclipse.jetty.servlet.FilterHolder.doFilter(FilterHolder.java:202)
at org.eclipse.jetty.servlet.ServletHandler$Chain.doFilter(ServletHandler.java:1635)
at org.eclipse.jetty.servlet.ServletHandler.doHandle(ServletHandler.java:527)
at org.eclipse.jetty.server.handler.ScopedHandler.nextHandle(ScopedHandler.java:221)
at org.eclipse.jetty.server.session.SessionHandler.doHandle(SessionHandler.java:1570)
at org.eclipse.jetty.server.handler.ScopedHandler.nextHandle(ScopedHandler.java:221)
at org.eclipse.jetty.server.handler.ContextHandler.doHandle(ContextHandler.java:1384)
at org.eclipse.jetty.server.handler.ScopedHandler.nextScope(ScopedHandler.java:176)
at org.eclipse.jetty.servlet.ServletHandler.doScope(ServletHandler.java:484)
at org.eclipse.jetty.server.session.SessionHandler.doScope(SessionHandler.java:1543)
at org.eclipse.jetty.server.handler.ScopedHandler.nextScope(ScopedHandler.java:174)
at org.eclipse.jetty.server.handler.ContextHandler.doScope(ContextHandler.java:1306)
at org.eclipse.jetty.server.handler.ScopedHandler.handle(ScopedHandler.java:129)
at org.eclipse.jetty.server.handler.HandlerWrapper.handle(HandlerWrapper.java:122)
at org.eclipse.jetty.rewrite.handler.RewriteHandler.handle(RewriteHandler.java:301)
at org.eclipse.jetty.server.handler.HandlerWrapper.handle(HandlerWrapper.java:122)
at org.eclipse.jetty.server.handler.gzip.GzipHandler.handle(GzipHandler.java:790)
at org.eclipse.jetty.server.handler.HandlerWrapper.handle(HandlerWrapper.java:122)
at org.eclipse.jetty.server.Server.handle(Server.java:563)
at org.eclipse.jetty.server.HttpChannel$RequestDispatchable.dispatch(HttpChannel.java:1598)
at org.eclipse.jetty.server.HttpChannel.dispatch(HttpChannel.java:753)
at org.eclipse.jetty.server.HttpChannel.handle(HttpChannel.java:501)
at org.eclipse.jetty.server.HttpChannel.run(HttpChannel.java:461)
at org.eclipse.jetty.util.thread.QueuedThreadPool.runJob(QueuedThreadPool.java:969)
at org.eclipse.jetty.util.thread.QueuedThreadPool$Runner.doRunJob(QueuedThreadPool.java:1194)
at org.eclipse.jetty.util.thread.QueuedThreadPool$Runner.run(QueuedThreadPool.java:1149)
at java.base/java.lang.Thread.run(Thread.java:829)
org.apache.lucene.store.MMapDirectory:org.apache.solr.common.util.ObjectReleaseTracker$ObjectTrackerException: org.apache.lucene.store.MMapDirectory
at org.apache.solr.common.util.ObjectReleaseTracker.track(ObjectReleaseTracker.java:54)
at org.apache.solr.core.CachingDirectoryFactory.get(CachingDirectoryFactory.java:369)
at org.apache.solr.core.SolrCore.initSnapshotMetaDataManager(SolrCore.java:615)
at org.apache.solr.core.SolrCore.<init>(SolrCore.java:1130)
at org.apache.solr.core.SolrCore.<init>(SolrCore.java:1056)
at org.apache.solr.core.CoreContainer.createFromDescriptor(CoreContainer.java:1702)
at org.apache.solr.core.CoreContainer.create(CoreContainer.java:1568)
at org.apache.solr.handler.admin.CoreAdminOperation.lambda$static$0(CoreAdminOperation.java:121)
at org.apache.solr.handler.admin.CoreAdminOperation.execute(CoreAdminOperation.java:427)
at org.apache.solr.handler.admin.CoreAdminHandler$CallInfo.call(CoreAdminHandler.java:374)
at org.apache.solr.handler.admin.CoreAdminHandler.handleRequestBody(CoreAdminHandler.java:231)
at org.apache.solr.handler.RequestHandlerBase.handleRequest(RequestHandlerBase.java:226)
at org.apache.solr.servlet.HttpSolrCall.handleAdmin(HttpSolrCall.java:933)
at org.apache.solr.servlet.HttpSolrCall.handleAdminRequest(HttpSolrCall.java:881)
at org.apache.solr.servlet.HttpSolrCall.call(HttpSolrCall.java:540)
at org.apache.solr.servlet.SolrDispatchFilter.dispatch(SolrDispatchFilter.java:254)
at org.apache.solr.servlet.SolrDispatchFilter.lambda$doFilter$0(SolrDispatchFilter.java:215)
at org.apache.solr.servlet.ServletUtils.traceHttpRequestExecution2(ServletUtils.java:241)
at org.apache.solr.servlet.ServletUtils.rateLimitRequest(ServletUtils.java:211)
at org.apache.solr.servlet.SolrDispatchFilter.doFilter(SolrDispatchFilter.java:209)
at org.apache.solr.servlet.SolrDispatchFilter.doFilter(SolrDispatchFilter.java:192)
at org.eclipse.jetty.servlet.FilterHolder.doFilter(FilterHolder.java:202)
at org.eclipse.jetty.servlet.ServletHandler$Chain.doFilter(ServletHandler.java:1635)
at org.apache.solr.embedded.JettySolrRunner$DebugFilter.doFilter(JettySolrRunner.java:187)
at org.eclipse.jetty.servlet.FilterHolder.doFilter(FilterHolder.java:202)
at org.eclipse.jetty.servlet.ServletHandler$Chain.doFilter(ServletHandler.java:1635)
at org.eclipse.jetty.servlet.ServletHandler.doHandle(ServletHandler.java:527)
at org.eclipse.jetty.server.handler.ScopedHandler.nextHandle(ScopedHandler.java:221)
at org.eclipse.jetty.server.session.SessionHandler.doHandle(SessionHandler.java:1570)
at org.eclipse.jetty.server.handler.ScopedHandler.nextHandle(ScopedHandler.java:221)
at org.eclipse.jetty.server.handler.ContextHandler.doHandle(ContextHandler.java:1384)
at org.eclipse.jetty.server.handler.ScopedHandler.nextScope(ScopedHandler.java:176)
at org.eclipse.jetty.servlet.ServletHandler.doScope(ServletHandler.java:484)
at org.eclipse.jetty.server.session.SessionHandler.doScope(SessionHandler.java:1543)
at org.eclipse.jetty.server.handler.ScopedHandler.nextScope(ScopedHandler.java:174)
at org.eclipse.jetty.server.handler.ContextHandler.doScope(ContextHandler.java:1306)
at org.eclipse.jetty.server.handler.ScopedHandler.handle(ScopedHandler.java:129)
at org.eclipse.jetty.server.handler.HandlerWrapper.handle(HandlerWrapper.java:122)
at org.eclipse.jetty.rewrite.handler.RewriteHandler.handle(RewriteHandler.java:301)
at org.eclipse.jetty.server.handler.HandlerWrapper.handle(HandlerWrapper.java:122)
at org.eclipse.jetty.server.handler.gzip.GzipHandler.handle(GzipHandler.java:790)
at org.eclipse.jetty.server.handler.HandlerWrapper.handle(HandlerWrapper.java:122)
at org.eclipse.jetty.server.Server.handle(Server.java:563)
at org.eclipse.jetty.server.HttpChannel$RequestDispatchable.dispatch(HttpChannel.java:1598)
at org.eclipse.jetty.server.HttpChannel.dispatch(HttpChannel.java:753)
at org.eclipse.jetty.server.HttpChannel.handle(HttpChannel.java:501)
at org.eclipse.jetty.server.HttpChannel.run(HttpChannel.java:461)
at org.eclipse.jetty.util.thread.QueuedThreadPool.runJob(QueuedThreadPool.java:969)
at org.eclipse.jetty.util.thread.QueuedThreadPool$Runner.doRunJob(QueuedThreadPool.java:1194)
at org.eclipse.jetty.util.thread.QueuedThreadPool$Runner.run(QueuedThreadPool.java:1149)
at java.base/java.lang.Thread.run(Thread.java:829)
org.apache.lucene.store.MMapDirectory:org.apache.solr.common.util.ObjectReleaseTracker$ObjectTrackerException: org.apache.lucene.store.MMapDirectory
at org.apache.solr.common.util.ObjectReleaseTracker.track(ObjectReleaseTracker.java:54)
at org.apache.solr.core.CachingDirectoryFactory.get(CachingDirectoryFactory.java:369)
at org.apache.solr.update.SolrIndexWriter.create(SolrIndexWriter.java:108)
at org.apache.solr.core.SolrCore.initIndex(SolrCore.java:904)
at org.apache.solr.core.SolrCore.<init>(SolrCore.java:1134)
at org.apache.solr.core.SolrCore.<init>(SolrCore.java:1056)
at org.apache.solr.core.CoreContainer.createFromDescriptor(CoreContainer.java:1702)
at org.apache.solr.core.CoreContainer.create(CoreContainer.java:1568)
at org.apache.solr.handler.admin.CoreAdminOperation.lambda$static$0(CoreAdminOperation.java:121)
at org.apache.solr.handler.admin.CoreAdminOperation.execute(CoreAdminOperation.java:427)
at org.apache.solr.handler.admin.CoreAdminHandler$CallInfo.call(CoreAdminHandler.java:374)
at org.apache.solr.handler.admin.CoreAdminHandler.handleRequestBody(CoreAdminHandler.java:231)
at org.apache.solr.handler.RequestHandlerBase.handleRequest(RequestHandlerBase.java:226)
at org.apache.solr.servlet.HttpSolrCall.handleAdmin(HttpSolrCall.java:933)
at org.apache.solr.servlet.HttpSolrCall.handleAdminRequest(HttpSolrCall.java:881)
at org.apache.solr.servlet.HttpSolrCall.call(HttpSolrCall.java:540)
at org.apache.solr.servlet.SolrDispatchFilter.dispatch(SolrDispatchFilter.java:254)
at org.apache.solr.servlet.SolrDispatchFilter.lambda$doFilter$0(SolrDispatchFilter.java:215)
at org.apache.solr.servlet.ServletUtils.traceHttpRequestExecution2(ServletUtils.java:241)
at org.apache.solr.servlet.ServletUtils.rateLimitRequest(ServletUtils.java:211)
at org.apache.solr.servlet.SolrDispatchFilter.doFilter(SolrDispatchFilter.java:209)
at org.apache.solr.servlet.SolrDispatchFilter.doFilter(SolrDispatchFilter.java:192)
at org.eclipse.jetty.servlet.FilterHolder.doFilter(FilterHolder.java:202)
at org.eclipse.jetty.servlet.ServletHandler$Chain.doFilter(ServletHandler.java:1635)
at org.apache.solr.embedded.JettySolrRunner$DebugFilter.doFilter(JettySolrRunner.java:187)
at org.eclipse.jetty.servlet.FilterHolder.doFilter(FilterHolder.java:202)
at org.eclipse.jetty.servlet.ServletHandler$Chain.doFilter(ServletHandler.java:1635)
at org.eclipse.jetty.servlet.ServletHandler.doHandle(ServletHandler.java:527)
at org.eclipse.jetty.server.handler.ScopedHandler.nextHandle(ScopedHandler.java:221)
at org.eclipse.jetty.server.session.SessionHandler.doHandle(SessionHandler.java:1570)
at org.eclipse.jetty.server.handler.ScopedHandler.nextHandle(ScopedHandler.java:221)
at org.eclipse.jetty.server.handler.ContextHandler.doHandle(ContextHandler.java:1384)
at org.eclipse.jetty.server.handler.ScopedHandler.nextScope(ScopedHandler.java:176)
at org.eclipse.jetty.servlet.ServletHandler.doScope(ServletHandler.java:484)
at org.eclipse.jetty.server.session.SessionHandler.doScope(SessionHandler.java:1543)
at org.eclipse.jetty.server.handler.ScopedHandler.nextScope(ScopedHandler.java:174)
at org.eclipse.jetty.server.handler.ContextHandler.doScope(ContextHandler.java:1306)
at org.eclipse.jetty.server.handler.ScopedHandler.handle(ScopedHandler.java:129)
at org.eclipse.jetty.server.handler.HandlerWrapper.handle(HandlerWrapper.java:122)
at org.eclipse.jetty.rewrite.handler.RewriteHandler.handle(RewriteHandler.java:301)
at org.eclipse.jetty.server.handler.HandlerWrapper.handle(HandlerWrapper.java:122)
at org.eclipse.jetty.server.handler.gzip.GzipHandler.handle(GzipHandler.java:790)
at org.eclipse.jetty.server.handler.HandlerWrapper.handle(HandlerWrapper.java:122)
at org.eclipse.jetty.server.Server.handle(Server.java:563)
at org.eclipse.jetty.server.HttpChannel$RequestDispatchable.dispatch(HttpChannel.java:1598)
at org.eclipse.jetty.server.HttpChannel.dispatch(HttpChannel.java:753)
at org.eclipse.jetty.server.HttpChannel.handle(HttpChannel.java:501)
at org.eclipse.jetty.server.HttpChannel.run(HttpChannel.java:461)
at org.eclipse.jetty.util.thread.QueuedThreadPool.runJob(QueuedThreadPool.java:969)
at org.eclipse.jetty.util.thread.QueuedThreadPool$Runner.doRunJob(QueuedThreadPool.java:1194)
at org.eclipse.jetty.util.thread.QueuedThreadPool$Runner.run(QueuedThreadPool.java:1149)
at java.base/java.lang.Thread.run(Thread.java:829)
org.apache.lucene.store.MMapDirectory:org.apache.solr.common.util.ObjectReleaseTracker$ObjectTrackerException: org.apache.lucene.store.MMapDirectory
at org.apache.solr.common.util.ObjectReleaseTracker.track(ObjectReleaseTracker.java:54)
at org.apache.solr.core.CachingDirectoryFactory.get(CachingDirectoryFactory.java:369)
at org.apache.solr.core.SolrCore.getNewIndexDir(SolrCore.java:420)
at org.apache.solr.core.SolrCore.initIndex(SolrCore.java:865)
at org.apache.solr.core.SolrCore.<init>(SolrCore.java:1134)
at org.apache.solr.core.SolrCore.<init>(SolrCore.java:1056)
at org.apache.solr.core.CoreContainer.createFromDescriptor(CoreContainer.java:1702)
at org.apache.solr.core.CoreContainer.create(CoreContainer.java:1568)
at org.apache.solr.handler.admin.CoreAdminOperation.lambda$static$0(CoreAdminOperation.java:121)
at org.apache.solr.handler.admin.CoreAdminOperation.execute(CoreAdminOperation.java:427)
at org.apache.solr.handler.admin.CoreAdminHandler$CallInfo.call(CoreAdminHandler.java:374)
at org.apache.solr.handler.admin.CoreAdminHandler.handleRequestBody(CoreAdminHandler.java:231)
at org.apache.solr.handler.RequestHandlerBase.handleRequest(RequestHandlerBase.java:226)
at org.apache.solr.servlet.HttpSolrCall.handleAdmin(HttpSolrCall.java:933)
at org.apache.solr.servlet.HttpSolrCall.handleAdminRequest(HttpSolrCall.java:881)
at org.apache.solr.servlet.HttpSolrCall.call(HttpSolrCall.java:540)
at org.apache.solr.servlet.SolrDispatchFilter.dispatch(SolrDispatchFilter.java:254)
at org.apache.solr.servlet.SolrDispatchFilter.lambda$doFilter$0(SolrDispatchFilter.java:215)
at org.apache.solr.servlet.ServletUtils.traceHttpRequestExecution2(ServletUtils.java:241)
at org.apache.solr.servlet.ServletUtils.rateLimitRequest(ServletUtils.java:211)
at org.apache.solr.servlet.SolrDispatchFilter.doFilter(SolrDispatchFilter.java:209)
at org.apache.solr.servlet.SolrDispatchFilter.doFilter(SolrDispatchFilter.java:192)
at org.eclipse.jetty.servlet.FilterHolder.doFilter(FilterHolder.java:202)
at org.eclipse.jetty.servlet.ServletHandler$Chain.doFilter(ServletHandler.java:1635)
at org.apache.solr.embedded.JettySolrRunner$DebugFilter.doFilter(JettySolrRunner.java:187)
at org.eclipse.jetty.servlet.FilterHolder.doFilter(FilterHolder.java:202)
at org.eclipse.jetty.servlet.ServletHandler$Chain.doFilter(ServletHandler.java:1635)
at org.eclipse.jetty.servlet.ServletHandler.doHandle(ServletHandler.java:527)
at org.eclipse.jetty.server.handler.ScopedHandler.nextHandle(ScopedHandler.java:221)
at org.eclipse.jetty.server.session.SessionHandler.doHandle(SessionHandler.java:1570)
at org.eclipse.jetty.server.handler.ScopedHandler.nextHandle(ScopedHandler.java:221)
at org.eclipse.jetty.server.handler.ContextHandler.doHandle(ContextHandler.java:1384)
at org.eclipse.jetty.server.handler.ScopedHandler.nextScope(ScopedHandler.java:176)
at org.eclipse.jetty.servlet.ServletHandler.doScope(ServletHandler.java:484)
at org.eclipse.jetty.server.session.SessionHandler.doScope(SessionHandler.java:1543)
at org.eclipse.jetty.server.handler.ScopedHandler.nextScope(ScopedHandler.java:174)
at org.eclipse.jetty.server.handler.ContextHandler.doScope(ContextHandler.java:1306)
at org.eclipse.jetty.server.handler.ScopedHandler.handle(ScopedHandler.java:129)
at org.eclipse.jetty.server.handler.HandlerWrapper.handle(HandlerWrapper.java:122)
at org.eclipse.jetty.rewrite.handler.RewriteHandler.handle(RewriteHandler.java:301)
at org.eclipse.jetty.server.handler.HandlerWrapper.handle(HandlerWrapper.java:122)
at org.eclipse.jetty.server.handler.gzip.GzipHandler.handle(GzipHandler.java:790)
at org.eclipse.jetty.server.handler.HandlerWrapper.handle(HandlerWrapper.java:122)
at org.eclipse.jetty.server.Server.handle(Server.java:563)
at org.eclipse.jetty.server.HttpChannel$RequestDispatchable.dispatch(HttpChannel.java:1598)
at org.eclipse.jetty.server.HttpChannel.dispatch(HttpChannel.java:753)
at org.eclipse.jetty.server.HttpChannel.handle(HttpChannel.java:501)
at org.eclipse.jetty.server.HttpChannel.run(HttpChannel.java:461)
at org.eclipse.jetty.util.thread.QueuedThreadPool.runJob(QueuedThreadPool.java:969)
at org.eclipse.jetty.util.thread.QueuedThreadPool$Runner.doRunJob(QueuedThreadPool.java:1194)
at org.eclipse.jetty.util.thread.QueuedThreadPool$Runner.run(QueuedThreadPool.java:1149)
at java.base/java.lang.Thread.run(Thread.java:829)
org.apache.lucene.store.MMapDirectory:org.apache.solr.common.util.ObjectReleaseTracker$ObjectTrackerException: org.apache.lucene.store.MMapDirectory
at org.apache.solr.common.util.ObjectReleaseTracker.track(ObjectReleaseTracker.java:54)
at org.apache.solr.core.CachingDirectoryFactory.get(CachingDirectoryFactory.java:369)
at org.apache.solr.core.SolrCore.getNewIndexDir(SolrCore.java:420)
at org.apache.solr.core.SolrCore.initIndex(SolrCore.java:865)
at org.apache.solr.core.SolrCore.<init>(SolrCore.java:1134)
at org.apache.solr.core.SolrCore.<init>(SolrCore.java:1056)
at org.apache.solr.core.CoreContainer.createFromDescriptor(CoreContainer.java:1702)
at org.apache.solr.core.CoreContainer.create(CoreContainer.java:1568)
at org.apache.solr.handler.admin.CoreAdminOperation.lambda$static$0(CoreAdminOperation.java:121)
at org.apache.solr.handler.admin.CoreAdminOperation.execute(CoreAdminOperation.java:427)
at org.apache.solr.handler.admin.CoreAdminHandler$CallInfo.call(CoreAdminHandler.java:374)
at org.apache.solr.handler.admin.CoreAdminHandler.handleRequestBody(CoreAdminHandler.java:231)
at org.apache.solr.handler.RequestHandlerBase.handleRequest(RequestHandlerBase.java:226)
at org.apache.solr.servlet.HttpSolrCall.handleAdmin(HttpSolrCall.java:933)
at org.apache.solr.servlet.HttpSolrCall.handleAdminRequest(HttpSolrCall.java:881)
at org.apache.solr.servlet.HttpSolrCall.call(HttpSolrCall.java:540)
at org.apache.solr.servlet.SolrDispatchFilter.dispatch(SolrDispatchFilter.java:254)
at org.apache.solr.servlet.SolrDispatchFilter.lambda$doFilter$0(SolrDispatchFilter.java:215)
at org.apache.solr.servlet.ServletUtils.traceHttpRequestExecution2(ServletUtils.java:241)
at org.apache.solr.servlet.ServletUtils.rateLimitRequest(ServletUtils.java:211)
at org.apache.solr.servlet.SolrDispatchFilter.doFilter(SolrDispatchFilter.java:209)
at org.apache.solr.servlet.SolrDispatchFilter.doFilter(SolrDispatchFilter.java:192)
at or
[...truncated too long message...]
eteReplicaAndVerifyDirectoryCleanup (:solr:core)
Test output: /home/jenkins/jenkins-home/712657a4/workspace/Solr/Solr-Check-main-s390x/solr/core/build/test-results/test/outputs/OUTPUT-org.apache.solr.cloud.DeleteReplicaTest.txt
Reproduce with: gradlew :solr:core:test --tests "org.apache.solr.cloud.DeleteReplicaTest.deleteReplicaAndVerifyDirectoryCleanup" -Ptests.jvms=4 -Ptests.haltonfailure=false "-Ptests.jvmargs=-XX:TieredStopAtLevel=1 -XX:+UseParallelGC -XX:ActiveProcessorCount=1 -XX:ReservedCodeCacheSize=120m" -Ptests.seed=A9ED8862B60D8E18 -Ptests.multiplier=2 -Ptests.badapples=false -Ptests.file.encoding=US-ASCII
- org.apache.solr.cloud.HttpPartitionOnCommitTest.test (:solr:core)
Test output: /home/jenkins/jenkins-home/712657a4/workspace/Solr/Solr-Check-main-s390x/solr/core/build/test-results/test/outputs/OUTPUT-org.apache.solr.cloud.HttpPartitionOnCommitTest.txt
Reproduce with: gradlew :solr:core:test --tests "org.apache.solr.cloud.HttpPartitionOnCommitTest.test" -Ptests.jvms=4 -Ptests.haltonfailure=false "-Ptests.jvmargs=-XX:TieredStopAtLevel=1 -XX:+UseParallelGC -XX:ActiveProcessorCount=1 -XX:ReservedCodeCacheSize=120m" -Ptests.seed=A9ED8862B60D8E18 -Ptests.multiplier=2 -Ptests.badapples=false -Ptests.file.encoding=US-ASCII
- org.apache.solr.cloud.ReplicationFactorTest.test (:solr:core)
Test output: /home/jenkins/jenkins-home/712657a4/workspace/Solr/Solr-Check-main-s390x/solr/core/build/test-results/test/outputs/OUTPUT-org.apache.solr.cloud.ReplicationFactorTest.txt
Reproduce with: gradlew :solr:core:test --tests "org.apache.solr.cloud.ReplicationFactorTest.test" -Ptests.jvms=4 -Ptests.haltonfailure=false "-Ptests.jvmargs=-XX:TieredStopAtLevel=1 -XX:+UseParallelGC -XX:ActiveProcessorCount=1 -XX:ReservedCodeCacheSize=120m" -Ptests.seed=A9ED8862B60D8E18 -Ptests.multiplier=2 -Ptests.badapples=false -Ptests.file.encoding=US-ASCII
- org.apache.solr.cloud.OverseerTest.testReplay (:solr:core)
Test output: /home/jenkins/jenkins-home/712657a4/workspace/Solr/Solr-Check-main-s390x/solr/core/build/test-results/test/outputs/OUTPUT-org.apache.solr.cloud.OverseerTest.txt
Reproduce with: gradlew :solr:core:test --tests "org.apache.solr.cloud.OverseerTest.testReplay" -Ptests.jvms=4 -Ptests.haltonfailure=false "-Ptests.jvmargs=-XX:TieredStopAtLevel=1 -XX:+UseParallelGC -XX:ActiveProcessorCount=1 -XX:ReservedCodeCacheSize=120m" -Ptests.seed=A9ED8862B60D8E18 -Ptests.multiplier=2 -Ptests.badapples=false -Ptests.file.encoding=US-ASCII
- org.apache.solr.cloud.TestRandomRequestDistribution.test (:solr:core)
Test output: /home/jenkins/jenkins-home/712657a4/workspace/Solr/Solr-Check-main-s390x/solr/core/build/test-results/test/outputs/OUTPUT-org.apache.solr.cloud.TestRandomRequestDistribution.txt
Reproduce with: gradlew :solr:core:test --tests "org.apache.solr.cloud.TestRandomRequestDistribution.test" -Ptests.jvms=4 -Ptests.haltonfailure=false "-Ptests.jvmargs=-XX:TieredStopAtLevel=1 -XX:+UseParallelGC -XX:ActiveProcessorCount=1 -XX:ReservedCodeCacheSize=120m" -Ptests.seed=A9ED8862B60D8E18 -Ptests.multiplier=2 -Ptests.badapples=false -Ptests.file.encoding=US-ASCII
- org.apache.solr.cloud.api.collections.CollectionsAPIDistributedZkTest.testCollectionsAPI (:solr:core)
Test output: /home/jenkins/jenkins-home/712657a4/workspace/Solr/Solr-Check-main-s390x/solr/core/build/test-results/test/outputs/OUTPUT-org.apache.solr.cloud.api.collections.CollectionsAPIDistributedZkTest.txt
Reproduce with: gradlew :solr:core:test --tests "org.apache.solr.cloud.api.collections.CollectionsAPIDistributedZkTest.testCollectionsAPI" -Ptests.jvms=4 -Ptests.haltonfailure=false "-Ptests.jvmargs=-XX:TieredStopAtLevel=1 -XX:+UseParallelGC -XX:ActiveProcessorCount=1 -XX:ReservedCodeCacheSize=120m" -Ptests.seed=A9ED8862B60D8E18 -Ptests.multiplier=2 -Ptests.badapples=false -Ptests.file.encoding=US-ASCII
- org.apache.solr.cloud.UnloadDistributedZkTest.test (:solr:core)
Test output: /home/jenkins/jenkins-home/712657a4/workspace/Solr/Solr-Check-main-s390x/solr/core/build/test-results/test/outputs/OUTPUT-org.apache.solr.cloud.UnloadDistributedZkTest.txt
Reproduce with: gradlew :solr:core:test --tests "org.apache.solr.cloud.UnloadDistributedZkTest.test" -Ptests.jvms=4 -Ptests.haltonfailure=false "-Ptests.jvmargs=-XX:TieredStopAtLevel=1 -XX:+UseParallelGC -XX:ActiveProcessorCount=1 -XX:ReservedCodeCacheSize=120m" -Ptests.seed=A9ED8862B60D8E18 -Ptests.multiplier=2 -Ptests.badapples=false -Ptests.file.encoding=US-ASCII
- org.apache.solr.cloud.api.collections.LocalFSInstallShardTest.testParallelInstallToMultiShardCollection (:solr:core)
Test output: /home/jenkins/jenkins-home/712657a4/workspace/Solr/Solr-Check-main-s390x/solr/core/build/test-results/test/outputs/OUTPUT-org.apache.solr.cloud.api.collections.LocalFSInstallShardTest.txt
Reproduce with: gradlew :solr:core:test --tests "org.apache.solr.cloud.api.collections.LocalFSInstallShardTest.testParallelInstallToMultiShardCollection" -Ptests.jvms=4 -Ptests.haltonfailure=false "-Ptests.jvmargs=-XX:TieredStopAtLevel=1 -XX:+UseParallelGC -XX:ActiveProcessorCount=1 -XX:ReservedCodeCacheSize=120m" -Ptests.seed=A9ED8862B60D8E18 -Ptests.multiplier=2 -Ptests.badapples=false -Ptests.file.encoding=US-ASCII
- org.apache.solr.cloud.api.collections.LocalFSInstallShardTest.testSerialInstallToMultiShardCollection (:solr:core)
Test output: /home/jenkins/jenkins-home/712657a4/workspace/Solr/Solr-Check-main-s390x/solr/core/build/test-results/test/outputs/OUTPUT-org.apache.solr.cloud.api.collections.LocalFSInstallShardTest.txt
Reproduce with: gradlew :solr:core:test --tests "org.apache.solr.cloud.api.collections.LocalFSInstallShardTest.testSerialInstallToMultiShardCollection" -Ptests.jvms=4 -Ptests.haltonfailure=false "-Ptests.jvmargs=-XX:TieredStopAtLevel=1 -XX:+UseParallelGC -XX:ActiveProcessorCount=1 -XX:ReservedCodeCacheSize=120m" -Ptests.seed=A9ED8862B60D8E18 -Ptests.multiplier=2 -Ptests.badapples=false -Ptests.file.encoding=US-ASCII
- org.apache.solr.cloud.api.collections.LocalFSInstallShardTest.classMethod (:solr:core)
Test output: /home/jenkins/jenkins-home/712657a4/workspace/Solr/Solr-Check-main-s390x/solr/core/build/test-results/test/outputs/OUTPUT-org.apache.solr.cloud.api.collections.LocalFSInstallShardTest.txt
Reproduce with: gradlew :solr:core:test --tests "org.apache.solr.cloud.api.collections.LocalFSInstallShardTest.classMethod" -Ptests.jvms=4 -Ptests.haltonfailure=false "-Ptests.jvmargs=-XX:TieredStopAtLevel=1 -XX:+UseParallelGC -XX:ActiveProcessorCount=1 -XX:ReservedCodeCacheSize=120m" -Ptests.seed=A9ED8862B60D8E18 -Ptests.multiplier=2 -Ptests.badapples=false -Ptests.file.encoding=US-ASCII
- org.apache.solr.cloud.api.collections.TestReplicaProperties.test (:solr:core)
Test output: /home/jenkins/jenkins-home/712657a4/workspace/Solr/Solr-Check-main-s390x/solr/core/build/test-results/test/outputs/OUTPUT-org.apache.solr.cloud.api.collections.TestReplicaProperties.txt
Reproduce with: gradlew :solr:core:test --tests "org.apache.solr.cloud.api.collections.TestReplicaProperties.test" -Ptests.jvms=4 -Ptests.haltonfailure=false "-Ptests.jvmargs=-XX:TieredStopAtLevel=1 -XX:+UseParallelGC -XX:ActiveProcessorCount=1 -XX:ReservedCodeCacheSize=120m" -Ptests.seed=A9ED8862B60D8E18 -Ptests.multiplier=2 -Ptests.badapples=false -Ptests.file.encoding=US-ASCII
- org.apache.solr.cloud.api.collections.TestCollectionAPI.test (:solr:core)
Test output: /home/jenkins/jenkins-home/712657a4/workspace/Solr/Solr-Check-main-s390x/solr/core/build/test-results/test/outputs/OUTPUT-org.apache.solr.cloud.api.collections.TestCollectionAPI.txt
Reproduce with: gradlew :solr:core:test --tests "org.apache.solr.cloud.api.collections.TestCollectionAPI.test" -Ptests.jvms=4 -Ptests.haltonfailure=false "-Ptests.jvmargs=-XX:TieredStopAtLevel=1 -XX:+UseParallelGC -XX:ActiveProcessorCount=1 -XX:ReservedCodeCacheSize=120m" -Ptests.seed=A9ED8862B60D8E18 -Ptests.multiplier=2 -Ptests.badapples=false -Ptests.file.encoding=US-ASCII
- org.apache.solr.handler.admin.HealthCheckHandlerTest.classMethod (:solr:core)
Test output: /home/jenkins/jenkins-home/712657a4/workspace/Solr/Solr-Check-main-s390x/solr/core/build/test-results/test/outputs/OUTPUT-org.apache.solr.handler.admin.HealthCheckHandlerTest.txt
Reproduce with: gradlew :solr:core:test --tests "org.apache.solr.handler.admin.HealthCheckHandlerTest.classMethod" -Ptests.jvms=4 -Ptests.haltonfailure=false "-Ptests.jvmargs=-XX:TieredStopAtLevel=1 -XX:+UseParallelGC -XX:ActiveProcessorCount=1 -XX:ReservedCodeCacheSize=120m" -Ptests.seed=A9ED8862B60D8E18 -Ptests.multiplier=2 -Ptests.badapples=false -Ptests.file.encoding=US-ASCII
FAILURE: Build failed with an exception.
* Where:
Script '/home/jenkins/jenkins-home/712657a4/workspace/Solr/Solr-Check-main-s390x/gradle/validation/check-broken-links.gradle' line: 52
* What went wrong:
Execution failed for task ':solr:documentation:checkBrokenLinks'.
> java.io.IOException: Stream Closed
* Try:
> Run with --stacktrace option to get the stack trace.
> Run with --info or --debug option to get more log output.
> Get more help at https://help.gradle.org.
Deprecated Gradle features were used in this build, making it incompatible with Gradle 9.0.
You can use '--warning-mode all' to show the individual deprecation warnings and determine if they come from your own scripts or plugins.
For more on this, please refer to https://docs.gradle.org/8.4/userguide/command_line_interface.html#sec:command_line_warnings in the Gradle documentation.
BUILD FAILED in 4h 45m 57s
584 actionable tasks: 584 executed
Publishing build scan...
https://ge.apache.org/s/5wojccu2c374c
Build step 'Invoke Gradle script' changed build result to FAILURE
Build step 'Invoke Gradle script' marked build as failure
Archiving artifacts
Recording test results
[Checks API] No suitable checks publisher found.
Email was triggered for: Failure - Any
Sending email for trigger: Failure - Any
[JENKINS] Solr » Solr-Check-main-s390x - Build # 415 - Still Unstable!
Posted by Apache Jenkins Server <je...@builds.apache.org>.
Build: https://ci-builds.apache.org/job/Solr/job/Solr-Check-main-s390x/415/
17 tests failed.
FAILED: org.apache.solr.cloud.HttpPartitionOnCommitTest.test
Error Message:
org.apache.solr.client.solrj.impl.BaseHttpSolrClient$RemoteSolrException: Error from server at http://127.0.0.1:36337/solr: Underlying core creation failed while creating collection: control_collection
Stack Trace:
org.apache.solr.client.solrj.impl.BaseHttpSolrClient$RemoteSolrException: Error from server at http://127.0.0.1:36337/solr: Underlying core creation failed while creating collection: control_collection
at __randomizedtesting.SeedInfo.seed([4F956CBDAAC2458:8CAD6911745049A0]:0)
at app//org.apache.solr.client.solrj.impl.HttpSolrClient.executeMethod(HttpSolrClient.java:734)
at app//org.apache.solr.client.solrj.impl.HttpSolrClient.request(HttpSolrClient.java:253)
at app//org.apache.solr.client.solrj.impl.HttpSolrClient.request(HttpSolrClient.java:234)
at app//org.apache.solr.client.solrj.impl.LBSolrClient.doRequest(LBSolrClient.java:386)
at app//org.apache.solr.client.solrj.impl.LBSolrClient.request(LBSolrClient.java:352)
at app//org.apache.solr.client.solrj.impl.CloudSolrClient.sendRequest(CloudSolrClient.java:1136)
at app//org.apache.solr.client.solrj.impl.CloudSolrClient.requestWithRetryOnStaleState(CloudSolrClient.java:835)
at app//org.apache.solr.client.solrj.impl.CloudSolrClient.request(CloudSolrClient.java:766)
at app//org.apache.solr.client.solrj.SolrRequest.process(SolrRequest.java:216)
at app//org.apache.solr.client.solrj.SolrRequest.process(SolrRequest.java:231)
at app//org.apache.solr.cloud.AbstractFullDistribZkTestBase.createServers(AbstractFullDistribZkTestBase.java:353)
at app//org.apache.solr.BaseDistributedSearchTestCase$ShardsRepeatRule$ShardsFixedStatement.callStatement(BaseDistributedSearchTestCase.java:1077)
at app//org.apache.solr.BaseDistributedSearchTestCase$ShardsRepeatRule$ShardsStatement.evaluate(BaseDistributedSearchTestCase.java:1050)
at app//com.carrotsearch.randomizedtesting.rules.SystemPropertiesRestoreRule$1.evaluate(SystemPropertiesRestoreRule.java:80)
at app//org.junit.rules.RunRules.evaluate(RunRules.java:20)
at app//org.apache.lucene.tests.util.TestRuleSetupTeardownChained$1.evaluate(TestRuleSetupTeardownChained.java:48)
at app//org.apache.lucene.tests.util.AbstractBeforeAfterRule$1.evaluate(AbstractBeforeAfterRule.java:43)
at app//org.apache.lucene.tests.util.TestRuleThreadAndTestName$1.evaluate(TestRuleThreadAndTestName.java:45)
at app//org.apache.lucene.tests.util.TestRuleIgnoreAfterMaxFailures$1.evaluate(TestRuleIgnoreAfterMaxFailures.java:60)
at app//org.apache.lucene.tests.util.TestRuleMarkFailure$1.evaluate(TestRuleMarkFailure.java:44)
at app//org.junit.rules.RunRules.evaluate(RunRules.java:20)
at app//com.carrotsearch.randomizedtesting.rules.StatementAdapter.evaluate(StatementAdapter.java:36)
at app//com.carrotsearch.randomizedtesting.ThreadLeakControl$StatementRunner.run(ThreadLeakControl.java:390)
at app//com.carrotsearch.randomizedtesting.ThreadLeakControl.forkTimeoutingTask(ThreadLeakControl.java:843)
at app//com.carrotsearch.randomizedtesting.ThreadLeakControl$3.evaluate(ThreadLeakControl.java:490)
at app//com.carrotsearch.randomizedtesting.RandomizedRunner.runSingleTest(RandomizedRunner.java:955)
at app//com.carrotsearch.randomizedtesting.RandomizedRunner$5.evaluate(RandomizedRunner.java:840)
at app//com.carrotsearch.randomizedtesting.RandomizedRunner$6.evaluate(RandomizedRunner.java:891)
at app//com.carrotsearch.randomizedtesting.RandomizedRunner$7.evaluate(RandomizedRunner.java:902)
at app//com.carrotsearch.randomizedtesting.rules.StatementAdapter.evaluate(StatementAdapter.java:36)
at app//com.carrotsearch.randomizedtesting.rules.StatementAdapter.evaluate(StatementAdapter.java:36)
at app//org.apache.lucene.tests.util.AbstractBeforeAfterRule$1.evaluate(AbstractBeforeAfterRule.java:43)
at app//com.carrotsearch.randomizedtesting.rules.SystemPropertiesRestoreRule$1.evaluate(SystemPropertiesRestoreRule.java:80)
at app//org.junit.rules.RunRules.evaluate(RunRules.java:20)
at app//org.apache.lucene.tests.util.AbstractBeforeAfterRule$1.evaluate(AbstractBeforeAfterRule.java:43)
at app//com.carrotsearch.randomizedtesting.rules.StatementAdapter.evaluate(StatementAdapter.java:36)
at app//org.apache.lucene.tests.util.TestRuleStoreClassName$1.evaluate(TestRuleStoreClassName.java:38)
at app//com.carrotsearch.randomizedtesting.rules.NoShadowingOrOverridesOnMethodsRule$1.evaluate(NoShadowingOrOverridesOnMethodsRule.java:40)
at app//com.carrotsearch.randomizedtesting.rules.NoShadowingOrOverridesOnMethodsRule$1.evaluate(NoShadowingOrOverridesOnMethodsRule.java:40)
at app//com.carrotsearch.randomizedtesting.rules.StatementAdapter.evaluate(StatementAdapter.java:36)
at app//com.carrotsearch.randomizedtesting.rules.StatementAdapter.evaluate(StatementAdapter.java:36)
at app//org.apache.lucene.tests.util.TestRuleAssertionsRequired$1.evaluate(TestRuleAssertionsRequired.java:53)
at app//org.apache.lucene.tests.util.AbstractBeforeAfterRule$1.evaluate(AbstractBeforeAfterRule.java:43)
at app//org.apache.lucene.tests.util.TestRuleMarkFailure$1.evaluate(TestRuleMarkFailure.java:44)
at app//org.apache.lucene.tests.util.TestRuleIgnoreAfterMaxFailures$1.evaluate(TestRuleIgnoreAfterMaxFailures.java:60)
at app//org.apache.lucene.tests.util.TestRuleIgnoreTestSuites$1.evaluate(TestRuleIgnoreTestSuites.java:47)
at app//org.junit.rules.RunRules.evaluate(RunRules.java:20)
at app//com.carrotsearch.randomizedtesting.rules.StatementAdapter.evaluate(StatementAdapter.java:36)
at app//com.carrotsearch.randomizedtesting.ThreadLeakControl$StatementRunner.run(ThreadLeakControl.java:390)
at app//com.carrotsearch.randomizedtesting.ThreadLeakControl.lambda$forkTimeoutingTask$0(ThreadLeakControl.java:850)
at java.base@11.0.16.1/java.lang.Thread.run(Thread.java:829)
FAILED: org.apache.solr.cloud.ReplaceNodeTest.testGoodSpreadDuringAssignWithNoTarget
Error Message:
java.lang.AssertionError: There should be no more replicas on the sourceNode after a replaceNode request. expected:<[]> but was:<[core_node11:{
"core":"replacenodetest_coll_shard1_replica_n5",
"leader":"true",
"node_name":"127.0.0.1:37691_solr",
"base_url":"http://127.0.0.1:37691/solr",
"state":"active",
"type":"NRT",
"force_set_state":"false"}, core_node12:{
"core":"replacenodetest_coll_shard2_replica_n6",
"leader":"true",
"node_name":"127.0.0.1:37691_solr",
"base_url":"http://127.0.0.1:37691/solr",
"state":"active",
"type":"NRT",
"force_set_state":"false"}, core_node7:{
"core":"replacenodetest_coll_shard3_replica_n1",
"leader":"true",
"node_name":"127.0.0.1:37691_solr",
"base_url":"http://127.0.0.1:37691/solr",
"state":"active",
"type":"NRT",
"force_set_state":"false"}]>
Stack Trace:
java.lang.AssertionError: There should be no more replicas on the sourceNode after a replaceNode request. expected:<[]> but was:<[core_node11:{
"core":"replacenodetest_coll_shard1_replica_n5",
"leader":"true",
"node_name":"127.0.0.1:37691_solr",
"base_url":"http://127.0.0.1:37691/solr",
"state":"active",
"type":"NRT",
"force_set_state":"false"}, core_node12:{
"core":"replacenodetest_coll_shard2_replica_n6",
"leader":"true",
"node_name":"127.0.0.1:37691_solr",
"base_url":"http://127.0.0.1:37691/solr",
"state":"active",
"type":"NRT",
"force_set_state":"false"}, core_node7:{
"core":"replacenodetest_coll_shard3_replica_n1",
"leader":"true",
"node_name":"127.0.0.1:37691_solr",
"base_url":"http://127.0.0.1:37691/solr",
"state":"active",
"type":"NRT",
"force_set_state":"false"}]>
at __randomizedtesting.SeedInfo.seed([4F956CBDAAC2458:2A9282F1EFCFF52C]:0)
at org.junit.Assert.fail(Assert.java:89)
at org.junit.Assert.failNotEquals(Assert.java:835)
at org.junit.Assert.assertEquals(Assert.java:120)
at org.apache.solr.cloud.ReplaceNodeTest.testGoodSpreadDuringAssignWithNoTarget(ReplaceNodeTest.java:273)
at java.base/jdk.internal.reflect.NativeMethodAccessorImpl.invoke0(Native Method)
at java.base/jdk.internal.reflect.NativeMethodAccessorImpl.invoke(NativeMethodAccessorImpl.java:62)
at java.base/jdk.internal.reflect.DelegatingMethodAccessorImpl.invoke(DelegatingMethodAccessorImpl.java:43)
at java.base/java.lang.reflect.Method.invoke(Method.java:566)
at com.carrotsearch.randomizedtesting.RandomizedRunner.invoke(RandomizedRunner.java:1758)
at com.carrotsearch.randomizedtesting.RandomizedRunner$8.evaluate(RandomizedRunner.java:946)
at com.carrotsearch.randomizedtesting.RandomizedRunner$9.evaluate(RandomizedRunner.java:982)
at com.carrotsearch.randomizedtesting.RandomizedRunner$10.evaluate(RandomizedRunner.java:996)
at com.carrotsearch.randomizedtesting.rules.SystemPropertiesRestoreRule$1.evaluate(SystemPropertiesRestoreRule.java:80)
at org.junit.rules.RunRules.evaluate(RunRules.java:20)
at org.apache.lucene.tests.util.TestRuleSetupTeardownChained$1.evaluate(TestRuleSetupTeardownChained.java:48)
at org.apache.lucene.tests.util.AbstractBeforeAfterRule$1.evaluate(AbstractBeforeAfterRule.java:43)
at org.apache.lucene.tests.util.TestRuleThreadAndTestName$1.evaluate(TestRuleThreadAndTestName.java:45)
at org.apache.lucene.tests.util.TestRuleIgnoreAfterMaxFailures$1.evaluate(TestRuleIgnoreAfterMaxFailures.java:60)
at org.apache.lucene.tests.util.TestRuleMarkFailure$1.evaluate(TestRuleMarkFailure.java:44)
at org.junit.rules.RunRules.evaluate(RunRules.java:20)
at com.carrotsearch.randomizedtesting.rules.StatementAdapter.evaluate(StatementAdapter.java:36)
at com.carrotsearch.randomizedtesting.ThreadLeakControl$StatementRunner.run(ThreadLeakControl.java:390)
at com.carrotsearch.randomizedtesting.ThreadLeakControl.forkTimeoutingTask(ThreadLeakControl.java:843)
at com.carrotsearch.randomizedtesting.ThreadLeakControl$3.evaluate(ThreadLeakControl.java:490)
at com.carrotsearch.randomizedtesting.RandomizedRunner.runSingleTest(RandomizedRunner.java:955)
at com.carrotsearch.randomizedtesting.RandomizedRunner$5.evaluate(RandomizedRunner.java:840)
at com.carrotsearch.randomizedtesting.RandomizedRunner$6.evaluate(RandomizedRunner.java:891)
at com.carrotsearch.randomizedtesting.RandomizedRunner$7.evaluate(RandomizedRunner.java:902)
at com.carrotsearch.randomizedtesting.rules.StatementAdapter.evaluate(StatementAdapter.java:36)
at com.carrotsearch.randomizedtesting.rules.StatementAdapter.evaluate(StatementAdapter.java:36)
at org.apache.lucene.tests.util.AbstractBeforeAfterRule$1.evaluate(AbstractBeforeAfterRule.java:43)
at com.carrotsearch.randomizedtesting.rules.SystemPropertiesRestoreRule$1.evaluate(SystemPropertiesRestoreRule.java:80)
at org.junit.rules.RunRules.evaluate(RunRules.java:20)
at org.apache.lucene.tests.util.AbstractBeforeAfterRule$1.evaluate(AbstractBeforeAfterRule.java:43)
at com.carrotsearch.randomizedtesting.rules.StatementAdapter.evaluate(StatementAdapter.java:36)
at org.apache.lucene.tests.util.TestRuleStoreClassName$1.evaluate(TestRuleStoreClassName.java:38)
at com.carrotsearch.randomizedtesting.rules.NoShadowingOrOverridesOnMethodsRule$1.evaluate(NoShadowingOrOverridesOnMethodsRule.java:40)
at com.carrotsearch.randomizedtesting.rules.NoShadowingOrOverridesOnMethodsRule$1.evaluate(NoShadowingOrOverridesOnMethodsRule.java:40)
at com.carrotsearch.randomizedtesting.rules.StatementAdapter.evaluate(StatementAdapter.java:36)
at com.carrotsearch.randomizedtesting.rules.StatementAdapter.evaluate(StatementAdapter.java:36)
at org.apache.lucene.tests.util.TestRuleAssertionsRequired$1.evaluate(TestRuleAssertionsRequired.java:53)
at org.apache.lucene.tests.util.AbstractBeforeAfterRule$1.evaluate(AbstractBeforeAfterRule.java:43)
at org.apache.lucene.tests.util.TestRuleMarkFailure$1.evaluate(TestRuleMarkFailure.java:44)
at org.apache.lucene.tests.util.TestRuleIgnoreAfterMaxFailures$1.evaluate(TestRuleIgnoreAfterMaxFailures.java:60)
at org.apache.lucene.tests.util.TestRuleIgnoreTestSuites$1.evaluate(TestRuleIgnoreTestSuites.java:47)
at org.junit.rules.RunRules.evaluate(RunRules.java:20)
at com.carrotsearch.randomizedtesting.rules.StatementAdapter.evaluate(StatementAdapter.java:36)
at com.carrotsearch.randomizedtesting.ThreadLeakControl$StatementRunner.run(ThreadLeakControl.java:390)
at com.carrotsearch.randomizedtesting.ThreadLeakControl.lambda$forkTimeoutingTask$0(ThreadLeakControl.java:850)
at java.base/java.lang.Thread.run(Thread.java:829)
FAILED: org.apache.solr.cloud.ReplaceNodeTest.testFailOnSingleNode
Error Message:
java.lang.Exception: Error shutting down MiniSolrCloudCluster
Stack Trace:
java.lang.Exception: Error shutting down MiniSolrCloudCluster
at __randomizedtesting.SeedInfo.seed([4F956CBDAAC2458:C546DE54C5CF915D]:0)
at org.apache.solr.cloud.MiniSolrCloudCluster.checkForExceptions(MiniSolrCloudCluster.java:772)
at org.apache.solr.cloud.MiniSolrCloudCluster.shutdown(MiniSolrCloudCluster.java:681)
at org.apache.solr.cloud.SolrCloudTestCase.shutdownCluster(SolrCloudTestCase.java:119)
at org.apache.solr.cloud.ReplaceNodeTest.clearPreviousCluster(ReplaceNodeTest.java:66)
at java.base/jdk.internal.reflect.NativeMethodAccessorImpl.invoke0(Native Method)
at java.base/jdk.internal.reflect.NativeMethodAccessorImpl.invoke(NativeMethodAccessorImpl.java:62)
at java.base/jdk.internal.reflect.DelegatingMethodAccessorImpl.invoke(DelegatingMethodAccessorImpl.java:43)
at java.base/java.lang.reflect.Method.invoke(Method.java:566)
at com.carrotsearch.randomizedtesting.RandomizedRunner.invoke(RandomizedRunner.java:1758)
at com.carrotsearch.randomizedtesting.RandomizedRunner$9.evaluate(RandomizedRunner.java:980)
at com.carrotsearch.randomizedtesting.RandomizedRunner$10.evaluate(RandomizedRunner.java:996)
at com.carrotsearch.randomizedtesting.rules.SystemPropertiesRestoreRule$1.evaluate(SystemPropertiesRestoreRule.java:80)
at org.junit.rules.RunRules.evaluate(RunRules.java:20)
at org.apache.lucene.tests.util.TestRuleSetupTeardownChained$1.evaluate(TestRuleSetupTeardownChained.java:48)
at org.apache.lucene.tests.util.AbstractBeforeAfterRule$1.evaluate(AbstractBeforeAfterRule.java:43)
at org.apache.lucene.tests.util.TestRuleThreadAndTestName$1.evaluate(TestRuleThreadAndTestName.java:45)
at org.apache.lucene.tests.util.TestRuleIgnoreAfterMaxFailures$1.evaluate(TestRuleIgnoreAfterMaxFailures.java:60)
at org.apache.lucene.tests.util.TestRuleMarkFailure$1.evaluate(TestRuleMarkFailure.java:44)
at org.junit.rules.RunRules.evaluate(RunRules.java:20)
at com.carrotsearch.randomizedtesting.rules.StatementAdapter.evaluate(StatementAdapter.java:36)
at com.carrotsearch.randomizedtesting.ThreadLeakControl$StatementRunner.run(ThreadLeakControl.java:390)
at com.carrotsearch.randomizedtesting.ThreadLeakControl.forkTimeoutingTask(ThreadLeakControl.java:843)
at com.carrotsearch.randomizedtesting.ThreadLeakControl$3.evaluate(ThreadLeakControl.java:490)
at com.carrotsearch.randomizedtesting.RandomizedRunner.runSingleTest(RandomizedRunner.java:955)
at com.carrotsearch.randomizedtesting.RandomizedRunner$5.evaluate(RandomizedRunner.java:840)
at com.carrotsearch.randomizedtesting.RandomizedRunner$6.evaluate(RandomizedRunner.java:891)
at com.carrotsearch.randomizedtesting.RandomizedRunner$7.evaluate(RandomizedRunner.java:902)
at com.carrotsearch.randomizedtesting.rules.StatementAdapter.evaluate(StatementAdapter.java:36)
at com.carrotsearch.randomizedtesting.rules.StatementAdapter.evaluate(StatementAdapter.java:36)
at org.apache.lucene.tests.util.AbstractBeforeAfterRule$1.evaluate(AbstractBeforeAfterRule.java:43)
at com.carrotsearch.randomizedtesting.rules.SystemPropertiesRestoreRule$1.evaluate(SystemPropertiesRestoreRule.java:80)
at org.junit.rules.RunRules.evaluate(RunRules.java:20)
at org.apache.lucene.tests.util.AbstractBeforeAfterRule$1.evaluate(AbstractBeforeAfterRule.java:43)
at com.carrotsearch.randomizedtesting.rules.StatementAdapter.evaluate(StatementAdapter.java:36)
at org.apache.lucene.tests.util.TestRuleStoreClassName$1.evaluate(TestRuleStoreClassName.java:38)
at com.carrotsearch.randomizedtesting.rules.NoShadowingOrOverridesOnMethodsRule$1.evaluate(NoShadowingOrOverridesOnMethodsRule.java:40)
at com.carrotsearch.randomizedtesting.rules.NoShadowingOrOverridesOnMethodsRule$1.evaluate(NoShadowingOrOverridesOnMethodsRule.java:40)
at com.carrotsearch.randomizedtesting.rules.StatementAdapter.evaluate(StatementAdapter.java:36)
at com.carrotsearch.randomizedtesting.rules.StatementAdapter.evaluate(StatementAdapter.java:36)
at org.apache.lucene.tests.util.TestRuleAssertionsRequired$1.evaluate(TestRuleAssertionsRequired.java:53)
at org.apache.lucene.tests.util.AbstractBeforeAfterRule$1.evaluate(AbstractBeforeAfterRule.java:43)
at org.apache.lucene.tests.util.TestRuleMarkFailure$1.evaluate(TestRuleMarkFailure.java:44)
at org.apache.lucene.tests.util.TestRuleIgnoreAfterMaxFailures$1.evaluate(TestRuleIgnoreAfterMaxFailures.java:60)
at org.apache.lucene.tests.util.TestRuleIgnoreTestSuites$1.evaluate(TestRuleIgnoreTestSuites.java:47)
at org.junit.rules.RunRules.evaluate(RunRules.java:20)
at com.carrotsearch.randomizedtesting.rules.StatementAdapter.evaluate(StatementAdapter.java:36)
at com.carrotsearch.randomizedtesting.ThreadLeakControl$StatementRunner.run(ThreadLeakControl.java:390)
at com.carrotsearch.randomizedtesting.ThreadLeakControl.lambda$forkTimeoutingTask$0(ThreadLeakControl.java:850)
at java.base/java.lang.Thread.run(Thread.java:829)
Suppressed: java.lang.RuntimeException: Timeout waiting for pool org.apache.solr.common.util.ExecutorUtil$MDCAwareThreadPoolExecutor@48a71965[Shutting down, pool size = 1, active threads = 1, queued tasks = 0, completed tasks = 3] to shutdown.
at org.apache.solr.common.util.ExecutorUtil.awaitTermination(ExecutorUtil.java:135)
at org.apache.solr.common.util.ExecutorUtil.awaitTermination(ExecutorUtil.java:122)
at org.apache.solr.common.util.ExecutorUtil.shutdownAndAwaitTermination(ExecutorUtil.java:112)
at org.apache.solr.core.CoreContainer.shutdown(CoreContainer.java:1374)
at org.apache.solr.servlet.CoreContainerProvider.close(CoreContainerProvider.java:195)
at org.apache.solr.embedded.JettySolrRunner$1.lifeCycleStopped(JettySolrRunner.java:386)
at org.eclipse.jetty.util.component.AbstractLifeCycle.setStopped(AbstractLifeCycle.java:286)
at org.eclipse.jetty.util.component.AbstractLifeCycle.stop(AbstractLifeCycle.java:133)
at org.apache.solr.embedded.JettySolrRunner.stop(JettySolrRunner.java:666)
at org.apache.solr.cloud.MiniSolrCloudCluster.stopJettySolrRunner(MiniSolrCloudCluster.java:560)
at org.apache.solr.cloud.MiniSolrCloudCluster.lambda$shutdown$5(MiniSolrCloudCluster.java:673)
at java.base/java.util.concurrent.FutureTask.run(FutureTask.java:264)
at org.apache.solr.common.util.ExecutorUtil$MDCAwareThreadPoolExecutor.lambda$execute$0(ExecutorUtil.java:294)
at java.base/java.util.concurrent.ThreadPoolExecutor.runWorker(ThreadPoolExecutor.java:1128)
at java.base/java.util.concurrent.ThreadPoolExecutor$Worker.run(ThreadPoolExecutor.java:628)
... 1 more
FAILED: org.apache.solr.cloud.ReplaceNodeTest.classMethod
Error Message:
java.lang.AssertionError: ObjectTracker found 1 object(s) that were not released!!! [Http2SolrClient]
org.apache.solr.client.solrj.impl.Http2SolrClient:org.apache.solr.common.util.ObjectReleaseTracker$ObjectTrackerException: org.apache.solr.client.solrj.impl.Http2SolrClient
at org.apache.solr.common.util.ObjectReleaseTracker.track(ObjectReleaseTracker.java:54)
at org.apache.solr.client.solrj.impl.Http2SolrClient.<init>(Http2SolrClient.java:202)
at org.apache.solr.client.solrj.impl.Http2SolrClient$Builder.build(Http2SolrClient.java:1060)
at org.apache.solr.update.UpdateShardHandler.<init>(UpdateShardHandler.java:143)
at org.apache.solr.core.CoreContainer.loadInternal(CoreContainer.java:806)
at org.apache.solr.core.CoreContainer.load(CoreContainer.java:763)
at org.apache.solr.servlet.CoreContainerProvider.createCoreContainer(CoreContainerProvider.java:427)
at org.apache.solr.servlet.CoreContainerProvider.init(CoreContainerProvider.java:246)
at org.apache.solr.embedded.JettySolrRunner$1.lifeCycleStarted(JettySolrRunner.java:405)
at org.eclipse.jetty.util.component.AbstractLifeCycle.setStarted(AbstractLifeCycle.java:253)
at org.eclipse.jetty.util.component.AbstractLifeCycle.start(AbstractLifeCycle.java:94)
at org.apache.solr.embedded.JettySolrRunner.retryOnPortBindFailure(JettySolrRunner.java:614)
at org.apache.solr.embedded.JettySolrRunner.start(JettySolrRunner.java:552)
at org.apache.solr.embedded.JettySolrRunner.start(JettySolrRunner.java:523)
at org.apache.solr.cloud.MiniSolrCloudCluster.startJettySolrRunner(MiniSolrCloudCluster.java:509)
at org.apache.solr.cloud.MiniSolrCloudCluster.lambda$new$0(MiniSolrCloudCluster.java:321)
at java.base/java.util.concurrent.FutureTask.run(FutureTask.java:264)
at org.apache.solr.common.util.ExecutorUtil$MDCAwareThreadPoolExecutor.lambda$execute$0(ExecutorUtil.java:294)
at java.base/java.util.concurrent.ThreadPoolExecutor.runWorker(ThreadPoolExecutor.java:1128)
at java.base/java.util.concurrent.ThreadPoolExecutor$Worker.run(ThreadPoolExecutor.java:628)
at java.base/java.lang.Thread.run(Thread.java:829)
Caused by: java.lang.Exception: Submitter stack trace
at org.apache.solr.common.util.ExecutorUtil$MDCAwareThreadPoolExecutor.execute(ExecutorUtil.java:261)
at java.base/java.util.concurrent.AbstractExecutorService.invokeAll(AbstractExecutorService.java:242)
at org.apache.solr.cloud.MiniSolrCloudCluster.<init>(MiniSolrCloudCluster.java:326)
at org.apache.solr.cloud.MiniSolrCloudCluster$Builder.build(MiniSolrCloudCluster.java:1243)
at org.apache.solr.cloud.MiniSolrCloudCluster$Builder.configure(MiniSolrCloudCluster.java:1209)
at org.apache.solr.cloud.ReplaceNodeTest.testGoodSpreadDuringAssignWithNoTarget(ReplaceNodeTest.java:224)
at java.base/jdk.internal.reflect.NativeMethodAccessorImpl.invoke0(Native Method)
at java.base/jdk.internal.reflect.NativeMethodAccessorImpl.invoke(NativeMethodAccessorImpl.java:62)
at java.base/jdk.internal.reflect.DelegatingMethodAccessorImpl.invoke(DelegatingMethodAccessorImpl.java:43)
at java.base/java.lang.reflect.Method.invoke(Method.java:566)
at com.carrotsearch.randomizedtesting.RandomizedRunner.invoke(RandomizedRunner.java:1758)
at com.carrotsearch.randomizedtesting.RandomizedRunner$8.evaluate(RandomizedRunner.java:946)
at com.carrotsearch.randomizedtesting.RandomizedRunner$9.evaluate(RandomizedRunner.java:982)
at com.carrotsearch.randomizedtesting.RandomizedRunner$10.evaluate(RandomizedRunner.java:996)
at com.carrotsearch.randomizedtesting.rules.SystemPropertiesRestoreRule$1.evaluate(SystemPropertiesRestoreRule.java:80)
at org.junit.rules.RunRules.evaluate(RunRules.java:20)
at org.apache.lucene.tests.util.TestRuleSetupTeardownChained$1.evaluate(TestRuleSetupTeardownChained.java:48)
at org.apache.lucene.tests.util.AbstractBeforeAfterRule$1.evaluate(AbstractBeforeAfterRule.java:43)
at org.apache.lucene.tests.util.TestRuleThreadAndTestName$1.evaluate(TestRuleThreadAndTestName.java:45)
at org.apache.lucene.tests.util.TestRuleIgnoreAfterMaxFailures$1.evaluate(TestRuleIgnoreAfterMaxFailures.java:60)
at org.apache.lucene.tests.util.TestRuleMarkFailure$1.evaluate(TestRuleMarkFailure.java:44)
at org.junit.rules.RunRules.evaluate(RunRules.java:20)
at com.carrotsearch.randomizedtesting.rules.StatementAdapter.evaluate(StatementAdapter.java:36)
at com.carrotsearch.randomizedtesting.ThreadLeakControl$StatementRunner.run(ThreadLeakControl.java:390)
at com.carrotsearch.randomizedtesting.ThreadLeakControl.forkTimeoutingTask(ThreadLeakControl.java:843)
at com.carrotsearch.randomizedtesting.ThreadLeakControl$3.evaluate(ThreadLeakControl.java:490)
at com.carrotsearch.randomizedtesting.RandomizedRunner.runSingleTest(RandomizedRunner.java:955)
at com.carrotsearch.randomizedtesting.RandomizedRunner$5.evaluate(RandomizedRunner.java:840)
at com.carrotsearch.randomizedtesting.RandomizedRunner$6.evaluate(RandomizedRunner.java:891)
at com.carrotsearch.randomizedtesting.RandomizedRunner$7.evaluate(RandomizedRunner.java:902)
at com.carrotsearch.randomizedtesting.rules.StatementAdapter.evaluate(StatementAdapter.java:36)
at com.carrotsearch.randomizedtesting.rules.StatementAdapter.evaluate(StatementAdapter.java:36)
at org.apache.lucene.tests.util.AbstractBeforeAfterRule$1.evaluate(AbstractBeforeAfterRule.java:43)
at com.carrotsearch.randomizedtesting.rules.SystemPropertiesRestoreRule$1.evaluate(SystemPropertiesRestoreRule.java:80)
at org.junit.rules.RunRules.evaluate(RunRules.java:20)
at org.apache.lucene.tests.util.AbstractBeforeAfterRule$1.evaluate(AbstractBeforeAfterRule.java:43)
at com.carrotsearch.randomizedtesting.rules.StatementAdapter.evaluate(StatementAdapter.java:36)
at org.apache.lucene.tests.util.TestRuleStoreClassName$1.evaluate(TestRuleStoreClassName.java:38)
at com.carrotsearch.randomizedtesting.rules.NoShadowingOrOverridesOnMethodsRule$1.evaluate(NoShadowingOrOverridesOnMethodsRule.java:40)
at com.carrotsearch.randomizedtesting.rules.NoShadowingOrOverridesOnMethodsRule$1.evaluate(NoShadowingOrOverridesOnMethodsRule.java:40)
at com.carrotsearch.randomizedtesting.rules.StatementAdapter.evaluate(StatementAdapter.java:36)
at com.carrotsearch.randomizedtesting.rules.StatementAdapter.evaluate(StatementAdapter.java:36)
at org.apache.lucene.tests.util.TestRuleAssertionsRequired$1.evaluate(TestRuleAssertionsRequired.java:53)
at org.apache.lucene.tests.util.AbstractBeforeAfterRule$1.evaluate(AbstractBeforeAfterRule.java:43)
at org.apache.lucene.tests.util.TestRuleMarkFailure$1.evaluate(TestRuleMarkFailure.java:44)
at org.apache.lucene.tests.util.TestRuleIgnoreAfterMaxFailures$1.evaluate(TestRuleIgnoreAfterMaxFailures.java:60)
at org.apache.lucene.tests.util.TestRuleIgnoreTestSuites$1.evaluate(TestRuleIgnoreTestSuites.java:47)
at org.junit.rules.RunRules.evaluate(RunRules.java:20)
at com.carrotsearch.randomizedtesting.rules.StatementAdapter.evaluate(StatementAdapter.java:36)
at com.carrotsearch.randomizedtesting.ThreadLeakControl$StatementRunner.run(ThreadLeakControl.java:390)
at com.carrotsearch.randomizedtesting.ThreadLeakControl.lambda$forkTimeoutingTask$0(ThreadLeakControl.java:850)
... 1 more
expected null, but was:<ObjectTracker found 1 object(s) that were not released!!! [Http2SolrClient]
org.apache.solr.client.solrj.impl.Http2SolrClient:org.apache.solr.common.util.ObjectReleaseTracker$ObjectTrackerException: org.apache.solr.client.solrj.impl.Http2SolrClient
at org.apache.solr.common.util.ObjectReleaseTracker.track(ObjectReleaseTracker.java:54)
at org.apache.solr.client.solrj.impl.Http2SolrClient.<init>(Http2SolrClient.java:202)
at org.apache.solr.client.solrj.impl.Http2SolrClient$Builder.build(Http2SolrClient.java:1060)
at org.apache.solr.update.UpdateShardHandler.<init>(UpdateShardHandler.java:143)
at org.apache.solr.core.CoreContainer.loadInternal(CoreContainer.java:806)
at org.apache.solr.core.CoreContainer.load(CoreContainer.java:763)
at org.apache.solr.servlet.CoreContainerProvider.createCoreContainer(CoreContainerProvider.java:427)
at org.apache.solr.servlet.CoreContainerProvider.init(CoreContainerProvider.java:246)
at org.apache.solr.embedded.JettySolrRunner$1.lifeCycleStarted(JettySolrRunner.java:405)
at org.eclipse.jetty.util.component.AbstractLifeCycle.setStarted(AbstractLifeCycle.java:253)
at org.eclipse.jetty.util.component.AbstractLifeCycle.start(AbstractLifeCycle.java:94)
at org.apache.solr.embedded.JettySolrRunner.retryOnPortBindFailure(JettySolrRunner.java:614)
at org.apache.solr.embedded.JettySolrRunner.start(JettySolrRunner.java:552)
at org.apache.solr.embedded.JettySolrRunner.start(JettySolrRunner.java:523)
at org.apache.solr.cloud.MiniSolrCloudCluster.startJettySolrRunner(MiniSolrCloudCluster.java:509)
at org.apache.solr.cloud.MiniSolrCloudCluster.lambda$new$0(MiniSolrCloudCluster.java:321)
at java.base/java.util.concurrent.FutureTask.run(FutureTask.java:264)
at org.apache.solr.common.util.ExecutorUtil$MDCAwareThreadPoolExecutor.lambda$execute$0(ExecutorUtil.java:294)
at java.base/java.util.concurrent.ThreadPoolExecutor.runWorker(ThreadPoolExecutor.java:1128)
at java.base/java.util.concurrent.ThreadPoolExecutor$Worker.run(ThreadPoolExecutor.java:628)
at java.base/java.lang.Thread.run(Thread.java:829)
Caused by: java.lang.Exception: Submitter stack trace
at org.apache.solr.common.util.ExecutorUtil$MDCAwareThreadPoolExecutor.execute(ExecutorUtil.java:261)
at java.base/java.util.concurrent.AbstractExecutorService.invokeAll(AbstractExecutorService.java:242)
at org.apache.solr.cloud.MiniSolrCloudCluster.<init>(MiniSolrCloudCluster.java:326)
at org.apache.solr.cloud.MiniSolrCloudCluster$Builder.build(MiniSolrCloudCluster.java:1243)
at org.apache.solr.cloud.MiniSolrCloudCluster$Builder.configure(MiniSolrCloudCluster.java:1209)
at org.apache.solr.cloud.ReplaceNodeTest.testGoodSpreadDuringAssignWithNoTarget(ReplaceNodeTest.java:224)
at java.base/jdk.internal.reflect.NativeMethodAccessorImpl.invoke0(Native Method)
at java.base/jdk.internal.reflect.NativeMethodAccessorImpl.invoke(NativeMethodAccessorImpl.java:62)
at java.base/jdk.internal.reflect.DelegatingMethodAccessorImpl.invoke(DelegatingMethodAccessorImpl.java:43)
at java.base/java.lang.reflect.Method.invoke(Method.java:566)
at com.carrotsearch.randomizedtesting.RandomizedRunner.invoke(RandomizedRunner.java:1758)
at com.carrotsearch.randomizedtesting.RandomizedRunner$8.evaluate(RandomizedRunner.java:946)
at com.carrotsearch.randomizedtesting.RandomizedRunner$9.evaluate(RandomizedRunner.java:982)
at com.carrotsearch.randomizedtesting.RandomizedRunner$10.evaluate(RandomizedRunner.java:996)
at com.carrotsearch.randomizedtesting.rules.SystemPropertiesRestoreRule$1.evaluate(SystemPropertiesRestoreRule.java:80)
at org.junit.rules.RunRules.evaluate(RunRules.java:20)
at org.apache.lucene.tests.util.TestRuleSetupTeardownChained$1.evaluate(TestRuleSetupTeardownChained.java:48)
at org.apache.lucene.tests.util.AbstractBeforeAfterRule$1.evaluate(AbstractBeforeAfterRule.java:43)
at org.apache.lucene.tests.util.TestRuleThreadAndTestName$1.evaluate(TestRuleThreadAndTestName.java:45)
at org.apache.lucene.tests.util.TestRuleIgnoreAfterMaxFailures$1.evaluate(TestRuleIgnoreAfterMaxFailures.java:60)
at org.apache.lucene.tests.util.TestRuleMarkFailure$1.evaluate(TestRuleMarkFailure.java:44)
at org.junit.rules.RunRules.evaluate(RunRules.java:20)
at com.carrotsearch.randomizedtesting.rules.StatementAdapter.evaluate(StatementAdapter.java:36)
at com.carrotsearch.randomizedtesting.ThreadLeakControl$StatementRunner.run(ThreadLeakControl.java:390)
at com.carrotsearch.randomizedtesting.ThreadLeakControl.forkTimeoutingTask(ThreadLeakControl.java:843)
at com.carrotsearch.randomizedtesting.ThreadLeakControl$3.evaluate(ThreadLeakControl.java:490)
at com.carrotsearch.randomizedtesting.RandomizedRunner.runSingleTest(RandomizedRunner.java:955)
at com.carrotsearch.randomizedtesting.RandomizedRunner$5.evaluate(RandomizedRunner.java:840)
at com.carrotsearch.randomizedtesting.RandomizedRunner$6.evaluate(RandomizedRunner.java:891)
at com.carrotsearch.randomizedtesting.RandomizedRunner$7.evaluate(RandomizedRunner.java:902)
at com.carrotsearch.randomizedtesting.rules.StatementAdapter.evaluate(StatementAdapter.java:36)
at com.carrotsearch.randomizedtesting.rules.StatementAdapter.evaluate(StatementAdapter.java:36)
at org.apache.lucene.tests.util.AbstractBeforeAfterRule$1.evaluate(AbstractBeforeAfterRule.java:43)
at com.carrotsearch.randomizedtesting.rules.SystemPropertiesRestoreRule$1.evaluate(SystemPropertiesRestoreRule.java:80)
at org.junit.rules.RunRules.evaluate(RunRules.java:20)
at org.apache.lucene.tests.util.AbstractBeforeAfterRule$1.evaluate(AbstractBeforeAfterRule.java:43)
at com.carrotsearch.randomizedtesting.rules.StatementAdapter.evaluate(StatementAdapter.java:36)
at org.apache.lucene.tests.util.TestRuleStoreClassName$1.evaluate(TestRuleStoreClassName.java:38)
at com.carrotsearch.randomizedtesting.rules.NoShadowingOrOverridesOnMethodsRule$1.evaluate(NoShadowingOrOverridesOnMethodsRule.java:40)
at com.carrotsearch.randomizedtesting.rules.NoShadowingOrOverridesOnMethodsRule$1.evaluate(NoShadowingOrOverridesOnMethodsRule.java:40)
at com.carrotsearch.randomizedtesting.rules.StatementAdapter.evaluate(StatementAdapter.java:36)
at com.carrotsearch.randomizedtesting.rules.StatementAdapter.evaluate(StatementAdapter.java:36)
at org.apache.lucene.tests.util.TestRuleAssertionsRequired$1.evaluate(TestRuleAssertionsRequired.java:53)
at org.apache.lucene.tests.util.AbstractBeforeAfterRule$1.evaluate(AbstractBeforeAfterRule.java:43)
at org.apache.lucene.tests.util.TestRuleMarkFailure$1.evaluate(TestRuleMarkFailure.java:44)
at org.apache.lucene.tests.util.TestRuleIgnoreAfterMaxFailures$1.evaluate(TestRuleIgnoreAfterMaxFailures.java:60)
at org.apache.lucene.tests.util.TestRuleIgnoreTestSuites$1.evaluate(TestRuleIgnoreTestSuites.java:47)
at org.junit.rules.RunRules.evaluate(RunRules.java:20)
at com.carrotsearch.randomizedtesting.rules.StatementAdapter.evaluate(StatementAdapter.java:36)
at com.carrotsearch.randomizedtesting.ThreadLeakControl$StatementRunner.run(ThreadLeakControl.java:390)
at com.carrotsearch.randomizedtesting.ThreadLeakControl.lambda$forkTimeoutingTask$0(ThreadLeakControl.java:850)
... 1 more
>
Stack Trace:
java.lang.AssertionError: ObjectTracker found 1 object(s) that were not released!!! [Http2SolrClient]
org.apache.solr.client.solrj.impl.Http2SolrClient:org.apache.solr.common.util.ObjectReleaseTracker$ObjectTrackerException: org.apache.solr.client.solrj.impl.Http2SolrClient
at org.apache.solr.common.util.ObjectReleaseTracker.track(ObjectReleaseTracker.java:54)
at org.apache.solr.client.solrj.impl.Http2SolrClient.<init>(Http2SolrClient.java:202)
at org.apache.solr.client.solrj.impl.Http2SolrClient$Builder.build(Http2SolrClient.java:1060)
at org.apache.solr.update.UpdateShardHandler.<init>(UpdateShardHandler.java:143)
at org.apache.solr.core.CoreContainer.loadInternal(CoreContainer.java:806)
at org.apache.solr.core.CoreContainer.load(CoreContainer.java:763)
at org.apache.solr.servlet.CoreContainerProvider.createCoreContainer(CoreContainerProvider.java:427)
at org.apache.solr.servlet.CoreContainerProvider.init(CoreContainerProvider.java:246)
at org.apache.solr.embedded.JettySolrRunner$1.lifeCycleStarted(JettySolrRunner.java:405)
at org.eclipse.jetty.util.component.AbstractLifeCycle.setStarted(AbstractLifeCycle.java:253)
at org.eclipse.jetty.util.component.AbstractLifeCycle.start(AbstractLifeCycle.java:94)
at org.apache.solr.embedded.JettySolrRunner.retryOnPortBindFailure(JettySolrRunner.java:614)
at org.apache.solr.embedded.JettySolrRunner.start(JettySolrRunner.java:552)
at org.apache.solr.embedded.JettySolrRunner.start(JettySolrRunner.java:523)
at org.apache.solr.cloud.MiniSolrCloudCluster.startJettySolrRunner(MiniSolrCloudCluster.java:509)
at org.apache.solr.cloud.MiniSolrCloudCluster.lambda$new$0(MiniSolrCloudCluster.java:321)
at java.base/java.util.concurrent.FutureTask.run(FutureTask.java:264)
at org.apache.solr.common.util.ExecutorUtil$MDCAwareThreadPoolExecutor.lambda$execute$0(ExecutorUtil.java:294)
at java.base/java.util.concurrent.ThreadPoolExecutor.runWorker(ThreadPoolExecutor.java:1128)
at java.base/java.util.concurrent.ThreadPoolExecutor$Worker.run(ThreadPoolExecutor.java:628)
at java.base/java.lang.Thread.run(Thread.java:829)
Caused by: java.lang.Exception: Submitter stack trace
at org.apache.solr.common.util.ExecutorUtil$MDCAwareThreadPoolExecutor.execute(ExecutorUtil.java:261)
at java.base/java.util.concurrent.AbstractExecutorService.invokeAll(AbstractExecutorService.java:242)
at org.apache.solr.cloud.MiniSolrCloudCluster.<init>(MiniSolrCloudCluster.java:326)
at org.apache.solr.cloud.MiniSolrCloudCluster$Builder.build(MiniSolrCloudCluster.java:1243)
at org.apache.solr.cloud.MiniSolrCloudCluster$Builder.configure(MiniSolrCloudCluster.java:1209)
at org.apache.solr.cloud.ReplaceNodeTest.testGoodSpreadDuringAssignWithNoTarget(ReplaceNodeTest.java:224)
at java.base/jdk.internal.reflect.NativeMethodAccessorImpl.invoke0(Native Method)
at java.base/jdk.internal.reflect.NativeMethodAccessorImpl.invoke(NativeMethodAccessorImpl.java:62)
at java.base/jdk.internal.reflect.DelegatingMethodAccessorImpl.invoke(DelegatingMethodAccessorImpl.java:43)
at java.base/java.lang.reflect.Method.invoke(Method.java:566)
at com.carrotsearch.randomizedtesting.RandomizedRunner.invoke(RandomizedRunner.java:1758)
at com.carrotsearch.randomizedtesting.RandomizedRunner$8.evaluate(RandomizedRunner.java:946)
at com.carrotsearch.randomizedtesting.RandomizedRunner$9.evaluate(RandomizedRunner.java:982)
at com.carrotsearch.randomizedtesting.RandomizedRunner$10.evaluate(RandomizedRunner.java:996)
at com.carrotsearch.randomizedtesting.rules.SystemPropertiesRestoreRule$1.evaluate(SystemPropertiesRestoreRule.java:80)
at org.junit.rules.RunRules.evaluate(RunRules.java:20)
at org.apache.lucene.tests.util.TestRuleSetupTeardownChained$1.evaluate(TestRuleSetupTeardownChained.java:48)
at org.apache.lucene.tests.util.AbstractBeforeAfterRule$1.evaluate(AbstractBeforeAfterRule.java:43)
at org.apache.lucene.tests.util.TestRuleThreadAndTestName$1.evaluate(TestRuleThreadAndTestName.java:45)
at org.apache.lucene.tests.util.TestRuleIgnoreAfterMaxFailures$1.evaluate(TestRuleIgnoreAfterMaxFailures.java:60)
at org.apache.lucene.tests.util.TestRuleMarkFailure$1.evaluate(TestRuleMarkFailure.java:44)
at org.junit.rules.RunRules.evaluate(RunRules.java:20)
at com.carrotsearch.randomizedtesting.rules.StatementAdapter.evaluate(StatementAdapter.java:36)
at com.carrotsearch.randomizedtesting.ThreadLeakControl$StatementRunner.run(ThreadLeakControl.java:390)
at com.carrotsearch.randomizedtesting.ThreadLeakControl.forkTimeoutingTask(ThreadLeakControl.java:843)
at com.carrotsearch.randomizedtesting.ThreadLeakControl$3.evaluate(ThreadLeakControl.java:490)
at com.carrotsearch.randomizedtesting.RandomizedRunner.runSingleTest(RandomizedRunner.java:955)
at com.carrotsearch.randomizedtesting.RandomizedRunner$5.evaluate(RandomizedRunner.java:840)
at com.carrotsearch.randomizedtesting.RandomizedRunner$6.evaluate(RandomizedRunner.java:891)
at com.carrotsearch.randomizedtesting.RandomizedRunner$7.evaluate(RandomizedRunner.java:902)
at com.carrotsearch.randomizedtesting.rules.StatementAdapter.evaluate(StatementAdapter.java:36)
at com.carrotsearch.randomizedtesting.rules.StatementAdapter.evaluate(StatementAdapter.java:36)
at org.apache.lucene.tests.util.AbstractBeforeAfterRule$1.evaluate(AbstractBeforeAfterRule.java:43)
at com.carrotsearch.randomizedtesting.rules.SystemPropertiesRestoreRule$1.evaluate(SystemPropertiesRestoreRule.java:80)
at org.junit.rules.RunRules.evaluate(RunRules.java:20)
at org.apache.lucene.tests.util.AbstractBeforeAfterRule$1.evaluate(AbstractBeforeAfterRule.java:43)
at com.carrotsearch.randomizedtesting.rules.StatementAdapter.evaluate(StatementAdapter.java:36)
at org.apache.lucene.tests.util.TestRuleStoreClassName$1.evaluate(TestRuleStoreClassName.java:38)
at com.carrotsearch.randomizedtesting.rules.NoShadowingOrOverridesOnMethodsRule$1.evaluate(NoShadowingOrOverridesOnMethodsRule.java:40)
at com.carrotsearch.randomizedtesting.rules.NoShadowingOrOverridesOnMethodsRule$1.evaluate(NoShadowingOrOverridesOnMethodsRule.java:40)
at com.carrotsearch.randomizedtesting.rules.StatementAdapter.evaluate(StatementAdapter.java:36)
at com.carrotsearch.randomizedtesting.rules.StatementAdapter.evaluate(StatementAdapter.java:36)
at org.apache.lucene.tests.util.TestRuleAssertionsRequired$1.evaluate(TestRuleAssertionsRequired.java:53)
at org.apache.lucene.tests.util.AbstractBeforeAfterRule$1.evaluate(AbstractBeforeAfterRule.java:43)
at org.apache.lucene.tests.util.TestRuleMarkFailure$1.evaluate(TestRuleMarkFailure.java:44)
at org.apache.lucene.tests.util.TestRuleIgnoreAfterMaxFailures$1.evaluate(TestRuleIgnoreAfterMaxFailures.java:60)
at org.apache.lucene.tests.util.TestRuleIgnoreTestSuites$1.evaluate(TestRuleIgnoreTestSuites.java:47)
at org.junit.rules.RunRules.evaluate(RunRules.java:20)
at com.carrotsearch.randomizedtesting.rules.StatementAdapter.evaluate(StatementAdapter.java:36)
at com.carrotsearch.randomizedtesting.ThreadLeakControl$StatementRunner.run(ThreadLeakControl.java:390)
at com.carrotsearch.randomizedtesting.ThreadLeakControl.lambda$forkTimeoutingTask$0(ThreadLeakControl.java:850)
... 1 more
expected null, but was:<ObjectTracker found 1 object(s) that were not released!!! [Http2SolrClient]
org.apache.solr.client.solrj.impl.Http2SolrClient:org.apache.solr.common.util.ObjectReleaseTracker$ObjectTrackerException: org.apache.solr.client.solrj.impl.Http2SolrClient
at org.apache.solr.common.util.ObjectReleaseTracker.track(ObjectReleaseTracker.java:54)
at org.apache.solr.client.solrj.impl.Http2SolrClient.<init>(Http2SolrClient.java:202)
at org.apache.solr.client.solrj.impl.Http2SolrClient$Builder.build(Http2SolrClient.java:1060)
at org.apache.solr.update.UpdateShardHandler.<init>(UpdateShardHandler.java:143)
at org.apache.solr.core.CoreContainer.loadInternal(CoreContainer.java:806)
at org.apache.solr.core.CoreContainer.load(CoreContainer.java:763)
at org.apache.solr.servlet.CoreContainerProvider.createCoreContainer(CoreContainerProvider.java:427)
at org.apache.solr.servlet.CoreContainerProvider.init(CoreContainerProvider.java:246)
at org.apache.solr.embedded.JettySolrRunner$1.lifeCycleStarted(JettySolrRunner.java:405)
at org.eclipse.jetty.util.component.AbstractLifeCycle.setStarted(AbstractLifeCycle.java:253)
at org.eclipse.jetty.util.component.AbstractLifeCycle.start(AbstractLifeCycle.java:94)
at org.apache.solr.embedded.JettySolrRunner.retryOnPortBindFailure(JettySolrRunner.java:614)
at org.apache.solr.embedded.JettySolrRunner.start(JettySolrRunner.java:552)
at org.apache.solr.embedded.JettySolrRunner.start(JettySolrRunner.java:523)
at org.apache.solr.cloud.MiniSolrCloudCluster.startJettySolrRunner(MiniSolrCloudCluster.java:509)
at org.apache.solr.cloud.MiniSolrCloudCluster.lambda$new$0(MiniSolrCloudCluster.java:321)
at java.base/java.util.concurrent.FutureTask.run(FutureTask.java:264)
at org.apache.solr.common.util.ExecutorUtil$MDCAwareThreadPoolExecutor.lambda$execute$0(ExecutorUtil.java:294)
at java.base/java.util.concurrent.ThreadPoolExecutor.runWorker(ThreadPoolExecutor.java:1128)
at java.base/java.util.concurrent.ThreadPoolExecutor$Worker.run(ThreadPoolExecutor.java:628)
at java.base/java.lang.Thread.run(Thread.java:829)
Caused by: java.lang.Exception: Submitter stack trace
at org.apache.solr.common.util.ExecutorUtil$MDCAwareThreadPoolExecutor.execute(ExecutorUtil.java:261)
at java.base/java.util.concurrent.AbstractExecutorService.invokeAll(AbstractExecutorService.java:242)
at org.apache.solr.cloud.MiniSolrCloudCluster.<init>(MiniSolrCloudCluster.java:326)
at org.apache.solr.cloud.MiniSolrCloudCluster$Builder.build(MiniSolrCloudCluster.java:1243)
at org.apache.solr.cloud.MiniSolrCloudCluster$Builder.configure(MiniSolrCloudCluster.java:1209)
at org.apache.solr.cloud.ReplaceNodeTest.testGoodSpreadDuringAssignWithNoTarget(ReplaceNodeTest.java:224)
at java.base/jdk.internal.reflect.NativeMethodAccessorImpl.invoke0(Native Method)
at java.base/jdk.internal.reflect.NativeMethodAccessorImpl.invoke(NativeMethodAccessorImpl.java:62)
at java.base/jdk.internal.reflect.DelegatingMethodAccessorImpl.invoke(DelegatingMethodAccessorImpl.java:43)
at java.base/java.lang.reflect.Method.invoke(Method.java:566)
at com.carrotsearch.randomizedtesting.RandomizedRunner.invoke(RandomizedRunner.java:1758)
at com.carrotsearch.randomizedtesting.RandomizedRunner$8.evaluate(RandomizedRunner.java:946)
at com.carrotsearch.randomizedtesting.RandomizedRunner$9.evaluate(RandomizedRunner.java:982)
at com.carrotsearch.randomizedtesting.RandomizedRunner$10.evaluate(RandomizedRunner.java:996)
at com.carrotsearch.randomizedtesting.rules.SystemPropertiesRestoreRule$1.evaluate(SystemPropertiesRestoreRule.java:80)
at org.junit.rules.RunRules.evaluate(RunRules.java:20)
at org.apache.lucene.tests.util.TestRuleSetupTeardownChained$1.evaluate(TestRuleSetupTeardownChained.java:48)
at org.apache.lucene.tests.util.AbstractBeforeAfterRule$1.evaluate(AbstractBeforeAfterRule.java:43)
at org.apache.lucene.tests.util.TestRuleThreadAndTestName$1.evaluate(TestRuleThreadAndTestName.java:45)
at org.apache.lucene.tests.util.TestRuleIgnoreAfterMaxFailures$1.evaluate(TestRuleIgnoreAfterMaxFailures.java:60)
at org.apache.lucene.tests.util.TestRuleMarkFailure$1.evaluate(TestRuleMarkFailure.java:44)
at org.junit.rules.RunRules.evaluate(RunRules.java:20)
at com.carrotsearch.randomizedtesting.rules.StatementAdapter.evaluate(StatementAdapter.java:36)
at com.carrotsearch.randomizedtesting.ThreadLeakControl$StatementRunner.run(ThreadLeakControl.java:390)
at com.carrotsearch.randomizedtesting.ThreadLeakControl.forkTimeoutingTask(ThreadLeakControl.java:843)
at com.carrotsearch.randomizedtesting.ThreadLeakControl$3.evaluate(ThreadLeakControl.java:490)
at com.carrotsearch.randomizedtesting.RandomizedRunner.runSingleTest(RandomizedRunner.java:955)
at com.carrotsearch.randomizedtesting.RandomizedRunner$5.evaluate(RandomizedRunner.java:840)
at com.carrotsearch.randomizedtesting.RandomizedRunner$6.evaluate(RandomizedRunner.java:891)
at com.carrotsearch.randomizedtesting.RandomizedRunner$7.evaluate(RandomizedRunner.java:902)
at com.carrotsearch.randomizedtesting.rules.StatementAdapter.evaluate(StatementAdapter.java:36)
at com.carrotsearch.randomizedtesting.rules.StatementAdapter.evaluate(StatementAdapter.java:36)
at org.apache.lucene.tests.util.AbstractBeforeAfterRule$1.evaluate(AbstractBeforeAfterRule.java:43)
at com.carrotsearch.randomizedtesting.rules.SystemPropertiesRestoreRule$1.evaluate(SystemPropertiesRestoreRule.java:80)
at org.junit.rules.RunRules.evaluate(RunRules.java:20)
at org.apache.lucene.tests.util.AbstractBeforeAfterRule$1.evaluate(AbstractBeforeAfterRule.java:43)
at com.carrotsearch.randomizedtesting.rules.StatementAdapter.evaluate(StatementAdapter.java:36)
at org.apache.lucene.tests.util.TestRuleStoreClassName$1.evaluate(TestRuleStoreClassName.java:38)
at com.carrotsearch.randomizedtesting.rules.NoShadowingOrOverridesOnMethodsRule$1.evaluate(NoShadowingOrOverridesOnMethodsRule.java:40)
at com.carrotsearch.randomizedtesting.rules.NoShadowingOrOverridesOnMethodsRule$1.evaluate(NoShadowingOrOverridesOnMethodsRule.java:40)
at com.carrotsearch.randomizedtesting.rules.StatementAdapter.evaluate(StatementAdapter.java:36)
at com.carrotsearch.randomizedtesting.rules.StatementAdapter.evaluate(StatementAdapter.java:36)
at org.apache.lucene.tests.util.TestRuleAssertionsRequired$1.evaluate(TestRuleAssertionsRequired.java:53)
at org.apache.lucene.tests.util.AbstractBeforeAfterRule$1.evaluate(AbstractBeforeAfterRule.java:43)
at org.apache.lucene.tests.util.TestRuleMarkFailure$1.evaluate(TestRuleMarkFailure.java:44)
at org.apache.lucene.tests.util.TestRuleIgnoreAfterMaxFailures$1.evaluate(TestRuleIgnoreAfterMaxFailures.java:60)
at org.apache.lucene.tests.util.TestRuleIgnoreTestSuites$1.evaluate(TestRuleIgnoreTestSuites.java:47)
at org.junit.rules.RunRules.evaluate(RunRules.java:20)
at com.carrotsearch.randomizedtesting.rules.StatementAdapter.evaluate(StatementAdapter.java:36)
at com.carrotsearch.randomizedtesting.ThreadLeakControl$StatementRunner.run(ThreadLeakControl.java:390)
at com.carrotsearch.randomizedtesting.ThreadLeakControl.lambda$forkTimeoutingTask$0(ThreadLeakControl.java:850)
... 1 more
>
at __randomizedtesting.SeedInfo.seed([4F956CBDAAC2458]:0)
at org.junit.Assert.fail(Assert.java:89)
at org.junit.Assert.failNotNull(Assert.java:756)
at org.junit.Assert.assertNull(Assert.java:738)
at org.apache.solr.SolrTestCase$1.afterIfSuccessful(SolrTestCase.java:97)
at com.carrotsearch.randomizedtesting.rules.StatementAdapter.evaluate(StatementAdapter.java:37)
at com.carrotsearch.randomizedtesting.rules.StatementAdapter.evaluate(StatementAdapter.java:36)
at org.apache.lucene.tests.util.AbstractBeforeAfterRule$1.evaluate(AbstractBeforeAfterRule.java:43)
at com.carrotsearch.randomizedtesting.rules.SystemPropertiesRestoreRule$1.evaluate(SystemPropertiesRestoreRule.java:80)
at org.junit.rules.RunRules.evaluate(RunRules.java:20)
at org.apache.lucene.tests.util.AbstractBeforeAfterRule$1.evaluate(AbstractBeforeAfterRule.java:43)
at com.carrotsearch.randomizedtesting.rules.StatementAdapter.evaluate(StatementAdapter.java:36)
at org.apache.lucene.tests.util.TestRuleStoreClassName$1.evaluate(TestRuleStoreClassName.java:38)
at com.carrotsearch.randomizedtesting.rules.NoShadowingOrOverridesOnMethodsRule$1.evaluate(NoShadowingOrOverridesOnMethodsRule.java:40)
at com.carrotsearch.randomizedtesting.rules.NoShadowingOrOverridesOnMethodsRule$1.evaluate(NoShadowingOrOverridesOnMethodsRule.java:40)
at com.carrotsearch.randomizedtesting.rules.StatementAdapter.evaluate(StatementAdapter.java:36)
at com.carrotsearch.randomizedtesting.rules.StatementAdapter.evaluate(StatementAdapter.java:36)
at org.apache.lucene.tests.util.TestRuleAssertionsRequired$1.evaluate(TestRuleAssertionsRequired.java:53)
at org.apache.lucene.tests.util.AbstractBeforeAfterRule$1.evaluate(AbstractBeforeAfterRule.java:43)
at org.apache.lucene.tests.util.TestRuleMarkFailure$1.evaluate(TestRuleMarkFailure.java:44)
at org.apache.lucene.tests.util.TestRuleIgnoreAfterMaxFailures$1.evaluate(TestRuleIgnoreAfterMaxFailures.java:60)
at org.apache.lucene.tests.util.TestRuleIgnoreTestSuites$1.evaluate(TestRuleIgnoreTestSuites.java:47)
at org.junit.rules.RunRules.evaluate(RunRules.java:20)
at com.carrotsearch.randomizedtesting.rules.StatementAdapter.evaluate(StatementAdapter.java:36)
at com.carrotsearch.randomizedtesting.ThreadLeakControl$StatementRunner.run(ThreadLeakControl.java:390)
at com.carrotsearch.randomizedtesting.ThreadLeakControl.lambda$forkTimeoutingTask$0(ThreadLeakControl.java:850)
at java.base/java.lang.Thread.run(Thread.java:829)
FAILED: org.apache.solr.cloud.SolrCloudExampleTest.testLoadDocsIntoGettingStartedCollection
Error Message:
java.lang.AssertionError: Collection 'gettingstarted' doesn't exist after trying to create it!
Stack Trace:
java.lang.AssertionError: Collection 'gettingstarted' doesn't exist after trying to create it!
at __randomizedtesting.SeedInfo.seed([4F956CBDAAC2458:179A64A4EBC39DFE]:0)
at org.junit.Assert.fail(Assert.java:89)
at org.junit.Assert.assertTrue(Assert.java:42)
at org.apache.solr.cloud.SolrCloudExampleTest.testLoadDocsIntoGettingStartedCollection(SolrCloudExampleTest.java:103)
at java.base/jdk.internal.reflect.NativeMethodAccessorImpl.invoke0(Native Method)
at java.base/jdk.internal.reflect.NativeMethodAccessorImpl.invoke(NativeMethodAccessorImpl.java:62)
at java.base/jdk.internal.reflect.DelegatingMethodAccessorImpl.invoke(DelegatingMethodAccessorImpl.java:43)
at java.base/java.lang.reflect.Method.invoke(Method.java:566)
at com.carrotsearch.randomizedtesting.RandomizedRunner.invoke(RandomizedRunner.java:1758)
at com.carrotsearch.randomizedtesting.RandomizedRunner$8.evaluate(RandomizedRunner.java:946)
at com.carrotsearch.randomizedtesting.RandomizedRunner$9.evaluate(RandomizedRunner.java:982)
at com.carrotsearch.randomizedtesting.RandomizedRunner$10.evaluate(RandomizedRunner.java:996)
at org.apache.solr.BaseDistributedSearchTestCase$ShardsRepeatRule$ShardsFixedStatement.callStatement(BaseDistributedSearchTestCase.java:1079)
at org.apache.solr.BaseDistributedSearchTestCase$ShardsRepeatRule$ShardsStatement.evaluate(BaseDistributedSearchTestCase.java:1050)
at com.carrotsearch.randomizedtesting.rules.SystemPropertiesRestoreRule$1.evaluate(SystemPropertiesRestoreRule.java:80)
at org.junit.rules.RunRules.evaluate(RunRules.java:20)
at org.apache.lucene.tests.util.TestRuleSetupTeardownChained$1.evaluate(TestRuleSetupTeardownChained.java:48)
at org.apache.lucene.tests.util.AbstractBeforeAfterRule$1.evaluate(AbstractBeforeAfterRule.java:43)
at org.apache.lucene.tests.util.TestRuleThreadAndTestName$1.evaluate(TestRuleThreadAndTestName.java:45)
at org.apache.lucene.tests.util.TestRuleIgnoreAfterMaxFailures$1.evaluate(TestRuleIgnoreAfterMaxFailures.java:60)
at org.apache.lucene.tests.util.TestRuleMarkFailure$1.evaluate(TestRuleMarkFailure.java:44)
at org.junit.rules.RunRules.evaluate(RunRules.java:20)
at com.carrotsearch.randomizedtesting.rules.StatementAdapter.evaluate(StatementAdapter.java:36)
at com.carrotsearch.randomizedtesting.ThreadLeakControl$StatementRunner.run(ThreadLeakControl.java:390)
at com.carrotsearch.randomizedtesting.ThreadLeakControl.forkTimeoutingTask(ThreadLeakControl.java:843)
at com.carrotsearch.randomizedtesting.ThreadLeakControl$3.evaluate(ThreadLeakControl.java:490)
at com.carrotsearch.randomizedtesting.RandomizedRunner.runSingleTest(RandomizedRunner.java:955)
at com.carrotsearch.randomizedtesting.RandomizedRunner$5.evaluate(RandomizedRunner.java:840)
at com.carrotsearch.randomizedtesting.RandomizedRunner$6.evaluate(RandomizedRunner.java:891)
at com.carrotsearch.randomizedtesting.RandomizedRunner$7.evaluate(RandomizedRunner.java:902)
at com.carrotsearch.randomizedtesting.rules.StatementAdapter.evaluate(StatementAdapter.java:36)
at com.carrotsearch.randomizedtesting.rules.StatementAdapter.evaluate(StatementAdapter.java:36)
at org.apache.lucene.tests.util.AbstractBeforeAfterRule$1.evaluate(AbstractBeforeAfterRule.java:43)
at com.carrotsearch.randomizedtesting.rules.SystemPropertiesRestoreRule$1.evaluate(SystemPropertiesRestoreRule.java:80)
at org.junit.rules.RunRules.evaluate(RunRules.java:20)
at org.apache.lucene.tests.util.AbstractBeforeAfterRule$1.evaluate(AbstractBeforeAfterRule.java:43)
at com.carrotsearch.randomizedtesting.rules.StatementAdapter.evaluate(StatementAdapter.java:36)
at org.apache.lucene.tests.util.TestRuleStoreClassName$1.evaluate(TestRuleStoreClassName.java:38)
at com.carrotsearch.randomizedtesting.rules.NoShadowingOrOverridesOnMethodsRule$1.evaluate(NoShadowingOrOverridesOnMethodsRule.java:40)
at com.carrotsearch.randomizedtesting.rules.NoShadowingOrOverridesOnMethodsRule$1.evaluate(NoShadowingOrOverridesOnMethodsRule.java:40)
at com.carrotsearch.randomizedtesting.rules.StatementAdapter.evaluate(StatementAdapter.java:36)
at com.carrotsearch.randomizedtesting.rules.StatementAdapter.evaluate(StatementAdapter.java:36)
at org.apache.lucene.tests.util.TestRuleAssertionsRequired$1.evaluate(TestRuleAssertionsRequired.java:53)
at org.apache.lucene.tests.util.AbstractBeforeAfterRule$1.evaluate(AbstractBeforeAfterRule.java:43)
at org.apache.lucene.tests.util.TestRuleMarkFailure$1.evaluate(TestRuleMarkFailure.java:44)
at org.apache.lucene.tests.util.TestRuleIgnoreAfterMaxFailures$1.evaluate(TestRuleIgnoreAfterMaxFailures.java:60)
at org.apache.lucene.tests.util.TestRuleIgnoreTestSuites$1.evaluate(TestRuleIgnoreTestSuites.java:47)
at org.junit.rules.RunRules.evaluate(RunRules.java:20)
at com.carrotsearch.randomizedtesting.rules.StatementAdapter.evaluate(StatementAdapter.java:36)
at com.carrotsearch.randomizedtesting.ThreadLeakControl$StatementRunner.run(ThreadLeakControl.java:390)
at com.carrotsearch.randomizedtesting.ThreadLeakControl.lambda$forkTimeoutingTask$0(ThreadLeakControl.java:850)
at java.base/java.lang.Thread.run(Thread.java:829)
FAILED: org.apache.solr.cloud.TestAuthenticationFramework.classMethod
Error Message:
com.carrotsearch.randomizedtesting.ThreadLeakError: 1 thread leaked from SUITE scope at org.apache.solr.cloud.TestAuthenticationFramework:
1) Thread[id=6618, name=TEST-TestAuthenticationFramework.testBasics-seed#[4F956CBDAAC2458]-EventThread, state=WAITING, group=TGRP-TestAuthenticationFramework]
at java.base@11.0.16.1/jdk.internal.misc.Unsafe.park(Native Method)
at java.base@11.0.16.1/java.util.concurrent.locks.LockSupport.park(LockSupport.java:194)
at java.base@11.0.16.1/java.util.concurrent.locks.AbstractQueuedSynchronizer$ConditionObject.await(AbstractQueuedSynchronizer.java:2081)
at java.base@11.0.16.1/java.util.concurrent.LinkedBlockingQueue.take(LinkedBlockingQueue.java:433)
at app//org.apache.zookeeper.ClientCnxn$EventThread.run(ClientCnxn.java:534)
Stack Trace:
com.carrotsearch.randomizedtesting.ThreadLeakError: 1 thread leaked from SUITE scope at org.apache.solr.cloud.TestAuthenticationFramework:
1) Thread[id=6618, name=TEST-TestAuthenticationFramework.testBasics-seed#[4F956CBDAAC2458]-EventThread, state=WAITING, group=TGRP-TestAuthenticationFramework]
at java.base@11.0.16.1/jdk.internal.misc.Unsafe.park(Native Method)
at java.base@11.0.16.1/java.util.concurrent.locks.LockSupport.park(LockSupport.java:194)
at java.base@11.0.16.1/java.util.concurrent.locks.AbstractQueuedSynchronizer$ConditionObject.await(AbstractQueuedSynchronizer.java:2081)
at java.base@11.0.16.1/java.util.concurrent.LinkedBlockingQueue.take(LinkedBlockingQueue.java:433)
at app//org.apache.zookeeper.ClientCnxn$EventThread.run(ClientCnxn.java:534)
at __randomizedtesting.SeedInfo.seed([4F956CBDAAC2458]:0)
FAILED: org.apache.solr.cloud.TestOnReconnectListenerSupport.test
Error Message:
org.apache.solr.client.solrj.impl.BaseHttpSolrClient$RemoteSolrException: Error from server at http://127.0.0.1:39527/solr: Underlying core creation failed while creating collection: c8n_onreconnect_1x1
Stack Trace:
org.apache.solr.client.solrj.impl.BaseHttpSolrClient$RemoteSolrException: Error from server at http://127.0.0.1:39527/solr: Underlying core creation failed while creating collection: c8n_onreconnect_1x1
at __randomizedtesting.SeedInfo.seed([4F956CBDAAC2458:8CAD6911745049A0]:0)
at app//org.apache.solr.client.solrj.impl.HttpSolrClient.executeMethod(HttpSolrClient.java:734)
at app//org.apache.solr.client.solrj.impl.HttpSolrClient.request(HttpSolrClient.java:253)
at app//org.apache.solr.client.solrj.impl.HttpSolrClient.request(HttpSolrClient.java:234)
at app//org.apache.solr.client.solrj.SolrClient.request(SolrClient.java:1193)
at app//org.apache.solr.cloud.AbstractFullDistribZkTestBase.createCollection(AbstractFullDistribZkTestBase.java:2097)
at app//org.apache.solr.cloud.AbstractFullDistribZkTestBase.createCollection(AbstractFullDistribZkTestBase.java:2135)
at app//org.apache.solr.cloud.AbstractFullDistribZkTestBase.createCollection(AbstractFullDistribZkTestBase.java:2023)
at app//org.apache.solr.cloud.AbstractFullDistribZkTestBase.createCollectionRetry(AbstractFullDistribZkTestBase.java:2415)
at app//org.apache.solr.cloud.TestOnReconnectListenerSupport.test(TestOnReconnectListenerSupport.java:66)
at java.base@11.0.16.1/jdk.internal.reflect.NativeMethodAccessorImpl.invoke0(Native Method)
at java.base@11.0.16.1/jdk.internal.reflect.NativeMethodAccessorImpl.invoke(NativeMethodAccessorImpl.java:62)
at java.base@11.0.16.1/jdk.internal.reflect.DelegatingMethodAccessorImpl.invoke(DelegatingMethodAccessorImpl.java:43)
at java.base@11.0.16.1/java.lang.reflect.Method.invoke(Method.java:566)
at app//com.carrotsearch.randomizedtesting.RandomizedRunner.invoke(RandomizedRunner.java:1758)
at app//com.carrotsearch.randomizedtesting.RandomizedRunner$8.evaluate(RandomizedRunner.java:946)
at app//com.carrotsearch.randomizedtesting.RandomizedRunner$9.evaluate(RandomizedRunner.java:982)
at app//com.carrotsearch.randomizedtesting.RandomizedRunner$10.evaluate(RandomizedRunner.java:996)
at app//org.apache.solr.BaseDistributedSearchTestCase$ShardsRepeatRule$ShardsFixedStatement.callStatement(BaseDistributedSearchTestCase.java:1079)
at app//org.apache.solr.BaseDistributedSearchTestCase$ShardsRepeatRule$ShardsStatement.evaluate(BaseDistributedSearchTestCase.java:1050)
at app//com.carrotsearch.randomizedtesting.rules.SystemPropertiesRestoreRule$1.evaluate(SystemPropertiesRestoreRule.java:80)
at app//org.junit.rules.RunRules.evaluate(RunRules.java:20)
at app//org.apache.lucene.tests.util.TestRuleSetupTeardownChained$1.evaluate(TestRuleSetupTeardownChained.java:48)
at app//org.apache.lucene.tests.util.AbstractBeforeAfterRule$1.evaluate(AbstractBeforeAfterRule.java:43)
at app//org.apache.lucene.tests.util.TestRuleThreadAndTestName$1.evaluate(TestRuleThreadAndTestName.java:45)
at app//org.apache.lucene.tests.util.TestRuleIgnoreAfterMaxFailures$1.evaluate(TestRuleIgnoreAfterMaxFailures.java:60)
at app//org.apache.lucene.tests.util.TestRuleMarkFailure$1.evaluate(TestRuleMarkFailure.java:44)
at app//org.junit.rules.RunRules.evaluate(RunRules.java:20)
at app//com.carrotsearch.randomizedtesting.rules.StatementAdapter.evaluate(StatementAdapter.java:36)
at app//com.carrotsearch.randomizedtesting.ThreadLeakControl$StatementRunner.run(ThreadLeakControl.java:390)
at app//com.carrotsearch.randomizedtesting.ThreadLeakControl.forkTimeoutingTask(ThreadLeakControl.java:843)
at app//com.carrotsearch.randomizedtesting.ThreadLeakControl$3.evaluate(ThreadLeakControl.java:490)
at app//com.carrotsearch.randomizedtesting.RandomizedRunner.runSingleTest(RandomizedRunner.java:955)
at app//com.carrotsearch.randomizedtesting.RandomizedRunner$5.evaluate(RandomizedRunner.java:840)
at app//com.carrotsearch.randomizedtesting.RandomizedRunner$6.evaluate(RandomizedRunner.java:891)
at app//com.carrotsearch.randomizedtesting.RandomizedRunner$7.evaluate(RandomizedRunner.java:902)
at app//com.carrotsearch.randomizedtesting.rules.StatementAdapter.evaluate(StatementAdapter.java:36)
at app//com.carrotsearch.randomizedtesting.rules.StatementAdapter.evaluate(StatementAdapter.java:36)
at app//org.apache.lucene.tests.util.AbstractBeforeAfterRule$1.evaluate(AbstractBeforeAfterRule.java:43)
at app//com.carrotsearch.randomizedtesting.rules.SystemPropertiesRestoreRule$1.evaluate(SystemPropertiesRestoreRule.java:80)
at app//org.junit.rules.RunRules.evaluate(RunRules.java:20)
at app//org.apache.lucene.tests.util.AbstractBeforeAfterRule$1.evaluate(AbstractBeforeAfterRule.java:43)
at app//com.carrotsearch.randomizedtesting.rules.StatementAdapter.evaluate(StatementAdapter.java:36)
at app//org.apache.lucene.tests.util.TestRuleStoreClassName$1.evaluate(TestRuleStoreClassName.java:38)
at app//com.carrotsearch.randomizedtesting.rules.NoShadowingOrOverridesOnMethodsRule$1.evaluate(NoShadowingOrOverridesOnMethodsRule.java:40)
at app//com.carrotsearch.randomizedtesting.rules.NoShadowingOrOverridesOnMethodsRule$1.evaluate(NoShadowingOrOverridesOnMethodsRule.java:40)
at app//com.carrotsearch.randomizedtesting.rules.StatementAdapter.evaluate(StatementAdapter.java:36)
at app//com.carrotsearch.randomizedtesting.rules.StatementAdapter.evaluate(StatementAdapter.java:36)
at app//org.apache.lucene.tests.util.TestRuleAssertionsRequired$1.evaluate(TestRuleAssertionsRequired.java:53)
at app//org.apache.lucene.tests.util.AbstractBeforeAfterRule$1.evaluate(AbstractBeforeAfterRule.java:43)
at app//org.apache.lucene.tests.util.TestRuleMarkFailure$1.evaluate(TestRuleMarkFailure.java:44)
at app//org.apache.lucene.tests.util.TestRuleIgnoreAfterMaxFailures$1.evaluate(TestRuleIgnoreAfterMaxFailures.java:60)
at app//org.apache.lucene.tests.util.TestRuleIgnoreTestSuites$1.evaluate(TestRuleIgnoreTestSuites.java:47)
at app//org.junit.rules.RunRules.evaluate(RunRules.java:20)
at app//com.carrotsearch.randomizedtesting.rules.StatementAdapter.evaluate(StatementAdapter.java:36)
at app//com.carrotsearch.randomizedtesting.ThreadLeakControl$StatementRunner.run(ThreadLeakControl.java:390)
at app//com.carrotsearch.randomizedtesting.ThreadLeakControl.lambda$forkTimeoutingTask$0(ThreadLeakControl.java:850)
at java.base@11.0.16.1/java.lang.Thread.run(Thread.java:829)
FAILED: org.apache.solr.cloud.TestStressInPlaceUpdates.stressTest
Error Message:
com.carrotsearch.randomizedtesting.UncaughtExceptionError: Captured an uncaught exception in thread: Thread[id=9492, name=WRITER1, state=RUNNABLE, group=TGRP-TestStressInPlaceUpdates]
Stack Trace:
com.carrotsearch.randomizedtesting.UncaughtExceptionError: Captured an uncaught exception in thread: Thread[id=9492, name=WRITER1, state=RUNNABLE, group=TGRP-TestStressInPlaceUpdates]
at __randomizedtesting.SeedInfo.seed([4F956CBDAAC2458:6F9F8966E479F0A2]:0)
Caused by: java.lang.RuntimeException: org.apache.solr.client.solrj.impl.BaseHttpSolrClient$RemoteSolrException: Error from server at https://127.0.0.1:39499/solr/collection1: Task queue processing has stalled for 20082 ms with 0 remaining elements to process.
at __randomizedtesting.SeedInfo.seed([4F956CBDAAC2458]:0)
at org.apache.solr.cloud.TestStressInPlaceUpdates$1.run(TestStressInPlaceUpdates.java:372)
Caused by: org.apache.solr.client.solrj.impl.BaseHttpSolrClient$RemoteSolrException: Error from server at https://127.0.0.1:39499/solr/collection1: Task queue processing has stalled for 20082 ms with 0 remaining elements to process.
at app//org.apache.solr.client.solrj.impl.HttpSolrClient.executeMethod(HttpSolrClient.java:734)
at app//org.apache.solr.client.solrj.impl.HttpSolrClient.request(HttpSolrClient.java:253)
at app//org.apache.solr.client.solrj.impl.HttpSolrClient.request(HttpSolrClient.java:234)
at app//org.apache.solr.client.solrj.SolrRequest.process(SolrRequest.java:216)
at app//org.apache.solr.client.solrj.SolrRequest.process(SolrRequest.java:231)
at app//org.apache.solr.cloud.TestStressInPlaceUpdates.deleteDocAndGetVersion(TestStressInPlaceUpdates.java:661)
at app//org.apache.solr.cloud.TestStressInPlaceUpdates$1.run(TestStressInPlaceUpdates.java:237)
FAILED: org.apache.solr.cloud.UnloadDistributedZkTest.test
Error Message:
org.apache.solr.client.solrj.impl.BaseHttpSolrClient$RemoteSolrException: Error from server at http://127.0.0.1:45823/solr: ADDREPLICA failed to create replica
Stack Trace:
org.apache.solr.client.solrj.impl.BaseHttpSolrClient$RemoteSolrException: Error from server at http://127.0.0.1:45823/solr: ADDREPLICA failed to create replica
at __randomizedtesting.SeedInfo.seed([4F956CBDAAC2458:8CAD6911745049A0]:0)
at app//org.apache.solr.client.solrj.impl.HttpSolrClient.executeMethod(HttpSolrClient.java:734)
at app//org.apache.solr.client.solrj.impl.HttpSolrClient.request(HttpSolrClient.java:253)
at app//org.apache.solr.client.solrj.impl.HttpSolrClient.request(HttpSolrClient.java:234)
at app//org.apache.solr.client.solrj.impl.LBSolrClient.doRequest(LBSolrClient.java:386)
at app//org.apache.solr.client.solrj.impl.LBSolrClient.request(LBSolrClient.java:352)
at app//org.apache.solr.client.solrj.impl.CloudSolrClient.sendRequest(CloudSolrClient.java:1136)
at app//org.apache.solr.client.solrj.impl.CloudSolrClient.requestWithRetryOnStaleState(CloudSolrClient.java:835)
at app//org.apache.solr.client.solrj.impl.CloudSolrClient.request(CloudSolrClient.java:766)
at app//org.apache.solr.client.solrj.SolrRequest.process(SolrRequest.java:216)
at app//org.apache.solr.client.solrj.SolrRequest.process(SolrRequest.java:231)
at app//org.apache.solr.cloud.AbstractUnloadDistributedZkTestBase.testCoreUnloadAndLeaders(AbstractUnloadDistributedZkTestBase.java:339)
at app//org.apache.solr.cloud.AbstractUnloadDistributedZkTestBase.test(AbstractUnloadDistributedZkTestBase.java:80)
at java.base@11.0.16.1/jdk.internal.reflect.NativeMethodAccessorImpl.invoke0(Native Method)
at java.base@11.0.16.1/jdk.internal.reflect.NativeMethodAccessorImpl.invoke(NativeMethodAccessorImpl.java:62)
at java.base@11.0.16.1/jdk.internal.reflect.DelegatingMethodAccessorImpl.invoke(DelegatingMethodAccessorImpl.java:43)
at java.base@11.0.16.1/java.lang.reflect.Method.invoke(Method.java:566)
at app//com.carrotsearch.randomizedtesting.RandomizedRunner.invoke(RandomizedRunner.java:1758)
at app//com.carrotsearch.randomizedtesting.RandomizedRunner$8.evaluate(RandomizedRunner.java:946)
at app//com.carrotsearch.randomizedtesting.RandomizedRunner$9.evaluate(RandomizedRunner.java:982)
at app//com.carrotsearch.randomizedtesting.RandomizedRunner$10.evaluate(RandomizedRunner.java:996)
at app//org.apache.solr.BaseDistributedSearchTestCase$ShardsRepeatRule$ShardsFixedStatement.callStatement(BaseDistributedSearchTestCase.java:1079)
at app//org.apache.solr.BaseDistributedSearchTestCase$ShardsRepeatRule$ShardsStatement.evaluate(BaseDistributedSearchTestCase.java:1050)
at app//com.carrotsearch.randomizedtesting.rules.SystemPropertiesRestoreRule$1.evaluate(SystemPropertiesRestoreRule.java:80)
at app//org.junit.rules.RunRules.evaluate(RunRules.java:20)
at app//org.apache.lucene.tests.util.TestRuleSetupTeardownChained$1.evaluate(TestRuleSetupTeardownChained.java:48)
at app//org.apache.lucene.tests.util.AbstractBeforeAfterRule$1.evaluate(AbstractBeforeAfterRule.java:43)
at app//org.apache.lucene.tests.util.TestRuleThreadAndTestName$1.evaluate(TestRuleThreadAndTestName.java:45)
at app//org.apache.lucene.tests.util.TestRuleIgnoreAfterMaxFailures$1.evaluate(TestRuleIgnoreAfterMaxFailures.java:60)
at app//org.apache.lucene.tests.util.TestRuleMarkFailure$1.evaluate(TestRuleMarkFailure.java:44)
at app//org.junit.rules.RunRules.evaluate(RunRules.java:20)
at app//com.carrotsearch.randomizedtesting.rules.StatementAdapter.evaluate(StatementAdapter.java:36)
at app//com.carrotsearch.randomizedtesting.ThreadLeakControl$StatementRunner.run(ThreadLeakControl.java:390)
at app//com.carrotsearch.randomizedtesting.ThreadLeakControl.forkTimeoutingTask(ThreadLeakControl.java:843)
at app//com.carrotsearch.randomizedtesting.ThreadLeakControl$3.evaluate(ThreadLeakControl.java:490)
at app//com.carrotsearch.randomizedtesting.RandomizedRunner.runSingleTest(RandomizedRunner.java:955)
at app//com.carrotsearch.randomizedtesting.RandomizedRunner$5.evaluate(RandomizedRunner.java:840)
at app//com.carrotsearch.randomizedtesting.RandomizedRunner$6.evaluate(RandomizedRunner.java:891)
at app//com.carrotsearch.randomizedtesting.RandomizedRunner$7.evaluate(RandomizedRunner.java:902)
at app//com.carrotsearch.randomizedtesting.rules.StatementAdapter.evaluate(StatementAdapter.java:36)
at app//com.carrotsearch.randomizedtesting.rules.StatementAdapter.evaluate(StatementAdapter.java:36)
at app//org.apache.lucene.tests.util.AbstractBeforeAfterRule$1.evaluate(AbstractBeforeAfterRule.java:43)
at app//com.carrotsearch.randomizedtesting.rules.SystemPropertiesRestoreRule$1.evaluate(SystemPropertiesRestoreRule.java:80)
at app//org.junit.rules.RunRules.evaluate(RunRules.java:20)
at app//org.apache.lucene.tests.util.AbstractBeforeAfterRule$1.evaluate(AbstractBeforeAfterRule.java:43)
at app//com.carrotsearch.randomizedtesting.rules.StatementAdapter.evaluate(StatementAdapter.java:36)
at app//org.apache.lucene.tests.util.TestRuleStoreClassName$1.evaluate(TestRuleStoreClassName.java:38)
at app//com.carrotsearch.randomizedtesting.rules.NoShadowingOrOverridesOnMethodsRule$1.evaluate(NoShadowingOrOverridesOnMethodsRule.java:40)
at app//com.carrotsearch.randomizedtesting.rules.NoShadowingOrOverridesOnMethodsRule$1.evaluate(NoShadowingOrOverridesOnMethodsRule.java:40)
at app//com.carrotsearch.randomizedtesting.rules.StatementAdapter.evaluate(StatementAdapter.java:36)
at app//com.carrotsearch.randomizedtesting.rules.StatementAdapter.evaluate(StatementAdapter.java:36)
at app//org.apache.lucene.tests.util.TestRuleAssertionsRequired$1.evaluate(TestRuleAssertionsRequired.java:53)
at app//org.apache.lucene.tests.util.AbstractBeforeAfterRule$1.evaluate(AbstractBeforeAfterRule.java:43)
at app//org.apache.lucene.tests.util.TestRuleMarkFailure$1.evaluate(TestRuleMarkFailure.java:44)
at app//org.apache.lucene.tests.util.TestRuleIgnoreAfterMaxFailures$1.evaluate(TestRuleIgnoreAfterMaxFailures.java:60)
at app//org.apache.lucene.tests.util.TestRuleIgnoreTestSuites$1.evaluate(TestRuleIgnoreTestSuites.java:47)
at app//org.junit.rules.RunRules.evaluate(RunRules.java:20)
at app//com.carrotsearch.randomizedtesting.rules.StatementAdapter.evaluate(StatementAdapter.java:36)
at app//com.carrotsearch.randomizedtesting.ThreadLeakControl$StatementRunner.run(ThreadLeakControl.java:390)
at app//com.carrotsearch.randomizedtesting.ThreadLeakControl.lambda$forkTimeoutingTask$0(ThreadLeakControl.java:850)
at java.base@11.0.16.1/java.lang.Thread.run(Thread.java:829)
FAILED: org.apache.solr.cloud.api.collections.CollectionsAPIAsyncDistributedZkTest.testAsyncRequests
Error Message:
java.lang.AssertionError: CreateCollection task did not complete! expected same:<COMPLETED> was not:<FAILED>
Stack Trace:
java.lang.AssertionError: CreateCollection task did not complete! expected same:<COMPLETED> was not:<FAILED>
at __randomizedtesting.SeedInfo.seed([4F956CBDAAC2458:E0BD6A7C7C046A87]:0)
at org.junit.Assert.fail(Assert.java:89)
at org.junit.Assert.failNotSame(Assert.java:829)
at org.junit.Assert.assertSame(Assert.java:772)
at org.apache.solr.cloud.api.collections.CollectionsAPIAsyncDistributedZkTest.testAsyncRequests(CollectionsAPIAsyncDistributedZkTest.java:116)
at java.base/jdk.internal.reflect.NativeMethodAccessorImpl.invoke0(Native Method)
at java.base/jdk.internal.reflect.NativeMethodAccessorImpl.invoke(NativeMethodAccessorImpl.java:62)
at java.base/jdk.internal.reflect.DelegatingMethodAccessorImpl.invoke(DelegatingMethodAccessorImpl.java:43)
at java.base/java.lang.reflect.Method.invoke(Method.java:566)
at com.carrotsearch.randomizedtesting.RandomizedRunner.invoke(RandomizedRunner.java:1758)
at com.carrotsearch.randomizedtesting.RandomizedRunner$8.evaluate(RandomizedRunner.java:946)
at com.carrotsearch.randomizedtesting.RandomizedRunner$9.evaluate(RandomizedRunner.java:982)
at com.carrotsearch.randomizedtesting.RandomizedRunner$10.evaluate(RandomizedRunner.java:996)
at com.carrotsearch.randomizedtesting.rules.SystemPropertiesRestoreRule$1.evaluate(SystemPropertiesRestoreRule.java:80)
at org.junit.rules.RunRules.evaluate(RunRules.java:20)
at org.apache.lucene.tests.util.TestRuleSetupTeardownChained$1.evaluate(TestRuleSetupTeardownChained.java:48)
at org.apache.lucene.tests.util.AbstractBeforeAfterRule$1.evaluate(AbstractBeforeAfterRule.java:43)
at org.apache.lucene.tests.util.TestRuleThreadAndTestName$1.evaluate(TestRuleThreadAndTestName.java:45)
at org.apache.lucene.tests.util.TestRuleIgnoreAfterMaxFailures$1.evaluate(TestRuleIgnoreAfterMaxFailures.java:60)
at org.apache.lucene.tests.util.TestRuleMarkFailure$1.evaluate(TestRuleMarkFailure.java:44)
at org.junit.rules.RunRules.evaluate(RunRules.java:20)
at com.carrotsearch.randomizedtesting.rules.StatementAdapter.evaluate(StatementAdapter.java:36)
at com.carrotsearch.randomizedtesting.ThreadLeakControl$StatementRunner.run(ThreadLeakControl.java:390)
at com.carrotsearch.randomizedtesting.ThreadLeakControl.forkTimeoutingTask(ThreadLeakControl.java:843)
at com.carrotsearch.randomizedtesting.ThreadLeakControl$3.evaluate(ThreadLeakControl.java:490)
at com.carrotsearch.randomizedtesting.RandomizedRunner.runSingleTest(RandomizedRunner.java:955)
at com.carrotsearch.randomizedtesting.RandomizedRunner$5.evaluate(RandomizedRunner.java:840)
at com.carrotsearch.randomizedtesting.RandomizedRunner$6.evaluate(RandomizedRunner.java:891)
at com.carrotsearch.randomizedtesting.RandomizedRunner$7.evaluate(RandomizedRunner.java:902)
at com.carrotsearch.randomizedtesting.rules.StatementAdapter.evaluate(StatementAdapter.java:36)
at com.carrotsearch.randomizedtesting.rules.StatementAdapter.evaluate(StatementAdapter.java:36)
at org.apache.lucene.tests.util.AbstractBeforeAfterRule$1.evaluate(AbstractBeforeAfterRule.java:43)
at com.carrotsearch.randomizedtesting.rules.SystemPropertiesRestoreRule$1.evaluate(SystemPropertiesRestoreRule.java:80)
at org.junit.rules.RunRules.evaluate(RunRules.java:20)
at org.apache.lucene.tests.util.AbstractBeforeAfterRule$1.evaluate(AbstractBeforeAfterRule.java:43)
at com.carrotsearch.randomizedtesting.rules.StatementAdapter.evaluate(StatementAdapter.java:36)
at org.apache.lucene.tests.util.TestRuleStoreClassName$1.evaluate(TestRuleStoreClassName.java:38)
at com.carrotsearch.randomizedtesting.rules.NoShadowingOrOverridesOnMethodsRule$1.evaluate(NoShadowingOrOverridesOnMethodsRule.java:40)
at com.carrotsearch.randomizedtesting.rules.NoShadowingOrOverridesOnMethodsRule$1.evaluate(NoShadowingOrOverridesOnMethodsRule.java:40)
at com.carrotsearch.randomizedtesting.rules.StatementAdapter.evaluate(StatementAdapter.java:36)
at com.carrotsearch.randomizedtesting.rules.StatementAdapter.evaluate(StatementAdapter.java:36)
at org.apache.lucene.tests.util.TestRuleAssertionsRequired$1.evaluate(TestRuleAssertionsRequired.java:53)
at org.apache.lucene.tests.util.AbstractBeforeAfterRule$1.evaluate(AbstractBeforeAfterRule.java:43)
at org.apache.lucene.tests.util.TestRuleMarkFailure$1.evaluate(TestRuleMarkFailure.java:44)
at org.apache.lucene.tests.util.TestRuleIgnoreAfterMaxFailures$1.evaluate(TestRuleIgnoreAfterMaxFailures.java:60)
at org.apache.lucene.tests.util.TestRuleIgnoreTestSuites$1.evaluate(TestRuleIgnoreTestSuites.java:47)
at org.junit.rules.RunRules.evaluate(RunRules.java:20)
at com.carrotsearch.randomizedtesting.rules.StatementAdapter.evaluate(StatementAdapter.java:36)
at com.carrotsearch.randomizedtesting.ThreadLeakControl$StatementRunner.run(ThreadLeakControl.java:390)
at com.carrotsearch.randomizedtesting.ThreadLeakControl.lambda$forkTimeoutingTask$0(ThreadLeakControl.java:850)
at java.base/java.lang.Thread.run(Thread.java:829)
FAILED: org.apache.solr.cloud.api.collections.CollectionsAPIDistributedZkTest.deletePartiallyCreatedCollection
Error Message:
org.apache.solr.client.solrj.impl.BaseHttpSolrClient$RemoteSolrException: Error from server at http://127.0.0.1:44843/solr: Underlying core creation failed while creating collection: halfdeletedcollection
Stack Trace:
org.apache.solr.client.solrj.impl.BaseHttpSolrClient$RemoteSolrException: Error from server at http://127.0.0.1:44843/solr: Underlying core creation failed while creating collection: halfdeletedcollection
at __randomizedtesting.SeedInfo.seed([4F956CBDAAC2458:2E793A2E6D760490]:0)
at app//org.apache.solr.client.solrj.impl.HttpSolrClient.executeMethod(HttpSolrClient.java:734)
at app//org.apache.solr.client.solrj.impl.HttpSolrClient.request(HttpSolrClient.java:253)
at app//org.apache.solr.client.solrj.impl.HttpSolrClient.request(HttpSolrClient.java:234)
at app//org.apache.solr.client.solrj.impl.LBSolrClient.doRequest(LBSolrClient.java:386)
at app//org.apache.solr.client.solrj.impl.LBSolrClient.request(LBSolrClient.java:352)
at app//org.apache.solr.client.solrj.impl.CloudSolrClient.sendRequest(CloudSolrClient.java:1136)
at app//org.apache.solr.client.solrj.impl.CloudSolrClient.requestWithRetryOnStaleState(CloudSolrClient.java:835)
at app//org.apache.solr.client.solrj.impl.CloudSolrClient.request(CloudSolrClient.java:766)
at app//org.apache.solr.client.solrj.SolrRequest.process(SolrRequest.java:216)
at app//org.apache.solr.client.solrj.SolrRequest.process(SolrRequest.java:231)
at app//org.apache.solr.cloud.api.collections.AbstractCollectionsAPIDistributedZkTestBase.deletePartiallyCreatedCollection(AbstractCollectionsAPIDistributedZkTestBase.java:165)
at java.base@11.0.16.1/jdk.internal.reflect.NativeMethodAccessorImpl.invoke0(Native Method)
at java.base@11.0.16.1/jdk.internal.reflect.NativeMethodAccessorImpl.invoke(NativeMethodAccessorImpl.java:62)
at java.base@11.0.16.1/jdk.internal.reflect.DelegatingMethodAccessorImpl.invoke(DelegatingMethodAccessorImpl.java:43)
at java.base@11.0.16.1/java.lang.reflect.Method.invoke(Method.java:566)
at app//com.carrotsearch.randomizedtesting.RandomizedRunner.invoke(RandomizedRunner.java:1758)
at app//com.carrotsearch.randomizedtesting.RandomizedRunner$8.evaluate(RandomizedRunner.java:946)
at app//com.carrotsearch.randomizedtesting.RandomizedRunner$9.evaluate(RandomizedRunner.java:982)
at app//com.carrotsearch.randomizedtesting.RandomizedRunner$10.evaluate(RandomizedRunner.java:996)
at app//com.carrotsearch.randomizedtesting.rules.SystemPropertiesRestoreRule$1.evaluate(SystemPropertiesRestoreRule.java:80)
at app//org.junit.rules.RunRules.evaluate(RunRules.java:20)
at app//org.apache.lucene.tests.util.TestRuleSetupTeardownChained$1.evaluate(TestRuleSetupTeardownChained.java:48)
at app//org.apache.lucene.tests.util.AbstractBeforeAfterRule$1.evaluate(AbstractBeforeAfterRule.java:43)
at app//org.apache.lucene.tests.util.TestRuleThreadAndTestName$1.evaluate(TestRuleThreadAndTestName.java:45)
at app//org.apache.lucene.tests.util.TestRuleIgnoreAfterMaxFailures$1.evaluate(TestRuleIgnoreAfterMaxFailures.java:60)
at app//org.apache.lucene.tests.util.TestRuleMarkFailure$1.evaluate(TestRuleMarkFailure.java:44)
at app//org.junit.rules.RunRules.evaluate(RunRules.java:20)
at app//com.carrotsearch.randomizedtesting.rules.StatementAdapter.evaluate(StatementAdapter.java:36)
at app//com.carrotsearch.randomizedtesting.ThreadLeakControl$StatementRunner.run(ThreadLeakControl.java:390)
at app//com.carrotsearch.randomizedtesting.ThreadLeakControl.forkTimeoutingTask(ThreadLeakControl.java:843)
at app//com.carrotsearch.randomizedtesting.ThreadLeakControl$3.evaluate(ThreadLeakControl.java:490)
at app//com.carrotsearch.randomizedtesting.RandomizedRunner.runSingleTest(RandomizedRunner.java:955)
at app//com.carrotsearch.randomizedtesting.RandomizedRunner$5.evaluate(RandomizedRunner.java:840)
at app//com.carrotsearch.randomizedtesting.RandomizedRunner$6.evaluate(RandomizedRunner.java:891)
at app//com.carrotsearch.randomizedtesting.RandomizedRunner$7.evaluate(RandomizedRunner.java:902)
at app//com.carrotsearch.randomizedtesting.rules.StatementAdapter.evaluate(StatementAdapter.java:36)
at app//com.carrotsearch.randomizedtesting.rules.StatementAdapter.evaluate(StatementAdapter.java:36)
at app//org.apache.lucene.tests.util.AbstractBeforeAfterRule$1.evaluate(AbstractBeforeAfterRule.java:43)
at app//com.carrotsearch.randomizedtesting.rules.SystemPropertiesRestoreRule$1.evaluate(SystemPropertiesRestoreRule.java:80)
at app//org.junit.rules.RunRules.evaluate(RunRules.java:20)
at app//org.apache.lucene.tests.util.AbstractBeforeAfterRule$1.evaluate(AbstractBeforeAfterRule.java:43)
at app//com.carrotsearch.randomizedtesting.rules.StatementAdapter.evaluate(StatementAdapter.java:36)
at app//org.apache.lucene.tests.util.TestRuleStoreClassName$1.evaluate(TestRuleStoreClassName.java:38)
at app//com.carrotsearch.randomizedtesting.rules.NoShadowingOrOverridesOnMethodsRule$1.evaluate(NoShadowingOrOverridesOnMethodsRule.java:40)
at app//com.carrotsearch.randomizedtesting.rules.NoShadowingOrOverridesOnMethodsRule$1.evaluate(NoShadowingOrOverridesOnMethodsRule.java:40)
at app//com.carrotsearch.randomizedtesting.rules.StatementAdapter.evaluate(StatementAdapter.java:36)
at app//com.carrotsearch.randomizedtesting.rules.StatementAdapter.evaluate(StatementAdapter.java:36)
at app//org.apache.lucene.tests.util.TestRuleAssertionsRequired$1.evaluate(TestRuleAssertionsRequired.java:53)
at app//org.apache.lucene.tests.util.AbstractBeforeAfterRule$1.evaluate(AbstractBeforeAfterRule.java:43)
at app//org.apache.lucene.tests.util.TestRuleMarkFailure$1.evaluate(TestRuleMarkFailure.java:44)
at app//org.apache.lucene.tests.util.TestRuleIgnoreAfterMaxFailures$1.evaluate(TestRuleIgnoreAfterMaxFailures.java:60)
at app//org.apache.lucene.tests.util.TestRuleIgnoreTestSuites$1.evaluate(TestRuleIgnoreTestSuites.java:47)
at app//org.junit.rules.RunRules.evaluate(RunRules.java:20)
at app//com.carrotsearch.randomizedtesting.rules.StatementAdapter.evaluate(StatementAdapter.java:36)
at app//com.carrotsearch.randomizedtesting.ThreadLeakControl$StatementRunner.run(ThreadLeakControl.java:390)
at app//com.carrotsearch.randomizedtesting.ThreadLeakControl.lambda$forkTimeoutingTask$0(ThreadLeakControl.java:850)
at java.base@11.0.16.1/java.lang.Thread.run(Thread.java:829)
FAILED: org.apache.solr.cloud.api.collections.CollectionsAPIDistributedZkTest.testCollectionsAPI
Error Message:
java.lang.RuntimeException: Failed while waiting for active collection
Timeout waiting to see state for collection=awhollynewcollection_0 :DocCollection(awhollynewcollection_0//collections/awhollynewcollection_0/state.json/15 )={
"pullReplicas":"0",
"configName":"conf2",
"replicationFactor":4,
"router":{"name":"compositeId"},
"nrtReplicas":4,
"tlogReplicas":"0",
"shards":{
"shard1":{
"range":"80000000-b332ffff",
"state":"active",
"replicas":{
"core_node3":{
"core":"awhollynewcollection_0_shard1_replica_n1",
"node_name":"127.0.0.1:41221_solr",
"type":"NRT",
"state":"down",
"force_set_state":"false",
"base_url":"http://127.0.0.1:41221/solr"},
"core_node6":{
"core":"awhollynewcollection_0_shard1_replica_n5",
"node_name":"127.0.0.1:32873_solr",
"type":"NRT",
"state":"down",
"force_set_state":"false",
"base_url":"http://127.0.0.1:32873/solr"},
"core_node25":{
"core":"awhollynewcollection_0_shard1_replica_n22",
"node_name":"127.0.0.1:44215_solr",
"type":"NRT",
"state":"down",
"force_set_state":"false",
"base_url":"http://127.0.0.1:44215/solr"},
"core_node38":{
"core":"awhollynewcollection_0_shard1_replica_n34",
"node_name":"127.0.0.1:44843_solr",
"type":"NRT",
"state":"down",
"force_set_state":"false",
"base_url":"http://127.0.0.1:44843/solr"}}},
"shard2":{
"range":"b3330000-e665ffff",
"state":"active",
"replicas":{
"core_node21":{
"core":"awhollynewcollection_0_shard2_replica_n18",
"node_name":"127.0.0.1:44843_solr",
"type":"NRT",
"state":"down",
"force_set_state":"false",
"base_url":"http://127.0.0.1:44843/solr"},
"core_node26":{
"core":"awhollynewcollection_0_shard2_replica_n24",
"node_name":"127.0.0.1:32873_solr",
"type":"NRT",
"state":"down",
"force_set_state":"false",
"base_url":"http://127.0.0.1:32873/solr"},
"core_node31":{
"core":"awhollynewcollection_0_shard2_replica_n28",
"node_name":"127.0.0.1:44215_solr",
"type":"NRT",
"state":"down",
"force_set_state":"false",
"base_url":"http://127.0.0.1:44215/solr"},
"core_node32":{
"core":"awhollynewcollection_0_shard2_replica_n30",
"node_name":"127.0.0.1:41221_solr",
"type":"NRT",
"state":"down",
"force_set_state":"false",
"base_url":"http://127.0.0.1:41221/solr"}}},
"shard3":{
"range":"e6660000-1998ffff",
"state":"active",
"replicas":{
"core_node11":{
"core":"awhollynewcollection_0_shard3_replica_n9",
"node_name":"127.0.0.1:44215_solr",
"type":"NRT",
"state":"down",
"force_set_state":"false",
"base_url":"http://127.0.0.1:44215/solr"},
"core_node14":{
"core":"awhollynewcollection_0_shard3_replica_n12",
"node_name":"127.0.0.1:41221_solr",
"type":"NRT",
"state":"down",
"force_set_state":"false",
"base_url":"http://127.0.0.1:41221/solr"},
"core_node29":{
"core":"awhollynewcollection_0_shard3_replica_n27",
"node_name":"127.0.0.1:44843_solr",
"type":"NRT",
"state":"down",
"force_set_state":"false",
"base_url":"http://127.0.0.1:44843/solr"},
"core_node39":{
"core":"awhollynewcollection_0_shard3_replica_n36",
"node_name":"127.0.0.1:32873_solr",
"type":"NRT",
"state":"down",
"force_set_state":"false",
"base_url":"http://127.0.0.1:32873/solr"}}},
"shard4":{
"range":"19990000-4ccbffff",
"state":"active",
"replicas":{
"core_node13":{
"core":"awhollynewcollection_0_shard4_replica_n10",
"node_name":"127.0.0.1:44843_solr",
"type":"NRT",
"state":"down",
"force_set_state":"false",
"base_url":"http://127.0.0.1:44843/solr"},
"core_node23":{
"core":"awhollynewcollection_0_shard4_replica_n20",
"node_name":"127.0.0.1:44215_solr",
"type":"NRT",
"state":"down",
"force_set_state":"false",
"base_url":"http://127.0.0.1:44215/solr"},
"core_node35":{
"core":"awhollynewcollection_0_shard4_replica_n33",
"node_name":"127.0.0.1:41221_solr",
"type":"NRT",
"state":"down",
"force_set_state":"false",
"base_url":"http://127.0.0.1:41221/solr"},
"core_node40":{
"core":"awhollynewcollection_0_shard4_replica_n37",
"node_name":"127.0.0.1:32873_solr",
"type":"NRT",
"state":"down",
"force_set_state":"false",
"base_url":"http://127.0.0.1:32873/solr"}}},
"shard5":{
"range":"4ccc0000-7fffffff",
"state":"active",
"replicas":{
"core_node4":{
"core":"awhollynewcollection_0_shard5_replica_n2",
"node_name":"127.0.0.1:32873_solr",
"type":"NRT",
"state":"down",
"force_set_state":"false",
"base_url":"http://127.0.0.1:32873/solr"},
"core_node8":{
"core":"awhollynewcollection_0_shard5_replica_n7",
"node_name":"127.0.0.1:44215_solr",
"type":"NRT",
"state":"down",
"force_set_state":"false",
"base_url":"http://127.0.0.1:44215/solr"},
"core_node16":{
"core":"awhollynewcollection_0_shard5_replica_n15",
"node_name":"127.0.0.1:41221_solr",
"type":"NRT",
"state":"down",
"force_set_state":"false",
[...truncated too long message...]
loud.UnloadDistributedZkTest.test (:solr:core)
Test output: /home/jenkins/jenkins-home/712657a4/workspace/Solr/Solr-Check-main-s390x/solr/core/build/test-results/test/outputs/OUTPUT-org.apache.solr.cloud.UnloadDistributedZkTest.txt
Reproduce with: gradlew :solr:core:test --tests "org.apache.solr.cloud.UnloadDistributedZkTest.test" -Ptests.jvms=4 -Ptests.haltonfailure=false "-Ptests.jvmargs=-XX:TieredStopAtLevel=1 -XX:+UseParallelGC -XX:ActiveProcessorCount=1 -XX:ReservedCodeCacheSize=120m" -Ptests.seed=4F956CBDAAC2458 -Ptests.multiplier=2 -Ptests.badapples=false -Ptests.file.encoding=US-ASCII
- org.apache.solr.handler.admin.HealthCheckHandlerTest.testHealthCheckHandler (:solr:core)
Test output: /home/jenkins/jenkins-home/712657a4/workspace/Solr/Solr-Check-main-s390x/solr/core/build/test-results/test/outputs/OUTPUT-org.apache.solr.handler.admin.HealthCheckHandlerTest.txt
Reproduce with: gradlew :solr:core:test --tests "org.apache.solr.handler.admin.HealthCheckHandlerTest.testHealthCheckHandler" -Ptests.jvms=4 -Ptests.haltonfailure=false "-Ptests.jvmargs=-XX:TieredStopAtLevel=1 -XX:+UseParallelGC -XX:ActiveProcessorCount=1 -XX:ReservedCodeCacheSize=120m" -Ptests.seed=4F956CBDAAC2458 -Ptests.multiplier=2 -Ptests.badapples=false -Ptests.file.encoding=US-ASCII
- org.apache.solr.cloud.api.collections.CollectionsAPIAsyncDistributedZkTest.testAsyncRequests (:solr:core)
Test output: /home/jenkins/jenkins-home/712657a4/workspace/Solr/Solr-Check-main-s390x/solr/core/build/test-results/test/outputs/OUTPUT-org.apache.solr.cloud.api.collections.CollectionsAPIAsyncDistributedZkTest.txt
Reproduce with: gradlew :solr:core:test --tests "org.apache.solr.cloud.api.collections.CollectionsAPIAsyncDistributedZkTest.testAsyncRequests" -Ptests.jvms=4 -Ptests.haltonfailure=false "-Ptests.jvmargs=-XX:TieredStopAtLevel=1 -XX:+UseParallelGC -XX:ActiveProcessorCount=1 -XX:ReservedCodeCacheSize=120m" -Ptests.seed=4F956CBDAAC2458 -Ptests.multiplier=2 -Ptests.badapples=false -Ptests.file.encoding=US-ASCII
- org.apache.solr.search.join.ShardJoinImplicitTest.classMethod (:solr:core)
Test output: /home/jenkins/jenkins-home/712657a4/workspace/Solr/Solr-Check-main-s390x/solr/core/build/test-results/test/outputs/OUTPUT-org.apache.solr.search.join.ShardJoinImplicitTest.txt
Reproduce with: gradlew :solr:core:test --tests "org.apache.solr.search.join.ShardJoinImplicitTest.classMethod" -Ptests.jvms=4 -Ptests.haltonfailure=false "-Ptests.jvmargs=-XX:TieredStopAtLevel=1 -XX:+UseParallelGC -XX:ActiveProcessorCount=1 -XX:ReservedCodeCacheSize=120m" -Ptests.seed=4F956CBDAAC2458 -Ptests.multiplier=2 -Ptests.badapples=false -Ptests.file.encoding=US-ASCII
- org.apache.solr.schema.TestManagedSchemaWithMultipleAdd.test (:solr:core)
Test output: /home/jenkins/jenkins-home/712657a4/workspace/Solr/Solr-Check-main-s390x/solr/core/build/test-results/test/outputs/OUTPUT-org.apache.solr.schema.TestManagedSchemaWithMultipleAdd.txt
Reproduce with: gradlew :solr:core:test --tests "org.apache.solr.schema.TestManagedSchemaWithMultipleAdd.test" -Ptests.jvms=4 -Ptests.haltonfailure=false "-Ptests.jvmargs=-XX:TieredStopAtLevel=1 -XX:+UseParallelGC -XX:ActiveProcessorCount=1 -XX:ReservedCodeCacheSize=120m" -Ptests.seed=4F956CBDAAC2458 -Ptests.multiplier=2 -Ptests.badapples=false -Ptests.file.encoding=US-ASCII
Deprecated Gradle features were used in this build, making it incompatible with Gradle 9.0.
You can use '--warning-mode all' to show the individual deprecation warnings and determine if they come from your own scripts or plugins.
For more on this, please refer to https://docs.gradle.org/8.4/userguide/command_line_interface.html#sec:command_line_warnings in the Gradle documentation.
BUILD SUCCESSFUL in 4h 53m 18s
584 actionable tasks: 584 executed
Publishing build scan...
https://ge.apache.org/s/4td4ommmvzq6i
Build step 'Invoke Gradle script' changed build result to SUCCESS
Archiving artifacts
hudson.FilePath$ValidateAntFileMask$1Cancel
at hudson.FilePath$ValidateAntFileMask$1.isCaseSensitive(FilePath.java:3300)
at org.apache.tools.ant.DirectoryScanner.lambda$isIncluded$3(DirectoryScanner.java:1374)
at java.base/java.util.stream.MatchOps$1MatchSink.accept(MatchOps.java:90)
at java.base/java.util.Spliterators$ArraySpliterator.tryAdvance(Spliterators.java:958)
at java.base/java.util.stream.ReferencePipeline.forEachWithCancel(ReferencePipeline.java:127)
at java.base/java.util.stream.AbstractPipeline.copyIntoWithCancel(AbstractPipeline.java:502)
at java.base/java.util.stream.AbstractPipeline.copyInto(AbstractPipeline.java:488)
at java.base/java.util.stream.AbstractPipeline.wrapAndCopyInto(AbstractPipeline.java:474)
at java.base/java.util.stream.MatchOps$MatchOp.evaluateSequential(MatchOps.java:230)
at java.base/java.util.stream.MatchOps$MatchOp.evaluateSequential(MatchOps.java:196)
at java.base/java.util.stream.AbstractPipeline.evaluate(AbstractPipeline.java:234)
at java.base/java.util.stream.ReferencePipeline.anyMatch(ReferencePipeline.java:528)
at org.apache.tools.ant.DirectoryScanner.isIncluded(DirectoryScanner.java:1374)
at org.apache.tools.ant.DirectoryScanner.scandir(DirectoryScanner.java:1260)
at org.apache.tools.ant.DirectoryScanner.scandir(DirectoryScanner.java:1267)
at org.apache.tools.ant.DirectoryScanner.scandir(DirectoryScanner.java:1267)
at org.apache.tools.ant.DirectoryScanner.scandir(DirectoryScanner.java:1267)
at org.apache.tools.ant.DirectoryScanner.scandir(DirectoryScanner.java:1267)
at org.apache.tools.ant.DirectoryScanner.scandir(DirectoryScanner.java:1267)
at org.apache.tools.ant.DirectoryScanner.scandir(DirectoryScanner.java:1267)
at org.apache.tools.ant.DirectoryScanner.scandir(DirectoryScanner.java:1267)
at org.apache.tools.ant.DirectoryScanner.scandir(DirectoryScanner.java:1267)
at org.apache.tools.ant.DirectoryScanner.scandir(DirectoryScanner.java:1267)
at org.apache.tools.ant.DirectoryScanner.scandir(DirectoryScanner.java:1194)
at org.apache.tools.ant.DirectoryScanner.scandir(DirectoryScanner.java:1156)
at org.apache.tools.ant.DirectoryScanner.checkIncludePatterns(DirectoryScanner.java:954)
at org.apache.tools.ant.DirectoryScanner.scan(DirectoryScanner.java:912)
at hudson.FilePath$ValidateAntFileMask.hasMatch(FilePath.java:3313)
Caused: hudson.FilePath$FileMaskNoMatchesFoundException: no matches found within 10000
at hudson.FilePath$ValidateAntFileMask.hasMatch(FilePath.java:3318)
at hudson.FilePath$ValidateAntFileMask.invoke(FilePath.java:3196)
at hudson.FilePath$ValidateAntFileMask.invoke(FilePath.java:3174)
at hudson.FilePath$FileCallableWrapper.call(FilePath.java:3578)
Also: hudson.remoting.Channel$CallSiteStackTrace: Remote call to jenkins-s390x-1
at hudson.remoting.Channel.attachCallSiteStackTrace(Channel.java:1784)
at hudson.remoting.UserRequest$ExceptionResponse.retrieve(UserRequest.java:356)
at hudson.remoting.Channel.call(Channel.java:1000)
at hudson.FilePath.act(FilePath.java:1192)
at hudson.FilePath.act(FilePath.java:1181)
at hudson.FilePath.validateAntFileMask(FilePath.java:3171)
at hudson.tasks.ArtifactArchiver.perform(ArtifactArchiver.java:271)
at hudson.tasks.BuildStepCompatibilityLayer.perform(BuildStepCompatibilityLayer.java:80)
at hudson.tasks.BuildStepMonitor$1.perform(BuildStepMonitor.java:20)
at hudson.model.AbstractBuild$AbstractBuildExecution.perform(AbstractBuild.java:818)
at hudson.model.AbstractBuild$AbstractBuildExecution.performAllBuildSteps(AbstractBuild.java:767)
at hudson.model.Build$BuildExecution.post2(Build.java:179)
at hudson.model.AbstractBuild$AbstractBuildExecution.post(AbstractBuild.java:711)
at hudson.model.Run.execute(Run.java:1925)
at hudson.model.FreeStyleBuild.run(FreeStyleBuild.java:44)
at hudson.model.ResourceController.execute(ResourceController.java:101)
at hudson.model.Executor.run(Executor.java:442)
Caused: hudson.FilePath$TunneledInterruptedException
at hudson.FilePath$FileCallableWrapper.call(FilePath.java:3580)
at hudson.remoting.UserRequest.perform(UserRequest.java:211)
at hudson.remoting.UserRequest.perform(UserRequest.java:54)
at hudson.remoting.Request$2.run(Request.java:377)
at hudson.remoting.InterceptingExecutorService.lambda$wrap$0(InterceptingExecutorService.java:78)
at java.base/java.util.concurrent.FutureTask.run(FutureTask.java:264)
at java.base/java.util.concurrent.ThreadPoolExecutor.runWorker(ThreadPoolExecutor.java:1128)
at java.base/java.util.concurrent.ThreadPoolExecutor$Worker.run(ThreadPoolExecutor.java:628)
at java.base/java.lang.Thread.run(Thread.java:829)
Caused: java.lang.InterruptedException: hudson.FilePath$FileMaskNoMatchesFoundException: no matches found within 10000
at hudson.FilePath.act(FilePath.java:1194)
at hudson.FilePath.act(FilePath.java:1181)
at hudson.FilePath.validateAntFileMask(FilePath.java:3171)
at hudson.tasks.ArtifactArchiver.perform(ArtifactArchiver.java:271)
at hudson.tasks.BuildStepCompatibilityLayer.perform(BuildStepCompatibilityLayer.java:80)
at hudson.tasks.BuildStepMonitor$1.perform(BuildStepMonitor.java:20)
at hudson.model.AbstractBuild$AbstractBuildExecution.perform(AbstractBuild.java:818)
at hudson.model.AbstractBuild$AbstractBuildExecution.performAllBuildSteps(AbstractBuild.java:767)
at hudson.model.Build$BuildExecution.post2(Build.java:179)
at hudson.model.AbstractBuild$AbstractBuildExecution.post(AbstractBuild.java:711)
at hudson.model.Run.execute(Run.java:1925)
at hudson.model.FreeStyleBuild.run(FreeStyleBuild.java:44)
at hudson.model.ResourceController.execute(ResourceController.java:101)
at hudson.model.Executor.run(Executor.java:442)
No artifacts found that match the file pattern "**/*.events,heapdumps/**,**/hs_err_pid*". Configuration error?
Recording test results
[Checks API] No suitable checks publisher found.
Build step 'Publish JUnit test result report' changed build result to UNSTABLE
Email was triggered for: Unstable (Test Failures)
Sending email for trigger: Unstable (Test Failures)