You are viewing a plain text version of this content. The canonical link for it is here.
Posted to mapreduce-dev@hadoop.apache.org by Apache Jenkins Server <je...@builds.apache.org> on 2015/11/25 10:56:46 UTC
Hadoop-Mapreduce-trunk - Build # 2663 - Still Failing
See https://builds.apache.org/job/Hadoop-Mapreduce-trunk/2663/
###################################################################################
########################## LAST 60 LINES OF THE CONSOLE ###########################
[...truncated 32303 lines...]
Running org.apache.hadoop.mapred.TestTaskAttemptListenerImpl
Tests run: 6, Failures: 0, Errors: 0, Skipped: 0, Time elapsed: 2.154 sec - in org.apache.hadoop.mapred.TestTaskAttemptListenerImpl
Running org.apache.hadoop.mapred.TestLocalContainerLauncher
Tests run: 2, Failures: 0, Errors: 0, Skipped: 0, Time elapsed: 3.317 sec - in org.apache.hadoop.mapred.TestLocalContainerLauncher
Running org.apache.hadoop.mapred.TestTaskAttemptFinishingMonitor
Tests run: 1, Failures: 0, Errors: 0, Skipped: 0, Time elapsed: 2.747 sec - in org.apache.hadoop.mapred.TestTaskAttemptFinishingMonitor
Results :
Failed tests:
TestJobImpl.testUnusableNodeTransition:629->assertJobState:1012 expected:<SUCCEEDED> but was:<ERROR>
TestMRAppMaster.testMRAppMasterMidLock:174 null
Tests in error:
TestMRAppMaster.testMRAppMasterSuccessLock:254 » YarnRuntime java.io.FileNotFo...
Tests run: 340, Failures: 2, Errors: 1, Skipped: 0
[INFO] ------------------------------------------------------------------------
[INFO] Reactor Summary:
[INFO]
[INFO] Apache Hadoop MapReduce Client .................... SUCCESS [ 4.494 s]
[INFO] Apache Hadoop MapReduce Core ...................... SUCCESS [02:30 min]
[INFO] Apache Hadoop MapReduce Common .................... SUCCESS [ 41.982 s]
[INFO] Apache Hadoop MapReduce Shuffle ................... SUCCESS [ 8.566 s]
[INFO] Apache Hadoop MapReduce App ....................... FAILURE [11:51 min]
[INFO] Apache Hadoop MapReduce HistoryServer ............. SKIPPED
[INFO] Apache Hadoop MapReduce JobClient ................. SKIPPED
[INFO] Apache Hadoop MapReduce HistoryServer Plugins ..... SKIPPED
[INFO] Apache Hadoop MapReduce NativeTask ................ SKIPPED
[INFO] Apache Hadoop MapReduce Examples .................. SKIPPED
[INFO] Apache Hadoop MapReduce ........................... SKIPPED
[INFO] ------------------------------------------------------------------------
[INFO] BUILD FAILURE
[INFO] ------------------------------------------------------------------------
[INFO] Total time: 15:18 min
[INFO] Finished at: 2015-11-25T09:56:34+00:00
[INFO] Final Memory: 41M/825M
[INFO] ------------------------------------------------------------------------
[ERROR] Failed to execute goal org.apache.maven.plugins:maven-surefire-plugin:2.17:test (default-test) on project hadoop-mapreduce-client-app: There are test failures.
[ERROR]
[ERROR] Please refer to /home/jenkins/jenkins-slave/workspace/Hadoop-Mapreduce-trunk/hadoop-mapreduce-project/hadoop-mapreduce-client/hadoop-mapreduce-client-app/target/surefire-reports for the individual test results.
[ERROR] -> [Help 1]
[ERROR]
[ERROR] To see the full stack trace of the errors, re-run Maven with the -e switch.
[ERROR] Re-run Maven using the -X switch to enable full debug logging.
[ERROR]
[ERROR] For more information about the errors and possible solutions, please read the following articles:
[ERROR] [Help 1] http://cwiki.apache.org/confluence/display/MAVEN/MojoFailureException
[ERROR]
[ERROR] After correcting the problems, you can resume the build with the command
[ERROR] mvn <goals> -rf :hadoop-mapreduce-client-app
Build step 'Execute shell' marked build as failure
[FINDBUGS] Skipping publisher since build result is FAILURE
Archiving artifacts
Recording test results
Updating MAPREDUCE-6553
Email was triggered for: Failure - Any
Sending email for trigger: Failure - Any
###################################################################################
############################## FAILED TESTS (if any) ##############################
3 tests failed.
FAILED: org.apache.hadoop.mapreduce.v2.app.job.impl.TestJobImpl.testUnusableNodeTransition
Error Message:
expected:<SUCCEEDED> but was:<ERROR>
Stack Trace:
java.lang.AssertionError: expected:<SUCCEEDED> but was:<ERROR>
at org.junit.Assert.fail(Assert.java:88)
at org.junit.Assert.failNotEquals(Assert.java:743)
at org.junit.Assert.assertEquals(Assert.java:118)
at org.junit.Assert.assertEquals(Assert.java:144)
at org.apache.hadoop.mapreduce.v2.app.job.impl.TestJobImpl.assertJobState(TestJobImpl.java:1012)
at org.apache.hadoop.mapreduce.v2.app.job.impl.TestJobImpl.testUnusableNodeTransition(TestJobImpl.java:629)
FAILED: org.apache.hadoop.mapreduce.v2.app.TestMRAppMaster.testMRAppMasterSuccessLock
Error Message:
java.io.FileNotFoundException: File file:/home/jenkins/jenkins-slave/workspace/Hadoop-Mapreduce-trunk/hadoop-mapreduce-project/hadoop-mapreduce-client/hadoop-mapreduce-client-app/staging/history/done_intermediate/TestAppMasterUser/job_1317529182569_0004-1448445028061-TestAppMasterUser-%3Cmissing+job+name%3E-1448445028276-0-0-SUCCEEDED-default-1448445028061.jhist_tmp does not exist
Stack Trace:
org.apache.hadoop.yarn.exceptions.YarnRuntimeException: java.io.FileNotFoundException: File file:/home/jenkins/jenkins-slave/workspace/Hadoop-Mapreduce-trunk/hadoop-mapreduce-project/hadoop-mapreduce-client/hadoop-mapreduce-client-app/staging/history/done_intermediate/TestAppMasterUser/job_1317529182569_0004-1448445028061-TestAppMasterUser-%3Cmissing+job+name%3E-1448445028276-0-0-SUCCEEDED-default-1448445028061.jhist_tmp does not exist
at org.apache.hadoop.fs.RawLocalFileSystem.deprecatedGetFileStatus(RawLocalFileSystem.java:640)
at org.apache.hadoop.fs.RawLocalFileSystem.getFileLinkStatusInternal(RawLocalFileSystem.java:866)
at org.apache.hadoop.fs.RawLocalFileSystem.getFileStatus(RawLocalFileSystem.java:630)
at org.apache.hadoop.fs.FileUtil.copy(FileUtil.java:340)
at org.apache.hadoop.fs.FileUtil.copy(FileUtil.java:292)
at org.apache.hadoop.fs.RawLocalFileSystem.rename(RawLocalFileSystem.java:372)
at org.apache.hadoop.fs.ChecksumFileSystem.rename(ChecksumFileSystem.java:513)
at org.apache.hadoop.mapreduce.jobhistory.JobHistoryEventHandler.moveTmpToDone(JobHistoryEventHandler.java:1346)
at org.apache.hadoop.mapreduce.jobhistory.JobHistoryEventHandler.processDoneFiles(JobHistoryEventHandler.java:1154)
at org.apache.hadoop.service.ServiceOperations.stop(ServiceOperations.java:52)
at org.apache.hadoop.service.ServiceOperations.stopQuietly(ServiceOperations.java:80)
at org.apache.hadoop.service.CompositeService.stop(CompositeService.java:157)
at org.apache.hadoop.service.CompositeService.serviceStop(CompositeService.java:131)
at org.apache.hadoop.mapreduce.v2.app.MRAppMaster.serviceStop(MRAppMaster.java:1756)
at org.apache.hadoop.service.AbstractService.stop(AbstractService.java:221)
at org.apache.hadoop.mapreduce.v2.app.MRAppMaster.stop(MRAppMaster.java:1248)
at org.apache.hadoop.mapreduce.v2.app.TestMRAppMaster.testMRAppMasterSuccessLock(TestMRAppMaster.java:254)
FAILED: org.apache.hadoop.mapreduce.v2.app.TestMRAppMaster.testMRAppMasterMidLock
Error Message:
null
Stack Trace:
java.lang.AssertionError: null
at org.junit.Assert.fail(Assert.java:86)
at org.junit.Assert.assertTrue(Assert.java:41)
at org.junit.Assert.assertTrue(Assert.java:52)
at org.apache.hadoop.mapreduce.v2.app.TestMRAppMaster.testMRAppMasterMidLock(TestMRAppMaster.java:174)
Hadoop-Mapreduce-trunk - Build # 2671 - Still Failing
Posted by Apache Jenkins Server <je...@builds.apache.org>.
See https://builds.apache.org/job/Hadoop-Mapreduce-trunk/2671/
###################################################################################
########################## LAST 60 LINES OF THE CONSOLE ###########################
[...truncated 32000 lines...]
Running org.apache.hadoop.mapred.TestMapFileOutputFormat
Tests run: 1, Failures: 0, Errors: 0, Skipped: 0, Time elapsed: 1.855 sec - in org.apache.hadoop.mapred.TestMapFileOutputFormat
Running org.apache.hadoop.mapred.TestJobAclsManager
Tests run: 4, Failures: 0, Errors: 0, Skipped: 0, Time elapsed: 7.546 sec - in org.apache.hadoop.mapred.TestJobAclsManager
Running org.apache.hadoop.mapred.TestLineRecordReader
Tests run: 12, Failures: 0, Errors: 0, Skipped: 0, Time elapsed: 49.367 sec - in org.apache.hadoop.mapred.TestLineRecordReader
Running org.apache.hadoop.mapred.TestClock
Tests run: 1, Failures: 0, Errors: 0, Skipped: 0, Time elapsed: 0.175 sec - in org.apache.hadoop.mapred.TestClock
Running org.apache.hadoop.mapred.TestJobQueueClient
Tests run: 1, Failures: 0, Errors: 0, Skipped: 0, Time elapsed: 0.331 sec - in org.apache.hadoop.mapred.TestJobQueueClient
Results :
Failed tests:
TestJobEndNotifier.testNotificationTimeout:182 null
Tests run: 219, Failures: 1, Errors: 0, Skipped: 0
[INFO] ------------------------------------------------------------------------
[INFO] Reactor Summary:
[INFO]
[INFO] Apache Hadoop MapReduce Client .................... SUCCESS [ 10.963 s]
[INFO] Apache Hadoop MapReduce Core ...................... FAILURE [06:42 min]
[INFO] Apache Hadoop MapReduce Common .................... SKIPPED
[INFO] Apache Hadoop MapReduce Shuffle ................... SKIPPED
[INFO] Apache Hadoop MapReduce App ....................... SKIPPED
[INFO] Apache Hadoop MapReduce HistoryServer ............. SKIPPED
[INFO] Apache Hadoop MapReduce JobClient ................. SKIPPED
[INFO] Apache Hadoop MapReduce HistoryServer Plugins ..... SKIPPED
[INFO] Apache Hadoop MapReduce NativeTask ................ SKIPPED
[INFO] Apache Hadoop MapReduce Examples .................. SKIPPED
[INFO] Apache Hadoop MapReduce ........................... SKIPPED
[INFO] ------------------------------------------------------------------------
[INFO] BUILD FAILURE
[INFO] ------------------------------------------------------------------------
[INFO] Total time: 06:59 min
[INFO] Finished at: 2015-11-28T06:38:10+00:00
[INFO] Final Memory: 39M/1292M
[INFO] ------------------------------------------------------------------------
[ERROR] Failed to execute goal org.apache.maven.plugins:maven-surefire-plugin:2.17:test (default-test) on project hadoop-mapreduce-client-core: There are test failures.
[ERROR]
[ERROR] Please refer to /home/jenkins/jenkins-slave/workspace/Hadoop-Mapreduce-trunk/hadoop-mapreduce-project/hadoop-mapreduce-client/hadoop-mapreduce-client-core/target/surefire-reports for the individual test results.
[ERROR] -> [Help 1]
[ERROR]
[ERROR] To see the full stack trace of the errors, re-run Maven with the -e switch.
[ERROR] Re-run Maven using the -X switch to enable full debug logging.
[ERROR]
[ERROR] For more information about the errors and possible solutions, please read the following articles:
[ERROR] [Help 1] http://cwiki.apache.org/confluence/display/MAVEN/MojoFailureException
[ERROR]
[ERROR] After correcting the problems, you can resume the build with the command
[ERROR] mvn <goals> -rf :hadoop-mapreduce-client-core
Build step 'Execute shell' marked build as failure
[FINDBUGS] Skipping publisher since build result is FAILURE
Archiving artifacts
Recording test results
Updating HADOOP-11505
Email was triggered for: Failure - Any
Sending email for trigger: Failure - Any
###################################################################################
############################## FAILED TESTS (if any) ##############################
1 tests failed.
FAILED: org.apache.hadoop.mapred.TestJobEndNotifier.testNotificationTimeout
Error Message:
null
Stack Trace:
junit.framework.AssertionFailedError: null
at junit.framework.Assert.fail(Assert.java:55)
at junit.framework.Assert.assertTrue(Assert.java:22)
at junit.framework.Assert.assertTrue(Assert.java:31)
at junit.framework.TestCase.assertTrue(TestCase.java:201)
at org.apache.hadoop.mapred.TestJobEndNotifier.testNotificationTimeout(TestJobEndNotifier.java:182)
Hadoop-Mapreduce-trunk - Build # 2670 - Still Failing
Posted by Apache Jenkins Server <je...@builds.apache.org>.
See https://builds.apache.org/job/Hadoop-Mapreduce-trunk/2670/
###################################################################################
########################## LAST 60 LINES OF THE CONSOLE ###########################
[...truncated 2791 lines...]
Running org.apache.hadoop.mapred.pipes.TestPipesNonJavaInputFormat
Tests run: 1, Failures: 0, Errors: 0, Skipped: 0, Time elapsed: 1.841 sec - in org.apache.hadoop.mapred.pipes.TestPipesNonJavaInputFormat
Running org.apache.hadoop.mapred.pipes.TestPipeApplication
Tests run: 5, Failures: 0, Errors: 0, Skipped: 0, Time elapsed: 6.248 sec - in org.apache.hadoop.mapred.pipes.TestPipeApplication
Running org.apache.hadoop.mapred.pipes.TestPipes
Tests run: 1, Failures: 0, Errors: 0, Skipped: 1, Time elapsed: 0.049 sec - in org.apache.hadoop.mapred.pipes.TestPipes
Running org.apache.hadoop.mapred.TestSpecialCharactersInOutputPath
Tests run: 1, Failures: 0, Errors: 0, Skipped: 0, Time elapsed: 28.98 sec - in org.apache.hadoop.mapred.TestSpecialCharactersInOutputPath
Running org.apache.hadoop.mapred.TestReporter
Tests run: 3, Failures: 0, Errors: 0, Skipped: 0, Time elapsed: 13.961 sec - in org.apache.hadoop.mapred.TestReporter
Results :
Tests in error:
TestLocalMRNotification>NotificationTestCase.testMR:178 » IO Job cleanup didn'...
Tests run: 526, Failures: 0, Errors: 1, Skipped: 11
[INFO] ------------------------------------------------------------------------
[INFO] Reactor Summary:
[INFO]
[INFO] Apache Hadoop MapReduce Client .................... SUCCESS [ 6.864 s]
[INFO] Apache Hadoop MapReduce Core ...................... SUCCESS [02:09 min]
[INFO] Apache Hadoop MapReduce Common .................... SUCCESS [ 33.376 s]
[INFO] Apache Hadoop MapReduce Shuffle ................... SUCCESS [ 6.383 s]
[INFO] Apache Hadoop MapReduce App ....................... SUCCESS [10:00 min]
[INFO] Apache Hadoop MapReduce HistoryServer ............. SUCCESS [06:02 min]
[INFO] Apache Hadoop MapReduce JobClient ................. FAILURE [ 01:53 h]
[INFO] Apache Hadoop MapReduce HistoryServer Plugins ..... SKIPPED
[INFO] Apache Hadoop MapReduce NativeTask ................ SKIPPED
[INFO] Apache Hadoop MapReduce Examples .................. SKIPPED
[INFO] Apache Hadoop MapReduce ........................... SKIPPED
[INFO] ------------------------------------------------------------------------
[INFO] BUILD FAILURE
[INFO] ------------------------------------------------------------------------
[INFO] Total time: 02:12 h
[INFO] Finished at: 2015-11-28T04:45:06+00:00
[INFO] Final Memory: 40M/670M
[INFO] ------------------------------------------------------------------------
[ERROR] Failed to execute goal org.apache.maven.plugins:maven-surefire-plugin:2.17:test (default-test) on project hadoop-mapreduce-client-jobclient: There are test failures.
[ERROR]
[ERROR] Please refer to /home/jenkins/jenkins-slave/workspace/Hadoop-Mapreduce-trunk/hadoop-mapreduce-project/hadoop-mapreduce-client/hadoop-mapreduce-client-jobclient/target/surefire-reports for the individual test results.
[ERROR] -> [Help 1]
[ERROR]
[ERROR] To see the full stack trace of the errors, re-run Maven with the -e switch.
[ERROR] Re-run Maven using the -X switch to enable full debug logging.
[ERROR]
[ERROR] For more information about the errors and possible solutions, please read the following articles:
[ERROR] [Help 1] http://cwiki.apache.org/confluence/display/MAVEN/MojoFailureException
[ERROR]
[ERROR] After correcting the problems, you can resume the build with the command
[ERROR] mvn <goals> -rf :hadoop-mapreduce-client-jobclient
Build step 'Execute shell' marked build as failure
[FINDBUGS] Skipping publisher since build result is FAILURE
Archiving artifacts
Recording test results
Updating HADOOP-11505
Email was triggered for: Failure - Any
Sending email for trigger: Failure - Any
###################################################################################
############################## FAILED TESTS (if any) ##############################
1 tests failed.
FAILED: org.apache.hadoop.mapred.TestLocalMRNotification.testMR
Error Message:
Job cleanup didn't start in 20 seconds
Stack Trace:
java.io.IOException: Job cleanup didn't start in 20 seconds
at org.apache.hadoop.mapred.UtilsForTests.runJobKill(UtilsForTests.java:685)
at org.apache.hadoop.mapred.NotificationTestCase.testMR(NotificationTestCase.java:178)
at sun.reflect.NativeMethodAccessorImpl.invoke0(Native Method)
at sun.reflect.NativeMethodAccessorImpl.invoke(NativeMethodAccessorImpl.java:57)
at sun.reflect.DelegatingMethodAccessorImpl.invoke(DelegatingMethodAccessorImpl.java:43)
at java.lang.reflect.Method.invoke(Method.java:606)
at junit.framework.TestCase.runTest(TestCase.java:176)
at junit.framework.TestCase.runBare(TestCase.java:141)
at junit.framework.TestResult$1.protect(TestResult.java:122)
at junit.framework.TestResult.runProtected(TestResult.java:142)
at junit.framework.TestResult.run(TestResult.java:125)
at junit.framework.TestCase.run(TestCase.java:129)
at junit.framework.TestSuite.runTest(TestSuite.java:255)
at junit.framework.TestSuite.run(TestSuite.java:250)
at org.junit.internal.runners.JUnit38ClassRunner.run(JUnit38ClassRunner.java:84)
at org.apache.maven.surefire.junit4.JUnit4Provider.execute(JUnit4Provider.java:264)
at org.apache.maven.surefire.junit4.JUnit4Provider.executeTestSet(JUnit4Provider.java:153)
at org.apache.maven.surefire.junit4.JUnit4Provider.invoke(JUnit4Provider.java:124)
at org.apache.maven.surefire.booter.ForkedBooter.invokeProviderInSameClassLoader(ForkedBooter.java:200)
at org.apache.maven.surefire.booter.ForkedBooter.runSuitesInProcess(ForkedBooter.java:153)
at org.apache.maven.surefire.booter.ForkedBooter.main(ForkedBooter.java:103)
Hadoop-Mapreduce-trunk - Build # 2669 - Still Failing
Posted by Apache Jenkins Server <je...@builds.apache.org>.
See https://builds.apache.org/job/Hadoop-Mapreduce-trunk/2669/
###################################################################################
########################## LAST 60 LINES OF THE CONSOLE ###########################
[...truncated 35663 lines...]
Tests run: 3, Failures: 0, Errors: 0, Skipped: 0, Time elapsed: 241.838 sec - in org.apache.hadoop.mapreduce.lib.output.TestJobOutputCommitter
Running org.apache.hadoop.mapreduce.lib.output.TestMRCJCFileOutputCommitter
Tests run: 4, Failures: 0, Errors: 0, Skipped: 0, Time elapsed: 1.559 sec - in org.apache.hadoop.mapreduce.lib.output.TestMRCJCFileOutputCommitter
Running org.apache.hadoop.util.TestMRCJCReflectionUtils
Tests run: 1, Failures: 0, Errors: 0, Skipped: 0, Time elapsed: 0.651 sec - in org.apache.hadoop.util.TestMRCJCReflectionUtils
Running org.apache.hadoop.util.TestMRCJCRunJar
Tests run: 1, Failures: 0, Errors: 0, Skipped: 0, Time elapsed: 0.25 sec - in org.apache.hadoop.util.TestMRCJCRunJar
Running org.apache.hadoop.io.TestSequenceFileMergeProgress
Tests run: 3, Failures: 0, Errors: 0, Skipped: 0, Time elapsed: 2.481 sec - in org.apache.hadoop.io.TestSequenceFileMergeProgress
Results :
Tests in error:
TestMRJobsWithProfiler.testDifferentProfilers:117->testProfilerInternal:150 »
Tests run: 526, Failures: 0, Errors: 1, Skipped: 11
[INFO] ------------------------------------------------------------------------
[INFO] Reactor Summary:
[INFO]
[INFO] Apache Hadoop MapReduce Client .................... SUCCESS [ 3.146 s]
[INFO] Apache Hadoop MapReduce Core ...................... SUCCESS [02:11 min]
[INFO] Apache Hadoop MapReduce Common .................... SUCCESS [ 32.912 s]
[INFO] Apache Hadoop MapReduce Shuffle ................... SUCCESS [ 5.553 s]
[INFO] Apache Hadoop MapReduce App ....................... SUCCESS [10:00 min]
[INFO] Apache Hadoop MapReduce HistoryServer ............. SUCCESS [05:56 min]
[INFO] Apache Hadoop MapReduce JobClient ................. FAILURE [ 01:42 h]
[INFO] Apache Hadoop MapReduce HistoryServer Plugins ..... SKIPPED
[INFO] Apache Hadoop MapReduce NativeTask ................ SKIPPED
[INFO] Apache Hadoop MapReduce Examples .................. SKIPPED
[INFO] Apache Hadoop MapReduce ........................... SKIPPED
[INFO] ------------------------------------------------------------------------
[INFO] BUILD FAILURE
[INFO] ------------------------------------------------------------------------
[INFO] Total time: 02:01 h
[INFO] Finished at: 2015-11-26T08:23:33+00:00
[INFO] Final Memory: 35M/1076M
[INFO] ------------------------------------------------------------------------
[ERROR] Failed to execute goal org.apache.maven.plugins:maven-surefire-plugin:2.17:test (default-test) on project hadoop-mapreduce-client-jobclient: There are test failures.
[ERROR]
[ERROR] Please refer to /home/jenkins/jenkins-slave/workspace/Hadoop-Mapreduce-trunk/hadoop-mapreduce-project/hadoop-mapreduce-client/hadoop-mapreduce-client-jobclient/target/surefire-reports for the individual test results.
[ERROR] -> [Help 1]
[ERROR]
[ERROR] To see the full stack trace of the errors, re-run Maven with the -e switch.
[ERROR] Re-run Maven using the -X switch to enable full debug logging.
[ERROR]
[ERROR] For more information about the errors and possible solutions, please read the following articles:
[ERROR] [Help 1] http://cwiki.apache.org/confluence/display/MAVEN/MojoFailureException
[ERROR]
[ERROR] After correcting the problems, you can resume the build with the command
[ERROR] mvn <goals> -rf :hadoop-mapreduce-client-jobclient
Build step 'Execute shell' marked build as failure
[FINDBUGS] Skipping publisher since build result is FAILURE
Archiving artifacts
Recording test results
Updating HADOOP-12468
Updating HDFS-9426
Email was triggered for: Failure - Any
Sending email for trigger: Failure - Any
###################################################################################
############################## FAILED TESTS (if any) ##############################
1 tests failed.
FAILED: org.apache.hadoop.mapreduce.v2.TestMRJobsWithProfiler.testDifferentProfilers
Error Message:
test timed out after 150000 milliseconds
Stack Trace:
java.lang.Exception: test timed out after 150000 milliseconds
at java.lang.Thread.sleep(Native Method)
at org.apache.hadoop.mapreduce.Job.monitorAndPrintJob(Job.java:1404)
at org.apache.hadoop.mapreduce.Job.waitForCompletion(Job.java:1362)
at org.apache.hadoop.mapreduce.v2.TestMRJobsWithProfiler.testProfilerInternal(TestMRJobsWithProfiler.java:150)
at org.apache.hadoop.mapreduce.v2.TestMRJobsWithProfiler.testDifferentProfilers(TestMRJobsWithProfiler.java:117)
Hadoop-Mapreduce-trunk - Build # 2668 - Still Failing
Posted by Apache Jenkins Server <je...@builds.apache.org>.
See https://builds.apache.org/job/Hadoop-Mapreduce-trunk/2668/
###################################################################################
########################## LAST 60 LINES OF THE CONSOLE ###########################
[...truncated 35535 lines...]
Tests run: 1, Failures: 0, Errors: 0, Skipped: 0, Time elapsed: 1.84 sec - in org.apache.hadoop.mapred.pipes.TestPipesNonJavaInputFormat
Running org.apache.hadoop.mapred.pipes.TestPipeApplication
Tests run: 5, Failures: 0, Errors: 0, Skipped: 0, Time elapsed: 6.925 sec - in org.apache.hadoop.mapred.pipes.TestPipeApplication
Running org.apache.hadoop.mapred.pipes.TestPipes
Tests run: 1, Failures: 0, Errors: 0, Skipped: 1, Time elapsed: 0.049 sec - in org.apache.hadoop.mapred.pipes.TestPipes
Running org.apache.hadoop.mapred.TestSpecialCharactersInOutputPath
Tests run: 1, Failures: 0, Errors: 0, Skipped: 0, Time elapsed: 29.709 sec - in org.apache.hadoop.mapred.TestSpecialCharactersInOutputPath
Running org.apache.hadoop.mapred.TestReporter
Tests run: 3, Failures: 0, Errors: 0, Skipped: 0, Time elapsed: 14.355 sec - in org.apache.hadoop.mapred.TestReporter
Results :
Tests in error:
TestMRJobsWithProfiler.testDifferentProfilers:117->testProfilerInternal:155 »
Tests run: 526, Failures: 0, Errors: 1, Skipped: 11
[INFO] ------------------------------------------------------------------------
[INFO] Reactor Summary:
[INFO]
[INFO] Apache Hadoop MapReduce Client .................... SUCCESS [ 3.981 s]
[INFO] Apache Hadoop MapReduce Core ...................... SUCCESS [02:28 min]
[INFO] Apache Hadoop MapReduce Common .................... SUCCESS [ 36.595 s]
[INFO] Apache Hadoop MapReduce Shuffle ................... SUCCESS [ 6.124 s]
[INFO] Apache Hadoop MapReduce App ....................... SUCCESS [10:40 min]
[INFO] Apache Hadoop MapReduce HistoryServer ............. SUCCESS [06:13 min]
[INFO] Apache Hadoop MapReduce JobClient ................. FAILURE [ 01:57 h]
[INFO] Apache Hadoop MapReduce HistoryServer Plugins ..... SKIPPED
[INFO] Apache Hadoop MapReduce NativeTask ................ SKIPPED
[INFO] Apache Hadoop MapReduce Examples .................. SKIPPED
[INFO] Apache Hadoop MapReduce ........................... SKIPPED
[INFO] ------------------------------------------------------------------------
[INFO] BUILD FAILURE
[INFO] ------------------------------------------------------------------------
[INFO] Total time: 02:17 h
[INFO] Finished at: 2015-11-26T05:20:28+00:00
[INFO] Final Memory: 34M/719M
[INFO] ------------------------------------------------------------------------
[ERROR] Failed to execute goal org.apache.maven.plugins:maven-surefire-plugin:2.17:test (default-test) on project hadoop-mapreduce-client-jobclient: There are test failures.
[ERROR]
[ERROR] Please refer to /home/jenkins/jenkins-slave/workspace/Hadoop-Mapreduce-trunk/hadoop-mapreduce-project/hadoop-mapreduce-client/hadoop-mapreduce-client-jobclient/target/surefire-reports for the individual test results.
[ERROR] -> [Help 1]
[ERROR]
[ERROR] To see the full stack trace of the errors, re-run Maven with the -e switch.
[ERROR] Re-run Maven using the -X switch to enable full debug logging.
[ERROR]
[ERROR] For more information about the errors and possible solutions, please read the following articles:
[ERROR] [Help 1] http://cwiki.apache.org/confluence/display/MAVEN/MojoFailureException
[ERROR]
[ERROR] After correcting the problems, you can resume the build with the command
[ERROR] mvn <goals> -rf :hadoop-mapreduce-client-jobclient
Build step 'Execute shell' marked build as failure
[FINDBUGS] Skipping publisher since build result is FAILURE
Archiving artifacts
Recording test results
Updating MAPREDUCE-6550
Updating MAPREDUCE-6549
Email was triggered for: Failure - Any
Sending email for trigger: Failure - Any
###################################################################################
############################## FAILED TESTS (if any) ##############################
1 tests failed.
FAILED: org.apache.hadoop.mapreduce.v2.TestMRJobsWithProfiler.testDifferentProfilers
Error Message:
test timed out after 150000 milliseconds
Stack Trace:
java.lang.Exception: test timed out after 150000 milliseconds
at java.lang.Thread.sleep(Native Method)
at org.apache.hadoop.mapreduce.v2.TestMRJobsWithProfiler.testProfilerInternal(TestMRJobsWithProfiler.java:155)
at org.apache.hadoop.mapreduce.v2.TestMRJobsWithProfiler.testDifferentProfilers(TestMRJobsWithProfiler.java:117)
Hadoop-Mapreduce-trunk - Build # 2667 - Still Failing
Posted by Apache Jenkins Server <je...@builds.apache.org>.
See https://builds.apache.org/job/Hadoop-Mapreduce-trunk/2667/
###################################################################################
########################## LAST 60 LINES OF THE CONSOLE ###########################
[...truncated 32008 lines...]
Tests run: 4, Failures: 0, Errors: 0, Skipped: 0, Time elapsed: 3.889 sec - in org.apache.hadoop.mapred.TestJobAclsManager
Running org.apache.hadoop.mapred.TestLineRecordReader
Tests run: 12, Failures: 0, Errors: 0, Skipped: 0, Time elapsed: 15.816 sec - in org.apache.hadoop.mapred.TestLineRecordReader
Running org.apache.hadoop.mapred.TestClock
Tests run: 1, Failures: 0, Errors: 0, Skipped: 0, Time elapsed: 0.169 sec - in org.apache.hadoop.mapred.TestClock
Running org.apache.hadoop.mapred.TestJobQueueClient
Tests run: 1, Failures: 0, Errors: 0, Skipped: 0, Time elapsed: 0.212 sec - in org.apache.hadoop.mapred.TestJobQueueClient
Results :
Failed tests:
TestJobEndNotifier.testNotificationTimeout:182 null
Tests run: 219, Failures: 1, Errors: 0, Skipped: 0
[INFO] ------------------------------------------------------------------------
[INFO] Reactor Summary:
[INFO]
[INFO] Apache Hadoop MapReduce Client .................... SUCCESS [ 10.558 s]
[INFO] Apache Hadoop MapReduce Core ...................... FAILURE [03:59 min]
[INFO] Apache Hadoop MapReduce Common .................... SKIPPED
[INFO] Apache Hadoop MapReduce Shuffle ................... SKIPPED
[INFO] Apache Hadoop MapReduce App ....................... SKIPPED
[INFO] Apache Hadoop MapReduce HistoryServer ............. SKIPPED
[INFO] Apache Hadoop MapReduce JobClient ................. SKIPPED
[INFO] Apache Hadoop MapReduce HistoryServer Plugins ..... SKIPPED
[INFO] Apache Hadoop MapReduce NativeTask ................ SKIPPED
[INFO] Apache Hadoop MapReduce Examples .................. SKIPPED
[INFO] Apache Hadoop MapReduce ........................... SKIPPED
[INFO] ------------------------------------------------------------------------
[INFO] BUILD FAILURE
[INFO] ------------------------------------------------------------------------
[INFO] Total time: 04:13 min
[INFO] Finished at: 2015-11-26T00:59:55+00:00
[INFO] Final Memory: 49M/1292M
[INFO] ------------------------------------------------------------------------
[ERROR] Failed to execute goal org.apache.maven.plugins:maven-surefire-plugin:2.17:test (default-test) on project hadoop-mapreduce-client-core: There are test failures.
[ERROR]
[ERROR] Please refer to /home/jenkins/jenkins-slave/workspace/Hadoop-Mapreduce-trunk/hadoop-mapreduce-project/hadoop-mapreduce-client/hadoop-mapreduce-client-core/target/surefire-reports for the individual test results.
[ERROR] -> [Help 1]
[ERROR]
[ERROR] To see the full stack trace of the errors, re-run Maven with the -e switch.
[ERROR] Re-run Maven using the -X switch to enable full debug logging.
[ERROR]
[ERROR] For more information about the errors and possible solutions, please read the following articles:
[ERROR] [Help 1] http://cwiki.apache.org/confluence/display/MAVEN/MojoFailureException
[ERROR]
[ERROR] After correcting the problems, you can resume the build with the command
[ERROR] mvn <goals> -rf :hadoop-mapreduce-client-core
Build step 'Execute shell' marked build as failure
[FINDBUGS] Skipping publisher since build result is FAILURE
Archiving artifacts
Recording test results
Updating HDFS-8512
Updating HDFS-9451
Updating HDFS-9467
Updating HDFS-9407
Email was triggered for: Failure - Any
Sending email for trigger: Failure - Any
###################################################################################
############################## FAILED TESTS (if any) ##############################
1 tests failed.
FAILED: org.apache.hadoop.mapred.TestJobEndNotifier.testNotificationTimeout
Error Message:
null
Stack Trace:
junit.framework.AssertionFailedError: null
at junit.framework.Assert.fail(Assert.java:55)
at junit.framework.Assert.assertTrue(Assert.java:22)
at junit.framework.Assert.assertTrue(Assert.java:31)
at junit.framework.TestCase.assertTrue(TestCase.java:201)
at org.apache.hadoop.mapred.TestJobEndNotifier.testNotificationTimeout(TestJobEndNotifier.java:182)
Hadoop-Mapreduce-trunk - Build # 2666 - Still Failing
Posted by Apache Jenkins Server <je...@builds.apache.org>.
See https://builds.apache.org/job/Hadoop-Mapreduce-trunk/2666/
###################################################################################
########################## LAST 60 LINES OF THE CONSOLE ###########################
[...truncated 32888 lines...]
Tests run: 1, Failures: 0, Errors: 0, Skipped: 1, Time elapsed: 0.045 sec - in org.apache.hadoop.mapred.TestBadRecords
Running org.apache.hadoop.mapred.TestMiniMRDFSCaching
Tests run: 1, Failures: 0, Errors: 0, Skipped: 1, Time elapsed: 0.048 sec - in org.apache.hadoop.mapred.TestMiniMRDFSCaching
Running org.apache.hadoop.io.TestSequenceFileMergeProgress
Tests run: 3, Failures: 0, Errors: 0, Skipped: 0, Time elapsed: 2.487 sec - in org.apache.hadoop.io.TestSequenceFileMergeProgress
Running org.apache.hadoop.conf.TestNoDefaultsJobConf
Tests run: 1, Failures: 0, Errors: 0, Skipped: 0, Time elapsed: 22.951 sec - in org.apache.hadoop.conf.TestNoDefaultsJobConf
Results :
Failed tests:
TestMiniMRClasspath.testExternalWritable:204 Test resulted in an unexpected exit
Tests in error:
TestMiniMRBringup.testBringUp:32 » NoClassDefFound org/apache/hadoop/service/S...
TestMiniMRWithDFSWithDistinctUsers.setUp:97 » NoClassDefFound org/apache/hadoo...
TestMiniMRWithDFSWithDistinctUsers.setUp:97 » NoClassDefFound org/apache/hadoo...
TestMiniMRClasspath.testClassPath:184 » NoClassDefFound org/apache/hadoop/hdfs...
Tests run: 523, Failures: 1, Errors: 4, Skipped: 11
[INFO] ------------------------------------------------------------------------
[INFO] Reactor Summary:
[INFO]
[INFO] Apache Hadoop MapReduce Client .................... SUCCESS [ 3.080 s]
[INFO] Apache Hadoop MapReduce Core ...................... SUCCESS [01:50 min]
[INFO] Apache Hadoop MapReduce Common .................... SUCCESS [ 33.265 s]
[INFO] Apache Hadoop MapReduce Shuffle ................... SUCCESS [ 5.616 s]
[INFO] Apache Hadoop MapReduce App ....................... SUCCESS [09:48 min]
[INFO] Apache Hadoop MapReduce HistoryServer ............. SUCCESS [05:51 min]
[INFO] Apache Hadoop MapReduce JobClient ................. FAILURE [ 01:50 h]
[INFO] Apache Hadoop MapReduce HistoryServer Plugins ..... SKIPPED
[INFO] Apache Hadoop MapReduce NativeTask ................ SKIPPED
[INFO] Apache Hadoop MapReduce Examples .................. SKIPPED
[INFO] Apache Hadoop MapReduce ........................... SKIPPED
[INFO] ------------------------------------------------------------------------
[INFO] BUILD FAILURE
[INFO] ------------------------------------------------------------------------
[INFO] Total time: 02:09 h
[INFO] Finished at: 2015-11-25T23:04:07+00:00
[INFO] Final Memory: 40M/981M
[INFO] ------------------------------------------------------------------------
[ERROR] Failed to execute goal org.apache.maven.plugins:maven-surefire-plugin:2.17:test (default-test) on project hadoop-mapreduce-client-jobclient: There was a timeout or other error in the fork -> [Help 1]
[ERROR]
[ERROR] To see the full stack trace of the errors, re-run Maven with the -e switch.
[ERROR] Re-run Maven using the -X switch to enable full debug logging.
[ERROR]
[ERROR] For more information about the errors and possible solutions, please read the following articles:
[ERROR] [Help 1] http://cwiki.apache.org/confluence/display/MAVEN/MojoFailureException
[ERROR]
[ERROR] After correcting the problems, you can resume the build with the command
[ERROR] mvn <goals> -rf :hadoop-mapreduce-client-jobclient
Build step 'Execute shell' marked build as failure
[FINDBUGS] Skipping publisher since build result is FAILURE
Archiving artifacts
Recording test results
Updating HDFS-9459
Email was triggered for: Failure - Any
Sending email for trigger: Failure - Any
###################################################################################
############################## FAILED TESTS (if any) ##############################
5 tests failed.
FAILED: org.apache.hadoop.mapred.TestMiniMRBringup.testBringUp
Error Message:
org/apache/hadoop/service/ServiceOperations
Stack Trace:
java.lang.NoClassDefFoundError: org/apache/hadoop/service/ServiceOperations
at java.net.URLClassLoader$1.run(URLClassLoader.java:366)
at java.net.URLClassLoader$1.run(URLClassLoader.java:355)
at java.security.AccessController.doPrivileged(Native Method)
at java.net.URLClassLoader.findClass(URLClassLoader.java:354)
at java.lang.ClassLoader.loadClass(ClassLoader.java:425)
at sun.misc.Launcher$AppClassLoader.loadClass(Launcher.java:308)
at java.lang.ClassLoader.loadClass(ClassLoader.java:358)
at org.apache.hadoop.service.AbstractService.start(AbstractService.java:203)
at org.apache.hadoop.service.CompositeService.serviceStart(CompositeService.java:120)
at org.apache.hadoop.mapreduce.v2.MiniMRYarnCluster.serviceStart(MiniMRYarnCluster.java:191)
at org.apache.hadoop.service.AbstractService.start(AbstractService.java:193)
at org.apache.hadoop.mapred.MiniMRClientClusterFactory.create(MiniMRClientClusterFactory.java:80)
at org.apache.hadoop.mapred.MiniMRCluster.<init>(MiniMRCluster.java:187)
at org.apache.hadoop.mapred.MiniMRCluster.<init>(MiniMRCluster.java:175)
at org.apache.hadoop.mapred.MiniMRCluster.<init>(MiniMRCluster.java:167)
at org.apache.hadoop.mapred.MiniMRCluster.<init>(MiniMRCluster.java:159)
at org.apache.hadoop.mapred.MiniMRCluster.<init>(MiniMRCluster.java:152)
at org.apache.hadoop.mapred.MiniMRCluster.<init>(MiniMRCluster.java:145)
at org.apache.hadoop.mapred.MiniMRCluster.<init>(MiniMRCluster.java:138)
at org.apache.hadoop.mapred.MiniMRCluster.<init>(MiniMRCluster.java:133)
at org.apache.hadoop.mapred.TestMiniMRBringup.testBringUp(TestMiniMRBringup.java:32)
FAILED: org.apache.hadoop.mapred.TestMiniMRClasspath.testClassPath
Error Message:
org/apache/hadoop/hdfs/server/namenode/JournalSet$5
Stack Trace:
java.lang.NoClassDefFoundError: org/apache/hadoop/hdfs/server/namenode/JournalSet$5
at org.apache.hadoop.hdfs.server.namenode.JournalSet.close(JournalSet.java:243)
at org.apache.hadoop.hdfs.server.namenode.FSEditLog.close(FSEditLog.java:368)
at org.apache.hadoop.hdfs.server.namenode.FSNamesystem.stopActiveServices(FSNamesystem.java:1216)
at org.apache.hadoop.hdfs.server.namenode.FSNamesystem.close(FSNamesystem.java:1587)
at org.apache.hadoop.hdfs.server.namenode.NameNode.stopCommonServices(NameNode.java:773)
at org.apache.hadoop.hdfs.server.namenode.NameNode.stop(NameNode.java:952)
at org.apache.hadoop.hdfs.MiniDFSCluster.shutdown(MiniDFSCluster.java:1913)
at org.apache.hadoop.hdfs.MiniDFSCluster.shutdown(MiniDFSCluster.java:1882)
at org.apache.hadoop.hdfs.MiniDFSCluster.shutdown(MiniDFSCluster.java:1875)
at org.apache.hadoop.mapred.TestMiniMRClasspath.testClassPath(TestMiniMRClasspath.java:184)
FAILED: org.apache.hadoop.mapred.TestMiniMRClasspath.testExternalWritable
Error Message:
Test resulted in an unexpected exit
Stack Trace:
java.lang.AssertionError: Test resulted in an unexpected exit
at org.apache.hadoop.hdfs.MiniDFSCluster.shutdown(MiniDFSCluster.java:1895)
at org.apache.hadoop.hdfs.MiniDFSCluster.shutdown(MiniDFSCluster.java:1882)
at org.apache.hadoop.hdfs.MiniDFSCluster.shutdown(MiniDFSCluster.java:1875)
at org.apache.hadoop.hdfs.MiniDFSCluster.initMiniDFSCluster(MiniDFSCluster.java:854)
at org.apache.hadoop.hdfs.MiniDFSCluster.<init>(MiniDFSCluster.java:482)
at org.apache.hadoop.hdfs.MiniDFSCluster$Builder.build(MiniDFSCluster.java:441)
at org.apache.hadoop.mapred.TestMiniMRClasspath.testExternalWritable(TestMiniMRClasspath.java:204)
FAILED: org.apache.hadoop.mapred.TestMiniMRWithDFSWithDistinctUsers.testMultipleSpills
Error Message:
org/apache/hadoop/hdfs/client/HdfsDataInputStream
Stack Trace:
java.lang.NoClassDefFoundError: org/apache/hadoop/hdfs/client/HdfsDataInputStream
at java.net.URLClassLoader$1.run(URLClassLoader.java:366)
at java.net.URLClassLoader$1.run(URLClassLoader.java:355)
at java.security.AccessController.doPrivileged(Native Method)
at java.net.URLClassLoader.findClass(URLClassLoader.java:354)
at java.lang.ClassLoader.loadClass(ClassLoader.java:425)
at sun.misc.Launcher$AppClassLoader.loadClass(Launcher.java:308)
at java.lang.ClassLoader.loadClass(ClassLoader.java:358)
at java.lang.Class.forName0(Native Method)
at java.lang.Class.forName(Class.java:270)
at org.apache.hadoop.conf.Configuration.getClassByNameOrNull(Configuration.java:2198)
at org.apache.hadoop.conf.Configuration.getClassByName(Configuration.java:2163)
at org.apache.hadoop.conf.Configuration.getClass(Configuration.java:2259)
at org.apache.hadoop.fs.AbstractFileSystem.createFileSystem(AbstractFileSystem.java:159)
at org.apache.hadoop.fs.AbstractFileSystem.get(AbstractFileSystem.java:250)
at org.apache.hadoop.fs.FileContext$2.run(FileContext.java:332)
at org.apache.hadoop.fs.FileContext$2.run(FileContext.java:329)
at java.security.AccessController.doPrivileged(Native Method)
at javax.security.auth.Subject.doAs(Subject.java:415)
at org.apache.hadoop.security.UserGroupInformation.doAs(UserGroupInformation.java:1669)
at org.apache.hadoop.fs.FileContext.getAbstractFileSystem(FileContext.java:329)
at org.apache.hadoop.fs.FileContext.getFileContext(FileContext.java:446)
at org.apache.hadoop.fs.FileContext.getFileContext(FileContext.java:472)
at org.apache.hadoop.mapreduce.v2.MiniMRYarnCluster.serviceInit(MiniMRYarnCluster.java:135)
at org.apache.hadoop.service.AbstractService.init(AbstractService.java:163)
at org.apache.hadoop.mapred.MiniMRClientClusterFactory.create(MiniMRClientClusterFactory.java:79)
at org.apache.hadoop.mapred.MiniMRCluster.<init>(MiniMRCluster.java:187)
at org.apache.hadoop.mapred.MiniMRCluster.<init>(MiniMRCluster.java:175)
at org.apache.hadoop.mapred.MiniMRCluster.<init>(MiniMRCluster.java:167)
at org.apache.hadoop.mapred.TestMiniMRWithDFSWithDistinctUsers.setUp(TestMiniMRWithDFSWithDistinctUsers.java:97)
FAILED: org.apache.hadoop.mapred.TestMiniMRWithDFSWithDistinctUsers.testDistinctUsers
Error Message:
org/apache/hadoop/hdfs/client/HdfsDataInputStream
Stack Trace:
java.lang.NoClassDefFoundError: org/apache/hadoop/hdfs/client/HdfsDataInputStream
at java.net.URLClassLoader$1.run(URLClassLoader.java:366)
at java.net.URLClassLoader$1.run(URLClassLoader.java:355)
at java.security.AccessController.doPrivileged(Native Method)
at java.net.URLClassLoader.findClass(URLClassLoader.java:354)
at java.lang.ClassLoader.loadClass(ClassLoader.java:425)
at sun.misc.Launcher$AppClassLoader.loadClass(Launcher.java:308)
at java.lang.ClassLoader.loadClass(ClassLoader.java:358)
at java.lang.Class.forName0(Native Method)
at java.lang.Class.forName(Class.java:270)
at org.apache.hadoop.conf.Configuration.getClassByNameOrNull(Configuration.java:2198)
at org.apache.hadoop.conf.Configuration.getClassByName(Configuration.java:2163)
at org.apache.hadoop.conf.Configuration.getClass(Configuration.java:2259)
at org.apache.hadoop.fs.AbstractFileSystem.createFileSystem(AbstractFileSystem.java:159)
at org.apache.hadoop.fs.AbstractFileSystem.get(AbstractFileSystem.java:250)
at org.apache.hadoop.fs.FileContext$2.run(FileContext.java:332)
at org.apache.hadoop.fs.FileContext$2.run(FileContext.java:329)
at java.security.AccessController.doPrivileged(Native Method)
at javax.security.auth.Subject.doAs(Subject.java:415)
at org.apache.hadoop.security.UserGroupInformation.doAs(UserGroupInformation.java:1669)
at org.apache.hadoop.fs.FileContext.getAbstractFileSystem(FileContext.java:329)
at org.apache.hadoop.fs.FileContext.getFileContext(FileContext.java:446)
at org.apache.hadoop.fs.FileContext.getFileContext(FileContext.java:472)
at org.apache.hadoop.mapreduce.v2.MiniMRYarnCluster.serviceInit(MiniMRYarnCluster.java:135)
at org.apache.hadoop.service.AbstractService.init(AbstractService.java:163)
at org.apache.hadoop.mapred.MiniMRClientClusterFactory.create(MiniMRClientClusterFactory.java:79)
at org.apache.hadoop.mapred.MiniMRCluster.<init>(MiniMRCluster.java:187)
at org.apache.hadoop.mapred.MiniMRCluster.<init>(MiniMRCluster.java:175)
at org.apache.hadoop.mapred.MiniMRCluster.<init>(MiniMRCluster.java:167)
at org.apache.hadoop.mapred.TestMiniMRWithDFSWithDistinctUsers.setUp(TestMiniMRWithDFSWithDistinctUsers.java:97)
Hadoop-Mapreduce-trunk - Build # 2665 - Still Failing
Posted by Apache Jenkins Server <je...@builds.apache.org>.
See https://builds.apache.org/job/Hadoop-Mapreduce-trunk/2665/
###################################################################################
########################## LAST 60 LINES OF THE CONSOLE ###########################
[...truncated 49875 lines...]
Tests run: 4, Failures: 0, Errors: 0, Skipped: 0, Time elapsed: 1.7 sec - in org.apache.hadoop.mapreduce.lib.output.TestMRCJCFileOutputCommitter
Running org.apache.hadoop.util.TestMRCJCReflectionUtils
Tests run: 1, Failures: 0, Errors: 0, Skipped: 0, Time elapsed: 0.689 sec - in org.apache.hadoop.util.TestMRCJCReflectionUtils
Running org.apache.hadoop.util.TestMRCJCRunJar
Tests run: 1, Failures: 0, Errors: 0, Skipped: 0, Time elapsed: 0.264 sec - in org.apache.hadoop.util.TestMRCJCRunJar
Running org.apache.hadoop.io.TestSequenceFileMergeProgress
Tests run: 3, Failures: 0, Errors: 0, Skipped: 0, Time elapsed: 2.358 sec - in org.apache.hadoop.io.TestSequenceFileMergeProgress
Results :
Tests in error:
TestMRJobs.testSleepJob:193->testSleepJobInternal:234 » test timed out after ...
TestMRJobs.testConfVerificationWithOutClassloader:321->testConfVerification:414 »
TestMRJobs.testRandomWriter:518 » test timed out after 60000 milliseconds
TestMRAppWithCombiner.setup:80 » NoClassDefFound org/apache/hadoop/service/Ser...
TestMRAppWithCombiner.tearDown:93 » NoClassDefFound org/apache/hadoop/service/...
Tests run: 514, Failures: 0, Errors: 2, Skipped: 11
[INFO] ------------------------------------------------------------------------
[INFO] Reactor Summary:
[INFO]
[INFO] Apache Hadoop MapReduce Client .................... SUCCESS [ 2.913 s]
[INFO] Apache Hadoop MapReduce Core ...................... SUCCESS [01:40 min]
[INFO] Apache Hadoop MapReduce Common .................... SUCCESS [ 29.087 s]
[INFO] Apache Hadoop MapReduce Shuffle ................... SUCCESS [ 4.858 s]
[INFO] Apache Hadoop MapReduce App ....................... SUCCESS [09:18 min]
[INFO] Apache Hadoop MapReduce HistoryServer ............. SUCCESS [05:40 min]
[INFO] Apache Hadoop MapReduce JobClient ................. FAILURE [ 01:48 h]
[INFO] Apache Hadoop MapReduce HistoryServer Plugins ..... SKIPPED
[INFO] Apache Hadoop MapReduce NativeTask ................ SKIPPED
[INFO] Apache Hadoop MapReduce Examples .................. SKIPPED
[INFO] Apache Hadoop MapReduce ........................... SKIPPED
[INFO] ------------------------------------------------------------------------
[INFO] BUILD FAILURE
[INFO] ------------------------------------------------------------------------
[INFO] Total time: 02:05 h
[INFO] Finished at: 2015-11-25T20:22:35+00:00
[INFO] Final Memory: 34M/651M
[INFO] ------------------------------------------------------------------------
[ERROR] Failed to execute goal org.apache.maven.plugins:maven-surefire-plugin:2.17:test (default-test) on project hadoop-mapreduce-client-jobclient: ExecutionException: java.lang.RuntimeException: The forked VM terminated without properly saying goodbye. VM crash or System.exit called?
[ERROR] Command was /bin/sh -c cd /home/jenkins/jenkins-slave/workspace/Hadoop-Mapreduce-trunk/hadoop-mapreduce-project/hadoop-mapreduce-client/hadoop-mapreduce-client-jobclient && /home/jenkins/tools/java/jdk1.7.0_55/jre/bin/java -Xmx2048m -XX:MaxPermSize=768m -XX:+HeapDumpOnOutOfMemoryError -jar /home/jenkins/jenkins-slave/workspace/Hadoop-Mapreduce-trunk/hadoop-mapreduce-project/hadoop-mapreduce-client/hadoop-mapreduce-client-jobclient/target/surefire/surefirebooter3826219276375096281.jar /home/jenkins/jenkins-slave/workspace/Hadoop-Mapreduce-trunk/hadoop-mapreduce-project/hadoop-mapreduce-client/hadoop-mapreduce-client-jobclient/target/surefire/surefire5598475238850720813tmp /home/jenkins/jenkins-slave/workspace/Hadoop-Mapreduce-trunk/hadoop-mapreduce-project/hadoop-mapreduce-client/hadoop-mapreduce-client-jobclient/target/surefire/surefire_2691998137990379958798tmp
[ERROR] -> [Help 1]
[ERROR]
[ERROR] To see the full stack trace of the errors, re-run Maven with the -e switch.
[ERROR] Re-run Maven using the -X switch to enable full debug logging.
[ERROR]
[ERROR] For more information about the errors and possible solutions, please read the following articles:
[ERROR] [Help 1] http://cwiki.apache.org/confluence/display/MAVEN/MojoFailureException
[ERROR]
[ERROR] After correcting the problems, you can resume the build with the command
[ERROR] mvn <goals> -rf :hadoop-mapreduce-client-jobclient
Build step 'Execute shell' marked build as failure
[FINDBUGS] Skipping publisher since build result is FAILURE
Archiving artifacts
Recording test results
Updating HDFS-6694
Email was triggered for: Failure - Any
Sending email for trigger: Failure - Any
###################################################################################
############################## FAILED TESTS (if any) ##############################
2 tests failed.
FAILED: org.apache.hadoop.mapreduce.v2.TestMRAppWithCombiner.org.apache.hadoop.mapreduce.v2.TestMRAppWithCombiner
Error Message:
org/apache/hadoop/service/ServiceOperations
Stack Trace:
java.lang.NoClassDefFoundError: org/apache/hadoop/service/ServiceOperations
at java.net.URLClassLoader$1.run(URLClassLoader.java:366)
at java.net.URLClassLoader$1.run(URLClassLoader.java:355)
at java.security.AccessController.doPrivileged(Native Method)
at java.net.URLClassLoader.findClass(URLClassLoader.java:354)
at java.lang.ClassLoader.loadClass(ClassLoader.java:425)
at sun.misc.Launcher$AppClassLoader.loadClass(Launcher.java:308)
at java.lang.ClassLoader.loadClass(ClassLoader.java:358)
at org.apache.hadoop.service.AbstractService.start(AbstractService.java:203)
at org.apache.hadoop.service.CompositeService.serviceStart(CompositeService.java:120)
at org.apache.hadoop.mapreduce.v2.MiniMRYarnCluster.serviceStart(MiniMRYarnCluster.java:191)
at org.apache.hadoop.service.AbstractService.start(AbstractService.java:193)
at org.apache.hadoop.mapreduce.v2.TestMRAppWithCombiner.setup(TestMRAppWithCombiner.java:80)
FAILED: org.apache.hadoop.mapreduce.v2.TestMRAppWithCombiner.org.apache.hadoop.mapreduce.v2.TestMRAppWithCombiner
Error Message:
org/apache/hadoop/service/ServiceOperations
Stack Trace:
java.lang.NoClassDefFoundError: org/apache/hadoop/service/ServiceOperations
at java.net.URLClassLoader$1.run(URLClassLoader.java:366)
at java.net.URLClassLoader$1.run(URLClassLoader.java:355)
at java.security.AccessController.doPrivileged(Native Method)
at java.net.URLClassLoader.findClass(URLClassLoader.java:354)
at java.lang.ClassLoader.loadClass(ClassLoader.java:425)
at sun.misc.Launcher$AppClassLoader.loadClass(Launcher.java:308)
at java.lang.ClassLoader.loadClass(ClassLoader.java:358)
at org.apache.hadoop.service.CompositeService.stop(CompositeService.java:157)
at org.apache.hadoop.service.CompositeService.serviceStop(CompositeService.java:131)
at org.apache.hadoop.service.AbstractService.stop(AbstractService.java:221)
at org.apache.hadoop.mapreduce.v2.TestMRAppWithCombiner.tearDown(TestMRAppWithCombiner.java:93)
Hadoop-Mapreduce-trunk - Build # 2664 - Still Failing
Posted by Apache Jenkins Server <je...@builds.apache.org>.
See https://builds.apache.org/job/Hadoop-Mapreduce-trunk/2664/
###################################################################################
########################## LAST 60 LINES OF THE CONSOLE ###########################
[...truncated 32275 lines...]
Tests run: 4, Failures: 0, Errors: 0, Skipped: 0, Time elapsed: 13.346 sec - in org.apache.hadoop.mapreduce.v2.app.webapp.TestAMWebServicesJobConf
Running org.apache.hadoop.mapred.TestTaskAttemptListenerImpl
Tests run: 6, Failures: 0, Errors: 0, Skipped: 0, Time elapsed: 2.739 sec - in org.apache.hadoop.mapred.TestTaskAttemptListenerImpl
Running org.apache.hadoop.mapred.TestTaskAttemptFinishingMonitor
Tests run: 1, Failures: 0, Errors: 0, Skipped: 0, Time elapsed: 3.112 sec - in org.apache.hadoop.mapred.TestTaskAttemptFinishingMonitor
Running org.apache.hadoop.mapred.TestLocalContainerLauncher
Tests run: 2, Failures: 0, Errors: 0, Skipped: 0, Time elapsed: 4.138 sec - in org.apache.hadoop.mapred.TestLocalContainerLauncher
Results :
Failed tests:
TestFetchFailure.testFetchFailureMultipleReduces:301 Num completion events not correct expected:<1> but was:<0>
Tests run: 340, Failures: 1, Errors: 0, Skipped: 0
[INFO] ------------------------------------------------------------------------
[INFO] Reactor Summary:
[INFO]
[INFO] Apache Hadoop MapReduce Client .................... SUCCESS [ 6.922 s]
[INFO] Apache Hadoop MapReduce Core ...................... SUCCESS [03:32 min]
[INFO] Apache Hadoop MapReduce Common .................... SUCCESS [ 54.072 s]
[INFO] Apache Hadoop MapReduce Shuffle ................... SUCCESS [ 9.957 s]
[INFO] Apache Hadoop MapReduce App ....................... FAILURE [14:16 min]
[INFO] Apache Hadoop MapReduce HistoryServer ............. SKIPPED
[INFO] Apache Hadoop MapReduce JobClient ................. SKIPPED
[INFO] Apache Hadoop MapReduce HistoryServer Plugins ..... SKIPPED
[INFO] Apache Hadoop MapReduce NativeTask ................ SKIPPED
[INFO] Apache Hadoop MapReduce Examples .................. SKIPPED
[INFO] Apache Hadoop MapReduce ........................... SKIPPED
[INFO] ------------------------------------------------------------------------
[INFO] BUILD FAILURE
[INFO] ------------------------------------------------------------------------
[INFO] Total time: 19:02 min
[INFO] Finished at: 2015-11-25T17:44:14+00:00
[INFO] Final Memory: 45M/1221M
[INFO] ------------------------------------------------------------------------
[ERROR] Failed to execute goal org.apache.maven.plugins:maven-surefire-plugin:2.17:test (default-test) on project hadoop-mapreduce-client-app: There are test failures.
[ERROR]
[ERROR] Please refer to /home/jenkins/jenkins-slave/workspace/Hadoop-Mapreduce-trunk/hadoop-mapreduce-project/hadoop-mapreduce-client/hadoop-mapreduce-client-app/target/surefire-reports for the individual test results.
[ERROR] -> [Help 1]
[ERROR]
[ERROR] To see the full stack trace of the errors, re-run Maven with the -e switch.
[ERROR] Re-run Maven using the -X switch to enable full debug logging.
[ERROR]
[ERROR] For more information about the errors and possible solutions, please read the following articles:
[ERROR] [Help 1] http://cwiki.apache.org/confluence/display/MAVEN/MojoFailureException
[ERROR]
[ERROR] After correcting the problems, you can resume the build with the command
[ERROR] mvn <goals> -rf :hadoop-mapreduce-client-app
Build step 'Execute shell' marked build as failure
[FINDBUGS] Skipping publisher since build result is FAILURE
Archiving artifacts
Recording test results
Updating HADOOP-12598
Updating YARN-4380
Updating MAPREDUCE-6555
Updating HDFS-9438
Email was triggered for: Failure - Any
Sending email for trigger: Failure - Any
###################################################################################
############################## FAILED TESTS (if any) ##############################
1 tests failed.
FAILED: org.apache.hadoop.mapreduce.v2.app.TestFetchFailure.testFetchFailureMultipleReduces
Error Message:
Num completion events not correct expected:<1> but was:<0>
Stack Trace:
java.lang.AssertionError: Num completion events not correct expected:<1> but was:<0>
at org.junit.Assert.fail(Assert.java:88)
at org.junit.Assert.failNotEquals(Assert.java:743)
at org.junit.Assert.assertEquals(Assert.java:118)
at org.junit.Assert.assertEquals(Assert.java:555)
at org.apache.hadoop.mapreduce.v2.app.TestFetchFailure.testFetchFailureMultipleReduces(TestFetchFailure.java:301)