You are viewing a plain text version of this content. The canonical link for it is here.
Posted to commits@olingo.apache.org by Apache Jenkins Server <je...@builds.apache.org> on 2017/11/20 11:01:34 UTC
Build failed in Jenkins: olingo-odata2 #1363
See <https://builds.apache.org/job/olingo-odata2/1363/display/redirect?page=changes>
Changes:
[archana.rai] [Olingo-1147]Entity read not working due to normalization
------------------------------------------
[...truncated 128.80 KB...]
[INFO] Installing <https://builds.apache.org/job/olingo-odata2/ws/odata2-jpa-processor/jpa-api/target/olingo-odata2-jpa-processor-api-2.0.10-SNAPSHOT-sources.jar> to /home/jenkins/.m2/repository/org/apache/olingo/olingo-odata2-jpa-processor-api/2.0.10-SNAPSHOT/olingo-odata2-jpa-processor-api-2.0.10-SNAPSHOT-sources.jar
[INFO]
[INFO] --- maven-deploy-plugin:2.7:deploy (default-deploy) @ olingo-odata2-jpa-processor-api ---
Downloading from apache.snapshots.https: https://repository.apache.org/content/repositories/snapshots/org/apache/olingo/olingo-odata2-jpa-processor-api/2.0.10-SNAPSHOT/maven-metadata.xml
Progress (1): 1.0 kB Downloaded from apache.snapshots.https: https://repository.apache.org/content/repositories/snapshots/org/apache/olingo/olingo-odata2-jpa-processor-api/2.0.10-SNAPSHOT/maven-metadata.xml (1.0 kB at 1.8 kB/s)
Uploading to apache.snapshots.https: https://repository.apache.org/content/repositories/snapshots/org/apache/olingo/olingo-odata2-jpa-processor-api/2.0.10-SNAPSHOT/olingo-odata2-jpa-processor-api-2.0.10-20171120.110117-20.jar
Progress (1): 2.0/72 kBProgress (1): 4.1/72 kBProgress (1): 6.1/72 kBProgress (1): 8.2/72 kBProgress (1): 10/72 kB Progress (1): 12/72 kBProgress (1): 14/72 kBProgress (1): 16/72 kBProgress (1): 18/72 kBProgress (1): 20/72 kBProgress (1): 23/72 kBProgress (1): 25/72 kBProgress (1): 27/72 kBProgress (1): 29/72 kBProgress (1): 31/72 kBProgress (1): 33/72 kBProgress (1): 35/72 kBProgress (1): 37/72 kBProgress (1): 39/72 kBProgress (1): 41/72 kBProgress (1): 43/72 kBProgress (1): 45/72 kBProgress (1): 47/72 kBProgress (1): 49/72 kBProgress (1): 51/72 kBProgress (1): 53/72 kBProgress (1): 55/72 kBProgress (1): 57/72 kBProgress (1): 59/72 kBProgress (1): 61/72 kBProgress (1): 63/72 kBProgress (1): 66/72 kBProgress (1): 68/72 kBProgress (1): 70/72 kBProgress (1): 72/72 kBProgress (1): 72 kB Uploaded to apache.snapshots.https: https://repository.apache.org/content/repositories/snapshots/org/apache/olingo/olingo-odata2-jpa-processor-api/2.0.10-SNAPSHOT/olingo-odata2-jpa-processor-api-2.0.10-20171120.110117-20.jar (72 kB at 57 kB/s)
Uploading to apache.snapshots.https: https://repository.apache.org/content/repositories/snapshots/org/apache/olingo/olingo-odata2-jpa-processor-api/2.0.10-SNAPSHOT/olingo-odata2-jpa-processor-api-2.0.10-20171120.110117-20.pom
Progress (1): 2.0/3.1 kBProgress (1): 3.1 kB Uploaded to apache.snapshots.https: https://repository.apache.org/content/repositories/snapshots/org/apache/olingo/olingo-odata2-jpa-processor-api/2.0.10-SNAPSHOT/olingo-odata2-jpa-processor-api-2.0.10-20171120.110117-20.pom (3.1 kB at 2.8 kB/s)
Downloading from apache.snapshots.https: https://repository.apache.org/content/repositories/snapshots/org/apache/olingo/olingo-odata2-jpa-processor-api/maven-metadata.xml
Progress (1): 449 B Downloaded from apache.snapshots.https: https://repository.apache.org/content/repositories/snapshots/org/apache/olingo/olingo-odata2-jpa-processor-api/maven-metadata.xml (449 B at 730 B/s)
Uploading to apache.snapshots.https: https://repository.apache.org/content/repositories/snapshots/org/apache/olingo/olingo-odata2-jpa-processor-api/2.0.10-SNAPSHOT/maven-metadata.xml
Progress (1): 1.0 kB Uploaded to apache.snapshots.https: https://repository.apache.org/content/repositories/snapshots/org/apache/olingo/olingo-odata2-jpa-processor-api/2.0.10-SNAPSHOT/maven-metadata.xml (1.0 kB at 928 B/s)
Uploading to apache.snapshots.https: https://repository.apache.org/content/repositories/snapshots/org/apache/olingo/olingo-odata2-jpa-processor-api/maven-metadata.xml
Progress (1): 449 B Uploaded to apache.snapshots.https: https://repository.apache.org/content/repositories/snapshots/org/apache/olingo/olingo-odata2-jpa-processor-api/maven-metadata.xml (449 B at 401 B/s)
Uploading to apache.snapshots.https: https://repository.apache.org/content/repositories/snapshots/org/apache/olingo/olingo-odata2-jpa-processor-api/2.0.10-SNAPSHOT/olingo-odata2-jpa-processor-api-2.0.10-20171120.110117-20-sources.jar
Progress (1): 2.0/103 kBProgress (1): 4.1/103 kBProgress (1): 6.1/103 kBProgress (1): 8.2/103 kBProgress (1): 10/103 kB Progress (1): 12/103 kBProgress (1): 14/103 kBProgress (1): 16/103 kBProgress (1): 18/103 kBProgress (1): 20/103 kBProgress (1): 23/103 kBProgress (1): 25/103 kBProgress (1): 27/103 kBProgress (1): 29/103 kBProgress (1): 31/103 kBProgress (1): 33/103 kBProgress (1): 35/103 kBProgress (1): 37/103 kBProgress (1): 39/103 kBProgress (1): 41/103 kBProgress (1): 43/103 kBProgress (1): 45/103 kBProgress (1): 47/103 kBProgress (1): 49/103 kBProgress (1): 51/103 kBProgress (1): 53/103 kBProgress (1): 55/103 kBProgress (1): 57/103 kBProgress (1): 59/103 kBProgress (1): 61/103 kBProgress (1): 63/103 kBProgress (1): 66/103 kBProgress (1): 68/103 kBProgress (1): 70/103 kBProgress (1): 72/103 kBProgress (1): 74/103 kBProgress (1): 76/103 kBProgress (1): 78/103 kBProgress (1): 80/103 kBProgress (1): 82/103 kBProgress (1): 84/103 kBProgress (1): 86/103 kBProgress (1): 88/103 kBProgress (1): 90/103 kBProgress (1): 92/103 kBProgress (1): 94/103 kBProgress (1): 96/103 kBProgress (1): 98/103 kBProgress (1): 100/103 kBProgress (1): 102/103 kBProgress (1): 103 kB Uploaded to apache.snapshots.https: https://repository.apache.org/content/repositories/snapshots/org/apache/olingo/olingo-odata2-jpa-processor-api/2.0.10-SNAPSHOT/olingo-odata2-jpa-processor-api-2.0.10-20171120.110117-20-sources.jar (103 kB at 75 kB/s)
Uploading to apache.snapshots.https: https://repository.apache.org/content/repositories/snapshots/org/apache/olingo/olingo-odata2-jpa-processor-api/2.0.10-SNAPSHOT/maven-metadata.xml
Progress (1): 1.0 kB Uploaded to apache.snapshots.https: https://repository.apache.org/content/repositories/snapshots/org/apache/olingo/olingo-odata2-jpa-processor-api/2.0.10-SNAPSHOT/maven-metadata.xml (1.0 kB at 912 B/s)
[INFO]
[INFO] ------------------------------------------------------------------------
[INFO] Building olingo-odata2-jpa-processor-core 2.0.10-SNAPSHOT
[INFO] ------------------------------------------------------------------------
[INFO]
[INFO] --- maven-clean-plugin:2.5:clean (default-clean) @ olingo-odata2-jpa-processor-core ---
[INFO] Deleting <https://builds.apache.org/job/olingo-odata2/ws/odata2-jpa-processor/jpa-core/target>
[INFO]
[INFO] --- buildnumber-maven-plugin:1.2:create (default) @ olingo-odata2-jpa-processor-core ---
[INFO]
[INFO] --- maven-remote-resources-plugin:1.5:process (default) @ olingo-odata2-jpa-processor-core ---
[INFO]
[INFO] --- maven-resources-plugin:2.6:resources (default-resources) @ olingo-odata2-jpa-processor-core ---
[INFO] Using 'UTF-8' encoding to copy filtered resources.
[INFO] Copying 1 resource
[INFO] Copying 3 resources
[INFO]
[INFO] --- maven-compiler-plugin:2.3.2:compile (default-compile) @ olingo-odata2-jpa-processor-core ---
[INFO] Compiling 48 source files to <https://builds.apache.org/job/olingo-odata2/ws/odata2-jpa-processor/jpa-core/target/classes>
[INFO]
[INFO] --- maven-bundle-plugin:2.3.7:manifest (bundle-manifest) @ olingo-odata2-jpa-processor-core ---
[INFO]
[INFO] --- maven-resources-plugin:2.6:testResources (default-testResources) @ olingo-odata2-jpa-processor-core ---
[INFO] Using 'UTF-8' encoding to copy filtered resources.
[INFO] Copying 3 resources
[INFO] Copying 3 resources
[INFO]
[INFO] --- maven-compiler-plugin:2.3.2:testCompile (default-testCompile) @ olingo-odata2-jpa-processor-core ---
[INFO] Compiling 80 source files to <https://builds.apache.org/job/olingo-odata2/ws/odata2-jpa-processor/jpa-core/target/test-classes>
[INFO]
[INFO] --- maven-surefire-plugin:2.12.4:test (default-test) @ olingo-odata2-jpa-processor-core ---
[INFO] Surefire report directory: <https://builds.apache.org/job/olingo-odata2/ws/odata2-jpa-processor/jpa-core/target/surefire-reports>
-------------------------------------------------------
T E S T S
-------------------------------------------------------
Running org.apache.olingo.odata2.jpa.processor.core.jpql.JPQLJoinSelectSingleContextTest
Tests run: 2, Failures: 0, Errors: 0, Skipped: 0, Time elapsed: 0.177 sec
Running org.apache.olingo.odata2.jpa.processor.core.jpql.JPQLSelectStatementBuilderTest
Tests run: 3, Failures: 0, Errors: 0, Skipped: 0, Time elapsed: 0.009 sec
Running org.apache.olingo.odata2.jpa.processor.core.jpql.JPQLSelectSingleStatementBuilderTest
Tests run: 1, Failures: 0, Errors: 0, Skipped: 0, Time elapsed: 0.001 sec
Running org.apache.olingo.odata2.jpa.processor.core.jpql.JPQLJoinSelectSingleStatementBuilderTest
Tests run: 3, Failures: 0, Errors: 0, Skipped: 0, Time elapsed: 0.005 sec
Running org.apache.olingo.odata2.jpa.processor.core.jpql.JPQLSelectSingleContextImplTest
Tests run: 6, Failures: 0, Errors: 0, Skipped: 0, Time elapsed: 0.01 sec
Running org.apache.olingo.odata2.jpa.processor.core.jpql.JPQLJoinContextTest
Tests run: 1, Failures: 0, Errors: 0, Skipped: 0, Time elapsed: 0.005 sec
Running org.apache.olingo.odata2.jpa.processor.core.jpql.JPQLSelectContextImplTest
Tests run: 12, Failures: 0, Errors: 0, Skipped: 0, Time elapsed: 0.023 sec
Running org.apache.olingo.odata2.jpa.processor.core.jpql.JPQLBuilderFactoryTest
Tests run: 11, Failures: 0, Errors: 0, Skipped: 0, Time elapsed: 0.027 sec
Running org.apache.olingo.odata2.jpa.processor.core.jpql.JPQLJoinStatementBuilderTest
Tests run: 3, Failures: 0, Errors: 0, Skipped: 0, Time elapsed: 0.003 sec
Running org.apache.olingo.odata2.jpa.processor.core.ODataJPAResponseBuilderTest
Tests run: 8, Failures: 0, Errors: 0, Skipped: 0, Time elapsed: 0.068 sec
Running org.apache.olingo.odata2.jpa.processor.core.ODataFilterExpressionParserTest
Tests run: 27, Failures: 0, Errors: 0, Skipped: 0, Time elapsed: 0.074 sec
Running org.apache.olingo.odata2.jpa.processor.core.ODataSelectExpressionParserTest
Tests run: 8, Failures: 0, Errors: 0, Skipped: 0, Time elapsed: 0.01 sec
Running org.apache.olingo.odata2.jpa.processor.core.ODataJPAContextImplTest
Tests run: 1, Failures: 0, Errors: 0, Skipped: 0, Time elapsed: 0.003 sec
Running org.apache.olingo.odata2.jpa.processor.core.ODataEntityParserTest
Tests run: 10, Failures: 0, Errors: 0, Skipped: 0, Time elapsed: 0.061 sec
Running org.apache.olingo.odata2.jpa.processor.core.callback.JPATombstoneCallBackTest
Tests run: 2, Failures: 0, Errors: 0, Skipped: 0, Time elapsed: 0.001 sec
Running org.apache.olingo.odata2.jpa.processor.core.model.JPAEdmAssociationSetTest
Tests run: 6, Failures: 0, Errors: 0, Skipped: 0, Time elapsed: 0.003 sec
Running org.apache.olingo.odata2.jpa.processor.core.model.JPAEdmAssociationTest
Tests run: 7, Failures: 0, Errors: 0, Skipped: 0, Time elapsed: 0.011 sec
Running org.apache.olingo.odata2.jpa.processor.core.model.JPAEdmEntityTypeTest
Tests run: 7, Failures: 0, Errors: 0, Skipped: 0, Time elapsed: 0.011 sec
Running org.apache.olingo.odata2.jpa.processor.core.model.JPAEdmFunctionImportTest
Tests run: 21, Failures: 0, Errors: 0, Skipped: 0, Time elapsed: 0.028 sec
Running org.apache.olingo.odata2.jpa.processor.core.model.JPAEdmModelTest
Tests run: 2, Failures: 0, Errors: 0, Skipped: 0, Time elapsed: 0.005 sec
Running org.apache.olingo.odata2.jpa.processor.core.model.JPAEdmBaseViewImplTest
Tests run: 4, Failures: 0, Errors: 0, Skipped: 0, Time elapsed: 0.001 sec
Running org.apache.olingo.odata2.jpa.processor.core.model.JPAEdmNavigationPropertyTest
Tests run: 6, Failures: 0, Errors: 0, Skipped: 0, Time elapsed: 0.004 sec
Running org.apache.olingo.odata2.jpa.processor.core.model.JPAEdmReferentialConstraintTest
Tests run: 5, Failures: 0, Errors: 0, Skipped: 0, Time elapsed: 0.005 sec
Running org.apache.olingo.odata2.jpa.processor.core.model.JPAEdmKeyTest
Tests run: 2, Failures: 0, Errors: 0, Skipped: 0, Time elapsed: 0.001 sec
Running org.apache.olingo.odata2.jpa.processor.core.model.JPAEdmEntitySetTest
Tests run: 6, Failures: 0, Errors: 0, Skipped: 0, Time elapsed: 0.004 sec
Running org.apache.olingo.odata2.jpa.processor.core.model.JPAEdmAssociationEndTest
Tests run: 9, Failures: 0, Errors: 0, Skipped: 0, Time elapsed: 0.002 sec
Running org.apache.olingo.odata2.jpa.processor.core.model.JPAEdmEntityContainerTest
Tests run: 7, Failures: 0, Errors: 0, Skipped: 0, Time elapsed: 0.003 sec
Running org.apache.olingo.odata2.jpa.processor.core.model.JPAEdmReferentialConstraintRoleTest
Tests run: 9, Failures: 0, Errors: 0, Skipped: 0, Time elapsed: 0.003 sec
Running org.apache.olingo.odata2.jpa.processor.core.model.JPAEdmSchemaTest
Tests run: 8, Failures: 0, Errors: 0, Skipped: 0, Time elapsed: 0.001 sec
Running org.apache.olingo.odata2.jpa.processor.core.model.JPAEdmPropertyTest
Tests run: 13, Failures: 0, Errors: 0, Skipped: 0, Time elapsed: 0.012 sec
Running org.apache.olingo.odata2.jpa.processor.core.model.JPAEdmComplexTypeTest
Tests run: 11, Failures: 0, Errors: 0, Skipped: 0, Time elapsed: 0.003 sec
Running org.apache.olingo.odata2.jpa.processor.core.access.data.JPAEntityParserForStaticMethodTest
Tests run: 18, Failures: 0, Errors: 0, Skipped: 0, Time elapsed: 0.005 sec
Running org.apache.olingo.odata2.jpa.processor.core.access.data.JPAQueryBuilderTest
Tests run: 26, Failures: 0, Errors: 0, Skipped: 0, Time elapsed: 0.072 sec
Running org.apache.olingo.odata2.jpa.processor.core.access.data.JPAPageBuilderDeltaTest
Tests run: 17, Failures: 0, Errors: 0, Skipped: 0, Time elapsed: 0.005 sec
Running org.apache.olingo.odata2.jpa.processor.core.access.data.JPAProcessorImplTest
Tests run: 5, Failures: 0, Errors: 0, Skipped: 0, Time elapsed: 0.013 sec
Running org.apache.olingo.odata2.jpa.processor.core.access.data.JPAEntityParserTest
Tests run: 14, Failures: 0, Errors: 0, Skipped: 0, Time elapsed: 0.017 sec
Running org.apache.olingo.odata2.jpa.processor.core.access.data.JPAPageBuilderTest
Tests run: 17, Failures: 0, Errors: 0, Skipped: 0, Time elapsed: 0.005 sec
Running org.apache.olingo.odata2.jpa.processor.core.access.data.JPALinkTest
Tests run: 3, Failures: 0, Errors: 0, Skipped: 0, Time elapsed: 0.034 sec
Running org.apache.olingo.odata2.jpa.processor.core.access.data.JPAEntityTest
Tests run: 11, Failures: 1, Errors: 0, Skipped: 0, Time elapsed: 0.087 sec <<< FAILURE!
testCreateODataEntryWithComplexTypeWithMoreProperties(org.apache.olingo.odata2.jpa.processor.core.access.data.JPAEntityTest) Time elapsed: 0.012 sec <<< FAILURE!
java.lang.AssertionError: expected:<1511175690384> but was:<1511175690383>
at org.junit.Assert.fail(Assert.java:93)
at org.junit.Assert.failNotEquals(Assert.java:647)
at org.junit.Assert.assertEquals(Assert.java:128)
at org.junit.Assert.assertEquals(Assert.java:472)
at org.junit.Assert.assertEquals(Assert.java:456)
at org.apache.olingo.odata2.jpa.processor.core.access.data.JPAEntityTest.testCreateODataEntryWithComplexTypeWithMoreProperties(JPAEntityTest.java:380)
at sun.reflect.NativeMethodAccessorImpl.invoke0(Native Method)
at sun.reflect.NativeMethodAccessorImpl.invoke(NativeMethodAccessorImpl.java:62)
at sun.reflect.DelegatingMethodAccessorImpl.invoke(DelegatingMethodAccessorImpl.java:43)
at java.lang.reflect.Method.invoke(Method.java:498)
at org.junit.runners.model.FrameworkMethod$1.runReflectiveCall(FrameworkMethod.java:44)
at org.junit.internal.runners.model.ReflectiveCallable.run(ReflectiveCallable.java:15)
at org.junit.runners.model.FrameworkMethod.invokeExplosively(FrameworkMethod.java:41)
at org.junit.internal.runners.statements.InvokeMethod.evaluate(InvokeMethod.java:20)
at org.junit.runners.ParentRunner.runLeaf(ParentRunner.java:263)
at org.junit.runners.BlockJUnit4ClassRunner.runChild(BlockJUnit4ClassRunner.java:69)
at org.junit.runners.BlockJUnit4ClassRunner.runChild(BlockJUnit4ClassRunner.java:48)
at org.junit.runners.ParentRunner$3.run(ParentRunner.java:231)
at org.junit.runners.ParentRunner$1.schedule(ParentRunner.java:60)
at org.junit.runners.ParentRunner.runChildren(ParentRunner.java:229)
at org.junit.runners.ParentRunner.access$000(ParentRunner.java:50)
at org.junit.runners.ParentRunner$2.evaluate(ParentRunner.java:222)
at org.junit.runners.ParentRunner.run(ParentRunner.java:292)
at org.apache.maven.surefire.junit4.JUnit4Provider.execute(JUnit4Provider.java:252)
at org.apache.maven.surefire.junit4.JUnit4Provider.executeTestSet(JUnit4Provider.java:141)
at org.apache.maven.surefire.junit4.JUnit4Provider.invoke(JUnit4Provider.java:112)
at sun.reflect.NativeMethodAccessorImpl.invoke0(Native Method)
at sun.reflect.NativeMethodAccessorImpl.invoke(NativeMethodAccessorImpl.java:62)
at sun.reflect.DelegatingMethodAccessorImpl.invoke(DelegatingMethodAccessorImpl.java:43)
at java.lang.reflect.Method.invoke(Method.java:498)
at org.apache.maven.surefire.util.ReflectionUtils.invokeMethodWithArray(ReflectionUtils.java:189)
at org.apache.maven.surefire.booter.ProviderFactory$ProviderProxy.invoke(ProviderFactory.java:165)
at org.apache.maven.surefire.booter.ProviderFactory.invokeProvider(ProviderFactory.java:85)
at org.apache.maven.surefire.booter.ForkedBooter.runSuitesInProcess(ForkedBooter.java:115)
at org.apache.maven.surefire.booter.ForkedBooter.main(ForkedBooter.java:75)
Running org.apache.olingo.odata2.jpa.processor.core.access.data.JPAFunctionContextTest
Tests run: 1, Failures: 0, Errors: 0, Skipped: 0, Time elapsed: 0.003 sec
Running org.apache.olingo.odata2.jpa.processor.core.access.data.JPAExpandCallBackTest
Tests run: 5, Failures: 0, Errors: 0, Skipped: 0, Time elapsed: 0.015 sec
Running org.apache.olingo.odata2.jpa.processor.core.access.model.JPAEdmMappingModelServiceTest
Tests run: 22, Failures: 0, Errors: 0, Skipped: 0, Time elapsed: 0.137 sec
Running org.apache.olingo.odata2.jpa.processor.core.access.model.JPAEdmNameBuilderTest
Tests run: 4, Failures: 0, Errors: 0, Skipped: 0, Time elapsed: 0.006 sec
Running org.apache.olingo.odata2.jpa.processor.core.access.model.JPATypeConverterTest
Tests run: 14, Failures: 0, Errors: 0, Skipped: 0, Time elapsed: 0.012 sec
Running org.apache.olingo.odata2.jpa.processor.core.ODataJPADefaultProcessorTest
Tests run: 6, Failures: 0, Errors: 0, Skipped: 0, Time elapsed: 0.026 sec
Running org.apache.olingo.odata2.jpa.processor.core.edm.ODataJPAEdmProviderNegativeTest
Tests run: 9, Failures: 0, Errors: 0, Skipped: 0, Time elapsed: 0.003 sec
Running org.apache.olingo.odata2.jpa.processor.core.edm.ODataJPAEdmProviderTest
Tests run: 15, Failures: 0, Errors: 0, Skipped: 0, Time elapsed: 0.021 sec
Results :
Failed tests: testCreateODataEntryWithComplexTypeWithMoreProperties(org.apache.olingo.odata2.jpa.processor.core.access.data.JPAEntityTest): expected:<1511175690384> but was:<1511175690383>
Tests run: 408, Failures: 1, Errors: 0, Skipped: 0
[INFO] ------------------------------------------------------------------------
[INFO] Reactor Summary:
[INFO]
[INFO] olingo-odata2-parent ............................... SUCCESS [ 7.370 s]
[INFO] olingo-odata2-lib .................................. SUCCESS [ 4.737 s]
[INFO] olingo-odata2-api .................................. SUCCESS [ 12.944 s]
[INFO] olingo-odata2-api-annotation ....................... SUCCESS [ 9.997 s]
[INFO] olingo-odata2-testutil ............................. SUCCESS [ 2.969 s]
[INFO] olingo-odata2-core ................................. SUCCESS [ 37.143 s]
[INFO] olingo-odata2-ref .................................. SUCCESS [ 11.416 s]
[INFO] olingo-odata2-fit .................................. SUCCESS [05:37 min]
[INFO] olingo-odata2-ref-web .............................. SUCCESS [ 1.422 s]
[INFO] olingo-odata2-jpa-processor ........................ SUCCESS [ 4.814 s]
[INFO] olingo-odata2-jpa-processor-api .................... SUCCESS [ 9.602 s]
[INFO] olingo-odata2-jpa-processor-core ................... FAILURE [ 5.872 s]
[INFO] olingo-odata2-jpa-processor-ref .................... SKIPPED
[INFO] olingo-odata2-jpa-processor-ref-web ................ SKIPPED
[INFO] olingo-odata2-annotation-processor ................. SKIPPED
[INFO] olingo-odata2-annotation-processor-api ............. SKIPPED
[INFO] olingo-odata2-annotation-processor-core ............ SKIPPED
[INFO] olingo-odata2-annotation-processor-ref ............. SKIPPED
[INFO] olingo-odata2-annotation-processor-ref-web ......... SKIPPED
[INFO] olingo-odata2-dist ................................. SKIPPED
[INFO] olingo-odata2-dist-lib ............................. SKIPPED
[INFO] olingo-odata2-dist-jpa ............................. SKIPPED
[INFO] olingo-odata2-dist-janos ........................... SKIPPED
[INFO] olingo-odata2-dist-ref ............................. SKIPPED
[INFO] olingo-odata2-dist-javadoc ......................... SKIPPED
[INFO] olingo-odata2-sample ............................... SKIPPED
[INFO] olingo-odata2-sample-cars-service-archetype ........ SKIPPED
[INFO] olingo-odata2-sample-cars-annotation-archetype ..... SKIPPED
[INFO] olingo-odata2-sample-cars-jpa-archetype ............ SKIPPED
[INFO] ------------------------------------------------------------------------
[INFO] BUILD FAILURE
[INFO] ------------------------------------------------------------------------
[INFO] Total time: 07:26 min
[INFO] Finished at: 2017-11-20T11:01:30Z
[INFO] Final Memory: 113M/3332M
[INFO] ------------------------------------------------------------------------
[ERROR] Failed to execute goal org.apache.maven.plugins:maven-surefire-plugin:2.12.4:test (default-test) on project olingo-odata2-jpa-processor-core: There are test failures.
[ERROR]
[ERROR] Please refer to <https://builds.apache.org/job/olingo-odata2/ws/odata2-jpa-processor/jpa-core/target/surefire-reports> for the individual test results.
[ERROR] -> [Help 1]
[ERROR]
[ERROR] To see the full stack trace of the errors, re-run Maven with the -e switch.
[ERROR] Re-run Maven using the -X switch to enable full debug logging.
[ERROR]
[ERROR] For more information about the errors and possible solutions, please read the following articles:
[ERROR] [Help 1] http://cwiki.apache.org/confluence/display/MAVEN/MojoFailureException
[ERROR]
[ERROR] After correcting the problems, you can resume the build with the command
[ERROR] mvn <goals> -rf :olingo-odata2-jpa-processor-core
Build step 'Invoke top-level Maven targets' marked build as failure
Not sending mail to unregistered user ramya.vasanth@sap.com
Not sending mail to unregistered user archana.rai@sap.com
Jenkins build is back to normal : olingo-odata2 #1366
Posted by Apache Jenkins Server <je...@builds.apache.org>.
See <https://builds.apache.org/job/olingo-odata2/1366/display/redirect>
Build failed in Jenkins: olingo-odata2 #1365
Posted by Apache Jenkins Server <je...@builds.apache.org>.
See <https://builds.apache.org/job/olingo-odata2/1365/display/redirect?page=changes>
Changes:
[archana.rai] [Olingo-1147]Entity read not working due to normalization
------------------------------------------
[...truncated 176.22 KB...]
[INFO]
[INFO] --- maven-site-plugin:3.2:attach-descriptor (attach-descriptor) @ olingo-odata2-annotation-processor ---
[INFO]
[INFO] --- maven-source-plugin:2.2.1:jar-no-fork (attach-sources) @ olingo-odata2-annotation-processor ---
[INFO]
[INFO] --- maven-checkstyle-plugin:2.10:check (checkstyle) @ olingo-odata2-annotation-processor ---
[INFO] Starting audit...
Audit done.
[INFO]
[INFO] --- maven-install-plugin:2.3.1:install (default-install) @ olingo-odata2-annotation-processor ---
[INFO] Installing <https://builds.apache.org/job/olingo-odata2/ws/odata2-annotation-processor/pom.xml> to /home/jenkins/.m2/repository/org/apache/olingo/olingo-odata2-annotation-processor/2.0.10-SNAPSHOT/olingo-odata2-annotation-processor-2.0.10-SNAPSHOT.pom
[INFO]
[INFO] --- maven-deploy-plugin:2.7:deploy (default-deploy) @ olingo-odata2-annotation-processor ---
Downloading from apache.snapshots.https: https://repository.apache.org/content/repositories/snapshots/org/apache/olingo/olingo-odata2-annotation-processor/2.0.10-SNAPSHOT/maven-metadata.xml
Progress (1): 632 B Downloaded from apache.snapshots.https: https://repository.apache.org/content/repositories/snapshots/org/apache/olingo/olingo-odata2-annotation-processor/2.0.10-SNAPSHOT/maven-metadata.xml (632 B at 1.1 kB/s)
Uploading to apache.snapshots.https: https://repository.apache.org/content/repositories/snapshots/org/apache/olingo/olingo-odata2-annotation-processor/2.0.10-SNAPSHOT/olingo-odata2-annotation-processor-2.0.10-20171129.104140-18.pom
Progress (1): 1.7 kB Uploaded to apache.snapshots.https: https://repository.apache.org/content/repositories/snapshots/org/apache/olingo/olingo-odata2-annotation-processor/2.0.10-SNAPSHOT/olingo-odata2-annotation-processor-2.0.10-20171129.104140-18.pom (1.7 kB at 1.5 kB/s)
Downloading from apache.snapshots.https: https://repository.apache.org/content/repositories/snapshots/org/apache/olingo/olingo-odata2-annotation-processor/maven-metadata.xml
Progress (1): 452 B Downloaded from apache.snapshots.https: https://repository.apache.org/content/repositories/snapshots/org/apache/olingo/olingo-odata2-annotation-processor/maven-metadata.xml (452 B at 742 B/s)
Uploading to apache.snapshots.https: https://repository.apache.org/content/repositories/snapshots/org/apache/olingo/olingo-odata2-annotation-processor/2.0.10-SNAPSHOT/maven-metadata.xml
Progress (1): 632 B Uploaded to apache.snapshots.https: https://repository.apache.org/content/repositories/snapshots/org/apache/olingo/olingo-odata2-annotation-processor/2.0.10-SNAPSHOT/maven-metadata.xml (632 B at 438 B/s)
Uploading to apache.snapshots.https: https://repository.apache.org/content/repositories/snapshots/org/apache/olingo/olingo-odata2-annotation-processor/maven-metadata.xml
Progress (1): 452 B Uploaded to apache.snapshots.https: https://repository.apache.org/content/repositories/snapshots/org/apache/olingo/olingo-odata2-annotation-processor/maven-metadata.xml (452 B at 407 B/s)
[INFO]
[INFO] ------------------------------------------------------------------------
[INFO] Building olingo-odata2-annotation-processor-api 2.0.10-SNAPSHOT
[INFO] ------------------------------------------------------------------------
[INFO]
[INFO] --- maven-clean-plugin:2.5:clean (default-clean) @ olingo-odata2-annotation-processor-api ---
[INFO] Deleting <https://builds.apache.org/job/olingo-odata2/ws/odata2-annotation-processor/annotation-processor-api/target>
[INFO]
[INFO] --- buildnumber-maven-plugin:1.2:create (default) @ olingo-odata2-annotation-processor-api ---
[INFO]
[INFO] --- maven-remote-resources-plugin:1.5:process (default) @ olingo-odata2-annotation-processor-api ---
[INFO]
[INFO] --- maven-resources-plugin:2.6:resources (default-resources) @ olingo-odata2-annotation-processor-api ---
[INFO] Using 'UTF-8' encoding to copy filtered resources.
[INFO] skip non existing resourceDirectory <https://builds.apache.org/job/olingo-odata2/ws/odata2-annotation-processor/annotation-processor-api/src/main/resources>
[INFO] Copying 3 resources
[INFO]
[INFO] --- maven-compiler-plugin:2.3.2:compile (default-compile) @ olingo-odata2-annotation-processor-api ---
[INFO] Compiling 2 source files to <https://builds.apache.org/job/olingo-odata2/ws/odata2-annotation-processor/annotation-processor-api/target/classes>
[INFO]
[INFO] --- maven-bundle-plugin:2.3.7:manifest (bundle-manifest) @ olingo-odata2-annotation-processor-api ---
[WARNING] Manifest org.apache.olingo:olingo-odata2-annotation-processor-api:jar:2.0.10-SNAPSHOT : Superfluous export-package instructions: [org.apache.olingo.odata2.annotation.processor.api.*]
[INFO]
[INFO] --- maven-resources-plugin:2.6:testResources (default-testResources) @ olingo-odata2-annotation-processor-api ---
[INFO] Using 'UTF-8' encoding to copy filtered resources.
[INFO] skip non existing resourceDirectory <https://builds.apache.org/job/olingo-odata2/ws/odata2-annotation-processor/annotation-processor-api/src/test/resources>
[INFO] Copying 3 resources
[INFO]
[INFO] --- maven-compiler-plugin:2.3.2:testCompile (default-testCompile) @ olingo-odata2-annotation-processor-api ---
[INFO] No sources to compile
[INFO]
[INFO] --- maven-surefire-plugin:2.12.4:test (default-test) @ olingo-odata2-annotation-processor-api ---
[INFO]
[INFO] --- maven-jar-plugin:2.3.2:jar (default-jar) @ olingo-odata2-annotation-processor-api ---
[INFO] Building jar: <https://builds.apache.org/job/olingo-odata2/ws/odata2-annotation-processor/annotation-processor-api/target/olingo-odata2-annotation-processor-api-2.0.10-SNAPSHOT.jar>
[INFO]
[INFO] --- maven-site-plugin:3.2:attach-descriptor (attach-descriptor) @ olingo-odata2-annotation-processor-api ---
[INFO]
[INFO] --- maven-source-plugin:2.2.1:jar-no-fork (attach-sources) @ olingo-odata2-annotation-processor-api ---
[INFO] Building jar: <https://builds.apache.org/job/olingo-odata2/ws/odata2-annotation-processor/annotation-processor-api/target/olingo-odata2-annotation-processor-api-2.0.10-SNAPSHOT-sources.jar>
[INFO]
[INFO] --- maven-checkstyle-plugin:2.10:check (checkstyle) @ olingo-odata2-annotation-processor-api ---
[INFO] Starting audit...
Audit done.
[INFO]
[INFO] --- maven-install-plugin:2.3.1:install (default-install) @ olingo-odata2-annotation-processor-api ---
[INFO] Installing <https://builds.apache.org/job/olingo-odata2/ws/odata2-annotation-processor/annotation-processor-api/target/olingo-odata2-annotation-processor-api-2.0.10-SNAPSHOT.jar> to /home/jenkins/.m2/repository/org/apache/olingo/olingo-odata2-annotation-processor-api/2.0.10-SNAPSHOT/olingo-odata2-annotation-processor-api-2.0.10-SNAPSHOT.jar
[INFO] Installing <https://builds.apache.org/job/olingo-odata2/ws/odata2-annotation-processor/annotation-processor-api/pom.xml> to /home/jenkins/.m2/repository/org/apache/olingo/olingo-odata2-annotation-processor-api/2.0.10-SNAPSHOT/olingo-odata2-annotation-processor-api-2.0.10-SNAPSHOT.pom
[INFO] Installing <https://builds.apache.org/job/olingo-odata2/ws/odata2-annotation-processor/annotation-processor-api/target/olingo-odata2-annotation-processor-api-2.0.10-SNAPSHOT-sources.jar> to /home/jenkins/.m2/repository/org/apache/olingo/olingo-odata2-annotation-processor-api/2.0.10-SNAPSHOT/olingo-odata2-annotation-processor-api-2.0.10-SNAPSHOT-sources.jar
[INFO]
[INFO] --- maven-deploy-plugin:2.7:deploy (default-deploy) @ olingo-odata2-annotation-processor-api ---
Downloading from apache.snapshots.https: https://repository.apache.org/content/repositories/snapshots/org/apache/olingo/olingo-odata2-annotation-processor-api/2.0.10-SNAPSHOT/maven-metadata.xml
Progress (1): 1.0 kB Downloaded from apache.snapshots.https: https://repository.apache.org/content/repositories/snapshots/org/apache/olingo/olingo-odata2-annotation-processor-api/2.0.10-SNAPSHOT/maven-metadata.xml (1.0 kB at 1.8 kB/s)
Uploading to apache.snapshots.https: https://repository.apache.org/content/repositories/snapshots/org/apache/olingo/olingo-odata2-annotation-processor-api/2.0.10-SNAPSHOT/olingo-odata2-annotation-processor-api-2.0.10-20171129.104146-18.jar
Progress (1): 2.0/10 kBProgress (1): 4.1/10 kBProgress (1): 6.1/10 kBProgress (1): 8.2/10 kBProgress (1): 10/10 kB Progress (1): 10 kB Uploaded to apache.snapshots.https: https://repository.apache.org/content/repositories/snapshots/org/apache/olingo/olingo-odata2-annotation-processor-api/2.0.10-SNAPSHOT/olingo-odata2-annotation-processor-api-2.0.10-20171129.104146-18.jar (10 kB at 9.5 kB/s)
Uploading to apache.snapshots.https: https://repository.apache.org/content/repositories/snapshots/org/apache/olingo/olingo-odata2-annotation-processor-api/2.0.10-SNAPSHOT/olingo-odata2-annotation-processor-api-2.0.10-20171129.104146-18.pom
Progress (1): 2.0/3.1 kBProgress (1): 3.1 kB Uploaded to apache.snapshots.https: https://repository.apache.org/content/repositories/snapshots/org/apache/olingo/olingo-odata2-annotation-processor-api/2.0.10-SNAPSHOT/olingo-odata2-annotation-processor-api-2.0.10-20171129.104146-18.pom (3.1 kB at 2.8 kB/s)
Downloading from apache.snapshots.https: https://repository.apache.org/content/repositories/snapshots/org/apache/olingo/olingo-odata2-annotation-processor-api/maven-metadata.xml
Progress (1): 456 B Downloaded from apache.snapshots.https: https://repository.apache.org/content/repositories/snapshots/org/apache/olingo/olingo-odata2-annotation-processor-api/maven-metadata.xml (456 B at 788 B/s)
Uploading to apache.snapshots.https: https://repository.apache.org/content/repositories/snapshots/org/apache/olingo/olingo-odata2-annotation-processor-api/2.0.10-SNAPSHOT/maven-metadata.xml
Progress (1): 1.0 kB Uploaded to apache.snapshots.https: https://repository.apache.org/content/repositories/snapshots/org/apache/olingo/olingo-odata2-annotation-processor-api/2.0.10-SNAPSHOT/maven-metadata.xml (1.0 kB at 922 B/s)
Uploading to apache.snapshots.https: https://repository.apache.org/content/repositories/snapshots/org/apache/olingo/olingo-odata2-annotation-processor-api/maven-metadata.xml
Progress (1): 456 B Uploaded to apache.snapshots.https: https://repository.apache.org/content/repositories/snapshots/org/apache/olingo/olingo-odata2-annotation-processor-api/maven-metadata.xml (456 B at 410 B/s)
Uploading to apache.snapshots.https: https://repository.apache.org/content/repositories/snapshots/org/apache/olingo/olingo-odata2-annotation-processor-api/2.0.10-SNAPSHOT/olingo-odata2-annotation-processor-api-2.0.10-20171129.104146-18-sources.jar
Progress (1): 2.0/8.4 kBProgress (1): 4.1/8.4 kBProgress (1): 6.1/8.4 kBProgress (1): 8.2/8.4 kBProgress (1): 8.4 kB Uploaded to apache.snapshots.https: https://repository.apache.org/content/repositories/snapshots/org/apache/olingo/olingo-odata2-annotation-processor-api/2.0.10-SNAPSHOT/olingo-odata2-annotation-processor-api-2.0.10-20171129.104146-18-sources.jar (8.4 kB at 7.6 kB/s)
Uploading to apache.snapshots.https: https://repository.apache.org/content/repositories/snapshots/org/apache/olingo/olingo-odata2-annotation-processor-api/2.0.10-SNAPSHOT/maven-metadata.xml
Progress (1): 1.0 kB Uploaded to apache.snapshots.https: https://repository.apache.org/content/repositories/snapshots/org/apache/olingo/olingo-odata2-annotation-processor-api/2.0.10-SNAPSHOT/maven-metadata.xml (1.0 kB at 929 B/s)
[INFO]
[INFO] ------------------------------------------------------------------------
[INFO] Building olingo-odata2-annotation-processor-core 2.0.10-SNAPSHOT
[INFO] ------------------------------------------------------------------------
[INFO]
[INFO] --- maven-clean-plugin:2.5:clean (default-clean) @ olingo-odata2-annotation-processor-core ---
[INFO] Deleting <https://builds.apache.org/job/olingo-odata2/ws/odata2-annotation-processor/annotation-processor-core/target>
[INFO]
[INFO] --- buildnumber-maven-plugin:1.2:create (default) @ olingo-odata2-annotation-processor-core ---
[INFO]
[INFO] --- maven-remote-resources-plugin:1.5:process (default) @ olingo-odata2-annotation-processor-core ---
[INFO]
[INFO] --- maven-resources-plugin:2.6:resources (default-resources) @ olingo-odata2-annotation-processor-core ---
[INFO] Using 'UTF-8' encoding to copy filtered resources.
[INFO] skip non existing resourceDirectory <https://builds.apache.org/job/olingo-odata2/ws/odata2-annotation-processor/annotation-processor-core/src/main/resources>
[INFO] Copying 3 resources
[INFO]
[INFO] --- maven-compiler-plugin:2.3.2:compile (default-compile) @ olingo-odata2-annotation-processor-core ---
[INFO] Compiling 13 source files to <https://builds.apache.org/job/olingo-odata2/ws/odata2-annotation-processor/annotation-processor-core/target/classes>
[INFO]
[INFO] --- maven-bundle-plugin:2.3.7:manifest (bundle-manifest) @ olingo-odata2-annotation-processor-core ---
[INFO]
[INFO] --- maven-resources-plugin:2.6:testResources (default-testResources) @ olingo-odata2-annotation-processor-core ---
[INFO] Using 'UTF-8' encoding to copy filtered resources.
[INFO] skip non existing resourceDirectory <https://builds.apache.org/job/olingo-odata2/ws/odata2-annotation-processor/annotation-processor-core/src/test/resources>
[INFO] Copying 3 resources
[INFO]
[INFO] --- maven-compiler-plugin:2.3.2:testCompile (default-testCompile) @ olingo-odata2-annotation-processor-core ---
[INFO] Compiling 21 source files to <https://builds.apache.org/job/olingo-odata2/ws/odata2-annotation-processor/annotation-processor-core/target/test-classes>
[INFO]
[INFO] --- maven-surefire-plugin:2.12.4:test (default-test) @ olingo-odata2-annotation-processor-core ---
[INFO] Surefire report directory: <https://builds.apache.org/job/olingo-odata2/ws/odata2-annotation-processor/annotation-processor-core/target/surefire-reports>
-------------------------------------------------------
T E S T S
-------------------------------------------------------
Running org.apache.olingo.odata2.annotation.processor.core.ListsProcessorTest
Tests run: 4, Failures: 0, Errors: 0, Skipped: 0, Time elapsed: 0.219 sec
Running org.apache.olingo.odata2.annotation.processor.core.util.ClassHelperTest
Tests run: 4, Failures: 0, Errors: 1, Skipped: 0, Time elapsed: 0.019 sec <<< FAILURE!
loadFromDirWithUnsafeName(org.apache.olingo.odata2.annotation.processor.core.util.ClassHelperTest) Time elapsed: 0.007 sec <<< ERROR!
java.lang.Exception: Unexpected exception, expected<java.lang.ClassFormatError> but was<java.lang.IllegalArgumentException>
at org.junit.internal.runners.statements.ExpectException.evaluate(ExpectException.java:31)
at org.junit.runners.ParentRunner.runLeaf(ParentRunner.java:263)
at org.junit.runners.BlockJUnit4ClassRunner.runChild(BlockJUnit4ClassRunner.java:68)
at org.junit.runners.BlockJUnit4ClassRunner.runChild(BlockJUnit4ClassRunner.java:47)
at org.junit.runners.ParentRunner$3.run(ParentRunner.java:231)
at org.junit.runners.ParentRunner$1.schedule(ParentRunner.java:60)
at org.junit.runners.ParentRunner.runChildren(ParentRunner.java:229)
at org.junit.runners.ParentRunner.access$000(ParentRunner.java:50)
at org.junit.runners.ParentRunner$2.evaluate(ParentRunner.java:222)
at org.junit.runners.ParentRunner.run(ParentRunner.java:300)
at org.apache.maven.surefire.junit4.JUnit4Provider.execute(JUnit4Provider.java:252)
at org.apache.maven.surefire.junit4.JUnit4Provider.executeTestSet(JUnit4Provider.java:141)
at org.apache.maven.surefire.junit4.JUnit4Provider.invoke(JUnit4Provider.java:112)
at sun.reflect.NativeMethodAccessorImpl.invoke0(Native Method)
at sun.reflect.NativeMethodAccessorImpl.invoke(NativeMethodAccessorImpl.java:62)
at sun.reflect.DelegatingMethodAccessorImpl.invoke(DelegatingMethodAccessorImpl.java:43)
at java.lang.reflect.Method.invoke(Method.java:498)
at org.apache.maven.surefire.util.ReflectionUtils.invokeMethodWithArray(ReflectionUtils.java:189)
at org.apache.maven.surefire.booter.ProviderFactory$ProviderProxy.invoke(ProviderFactory.java:165)
at org.apache.maven.surefire.booter.ProviderFactory.invokeProvider(ProviderFactory.java:85)
at org.apache.maven.surefire.booter.ForkedBooter.runSuitesInProcess(ForkedBooter.java:115)
at org.apache.maven.surefire.booter.ForkedBooter.main(ForkedBooter.java:75)
Caused by: java.lang.IllegalArgumentException: No folder to scan found for package 'space space.package'.
at org.apache.olingo.odata2.annotation.processor.core.util.ClassHelper.getResourceUri(ClassHelper.java:110)
at org.apache.olingo.odata2.annotation.processor.core.util.ClassHelper.loadClasses(ClassHelper.java:73)
at org.apache.olingo.odata2.annotation.processor.core.util.ClassHelper.loadClasses(ClassHelper.java:66)
at org.apache.olingo.odata2.annotation.processor.core.util.ClassHelperTest.loadFromDirWithUnsafeName(ClassHelperTest.java:91)
at sun.reflect.NativeMethodAccessorImpl.invoke0(Native Method)
at sun.reflect.NativeMethodAccessorImpl.invoke(NativeMethodAccessorImpl.java:62)
at sun.reflect.DelegatingMethodAccessorImpl.invoke(DelegatingMethodAccessorImpl.java:43)
at java.lang.reflect.Method.invoke(Method.java:498)
at org.junit.runners.model.FrameworkMethod$1.runReflectiveCall(FrameworkMethod.java:45)
at org.junit.internal.runners.model.ReflectiveCallable.run(ReflectiveCallable.java:15)
at org.junit.runners.model.FrameworkMethod.invokeExplosively(FrameworkMethod.java:42)
at org.junit.internal.runners.statements.InvokeMethod.evaluate(InvokeMethod.java:20)
at org.junit.internal.runners.statements.ExpectException.evaluate(ExpectException.java:22)
... 21 more
Running org.apache.olingo.odata2.annotation.processor.core.util.AnnotationHelperTest
Tests run: 21, Failures: 0, Errors: 0, Skipped: 0, Time elapsed: 0.035 sec
Running org.apache.olingo.odata2.annotation.processor.core.AnnotationServiceFactoryImplTest
Tests run: 3, Failures: 0, Errors: 0, Skipped: 0, Time elapsed: 0.025 sec
Running org.apache.olingo.odata2.annotation.processor.core.datasource.AnnotationsInMemoryDsTest
Tests run: 34, Failures: 0, Errors: 0, Skipped: 2, Time elapsed: 0.345 sec
Running org.apache.olingo.odata2.annotation.processor.core.datasource.AnnotationValueAccessTest
Tests run: 17, Failures: 0, Errors: 0, Skipped: 0, Time elapsed: 0.018 sec
Running org.apache.olingo.odata2.annotation.processor.core.datasource.BeanPropertyAccessTest
Tests run: 15, Failures: 0, Errors: 0, Skipped: 0, Time elapsed: 0.012 sec
Running org.apache.olingo.odata2.annotation.processor.core.edm.AnnotationEdmProviderNamespacesTest
Tests run: 5, Failures: 0, Errors: 0, Skipped: 1, Time elapsed: 0.028 sec
Running org.apache.olingo.odata2.annotation.processor.core.edm.AnnotationEdmProviderTest
Tests run: 17, Failures: 0, Errors: 0, Skipped: 0, Time elapsed: 0.02 sec
Results :
Tests in error:
loadFromDirWithUnsafeName(org.apache.olingo.odata2.annotation.processor.core.util.ClassHelperTest): Unexpected exception, expected<java.lang.ClassFormatError> but was<java.lang.IllegalArgumentException>
Tests run: 120, Failures: 0, Errors: 1, Skipped: 3
[INFO] ------------------------------------------------------------------------
[INFO] Reactor Summary:
[INFO]
[INFO] olingo-odata2-parent ............................... SUCCESS [ 7.743 s]
[INFO] olingo-odata2-lib .................................. SUCCESS [ 4.743 s]
[INFO] olingo-odata2-api .................................. SUCCESS [ 13.786 s]
[INFO] olingo-odata2-api-annotation ....................... SUCCESS [ 9.049 s]
[INFO] olingo-odata2-testutil ............................. SUCCESS [ 3.614 s]
[INFO] olingo-odata2-core ................................. SUCCESS [ 36.337 s]
[INFO] olingo-odata2-ref .................................. SUCCESS [ 11.787 s]
[INFO] olingo-odata2-fit .................................. SUCCESS [05:38 min]
[INFO] olingo-odata2-ref-web .............................. SUCCESS [ 1.562 s]
[INFO] olingo-odata2-jpa-processor ........................ SUCCESS [ 4.755 s]
[INFO] olingo-odata2-jpa-processor-api .................... SUCCESS [ 9.758 s]
[INFO] olingo-odata2-jpa-processor-core ................... SUCCESS [ 15.900 s]
[INFO] olingo-odata2-jpa-processor-ref .................... SUCCESS [ 9.985 s]
[INFO] olingo-odata2-jpa-processor-ref-web ................ SUCCESS [ 2.376 s]
[INFO] olingo-odata2-annotation-processor ................. SUCCESS [ 4.997 s]
[INFO] olingo-odata2-annotation-processor-api ............. SUCCESS [ 8.543 s]
[INFO] olingo-odata2-annotation-processor-core ............ FAILURE [ 3.799 s]
[INFO] olingo-odata2-annotation-processor-ref ............. SKIPPED
[INFO] olingo-odata2-annotation-processor-ref-web ......... SKIPPED
[INFO] olingo-odata2-dist ................................. SKIPPED
[INFO] olingo-odata2-dist-lib ............................. SKIPPED
[INFO] olingo-odata2-dist-jpa ............................. SKIPPED
[INFO] olingo-odata2-dist-janos ........................... SKIPPED
[INFO] olingo-odata2-dist-ref ............................. SKIPPED
[INFO] olingo-odata2-dist-javadoc ......................... SKIPPED
[INFO] olingo-odata2-sample ............................... SKIPPED
[INFO] olingo-odata2-sample-cars-service-archetype ........ SKIPPED
[INFO] olingo-odata2-sample-cars-annotation-archetype ..... SKIPPED
[INFO] olingo-odata2-sample-cars-jpa-archetype ............ SKIPPED
[INFO] ------------------------------------------------------------------------
[INFO] BUILD FAILURE
[INFO] ------------------------------------------------------------------------
[INFO] Total time: 08:09 min
[INFO] Finished at: 2017-11-29T10:41:57Z
[INFO] Final Memory: 144M/3355M
[INFO] ------------------------------------------------------------------------
[ERROR] Failed to execute goal org.apache.maven.plugins:maven-surefire-plugin:2.12.4:test (default-test) on project olingo-odata2-annotation-processor-core: There are test failures.
[ERROR]
[ERROR] Please refer to <https://builds.apache.org/job/olingo-odata2/ws/odata2-annotation-processor/annotation-processor-core/target/surefire-reports> for the individual test results.
[ERROR] -> [Help 1]
[ERROR]
[ERROR] To see the full stack trace of the errors, re-run Maven with the -e switch.
[ERROR] Re-run Maven using the -X switch to enable full debug logging.
[ERROR]
[ERROR] For more information about the errors and possible solutions, please read the following articles:
[ERROR] [Help 1] http://cwiki.apache.org/confluence/display/MAVEN/MojoFailureException
[ERROR]
[ERROR] After correcting the problems, you can resume the build with the command
[ERROR] mvn <goals> -rf :olingo-odata2-annotation-processor-core
Build step 'Invoke top-level Maven targets' marked build as failure
Not sending mail to unregistered user ramya.vasanth@sap.com
Not sending mail to unregistered user archana.rai@sap.com
Build failed in Jenkins: olingo-odata2 #1364
Posted by Apache Jenkins Server <je...@builds.apache.org>.
See <https://builds.apache.org/job/olingo-odata2/1364/display/redirect?page=changes>
Changes:
[archana.rai] [OLINGO-752]Add support for + sign as a separator in addition to %20 for
------------------------------------------
[...truncated 176.26 KB...]
[INFO]
[INFO] --- maven-site-plugin:3.2:attach-descriptor (attach-descriptor) @ olingo-odata2-annotation-processor ---
[INFO]
[INFO] --- maven-source-plugin:2.2.1:jar-no-fork (attach-sources) @ olingo-odata2-annotation-processor ---
[INFO]
[INFO] --- maven-checkstyle-plugin:2.10:check (checkstyle) @ olingo-odata2-annotation-processor ---
[INFO] Starting audit...
Audit done.
[INFO]
[INFO] --- maven-install-plugin:2.3.1:install (default-install) @ olingo-odata2-annotation-processor ---
[INFO] Installing <https://builds.apache.org/job/olingo-odata2/ws/odata2-annotation-processor/pom.xml> to /home/jenkins/.m2/repository/org/apache/olingo/olingo-odata2-annotation-processor/2.0.10-SNAPSHOT/olingo-odata2-annotation-processor-2.0.10-SNAPSHOT.pom
[INFO]
[INFO] --- maven-deploy-plugin:2.7:deploy (default-deploy) @ olingo-odata2-annotation-processor ---
Downloading from apache.snapshots.https: https://repository.apache.org/content/repositories/snapshots/org/apache/olingo/olingo-odata2-annotation-processor/2.0.10-SNAPSHOT/maven-metadata.xml
Progress (1): 632 B Downloaded from apache.snapshots.https: https://repository.apache.org/content/repositories/snapshots/org/apache/olingo/olingo-odata2-annotation-processor/2.0.10-SNAPSHOT/maven-metadata.xml (632 B at 1.1 kB/s)
Uploading to apache.snapshots.https: https://repository.apache.org/content/repositories/snapshots/org/apache/olingo/olingo-odata2-annotation-processor/2.0.10-SNAPSHOT/olingo-odata2-annotation-processor-2.0.10-20171121.062533-17.pom
Progress (1): 1.7 kB Uploaded to apache.snapshots.https: https://repository.apache.org/content/repositories/snapshots/org/apache/olingo/olingo-odata2-annotation-processor/2.0.10-SNAPSHOT/olingo-odata2-annotation-processor-2.0.10-20171121.062533-17.pom (1.7 kB at 1.5 kB/s)
Downloading from apache.snapshots.https: https://repository.apache.org/content/repositories/snapshots/org/apache/olingo/olingo-odata2-annotation-processor/maven-metadata.xml
Progress (1): 452 B Downloaded from apache.snapshots.https: https://repository.apache.org/content/repositories/snapshots/org/apache/olingo/olingo-odata2-annotation-processor/maven-metadata.xml (452 B at 791 B/s)
Uploading to apache.snapshots.https: https://repository.apache.org/content/repositories/snapshots/org/apache/olingo/olingo-odata2-annotation-processor/2.0.10-SNAPSHOT/maven-metadata.xml
Progress (1): 632 B Uploaded to apache.snapshots.https: https://repository.apache.org/content/repositories/snapshots/org/apache/olingo/olingo-odata2-annotation-processor/2.0.10-SNAPSHOT/maven-metadata.xml (632 B at 564 B/s)
Uploading to apache.snapshots.https: https://repository.apache.org/content/repositories/snapshots/org/apache/olingo/olingo-odata2-annotation-processor/maven-metadata.xml
Progress (1): 452 B Uploaded to apache.snapshots.https: https://repository.apache.org/content/repositories/snapshots/org/apache/olingo/olingo-odata2-annotation-processor/maven-metadata.xml (452 B at 410 B/s)
[INFO]
[INFO] ------------------------------------------------------------------------
[INFO] Building olingo-odata2-annotation-processor-api 2.0.10-SNAPSHOT
[INFO] ------------------------------------------------------------------------
[INFO]
[INFO] --- maven-clean-plugin:2.5:clean (default-clean) @ olingo-odata2-annotation-processor-api ---
[INFO] Deleting <https://builds.apache.org/job/olingo-odata2/ws/odata2-annotation-processor/annotation-processor-api/target>
[INFO]
[INFO] --- buildnumber-maven-plugin:1.2:create (default) @ olingo-odata2-annotation-processor-api ---
[INFO]
[INFO] --- maven-remote-resources-plugin:1.5:process (default) @ olingo-odata2-annotation-processor-api ---
[INFO]
[INFO] --- maven-resources-plugin:2.6:resources (default-resources) @ olingo-odata2-annotation-processor-api ---
[INFO] Using 'UTF-8' encoding to copy filtered resources.
[INFO] skip non existing resourceDirectory <https://builds.apache.org/job/olingo-odata2/ws/odata2-annotation-processor/annotation-processor-api/src/main/resources>
[INFO] Copying 3 resources
[INFO]
[INFO] --- maven-compiler-plugin:2.3.2:compile (default-compile) @ olingo-odata2-annotation-processor-api ---
[INFO] Compiling 2 source files to <https://builds.apache.org/job/olingo-odata2/ws/odata2-annotation-processor/annotation-processor-api/target/classes>
[INFO]
[INFO] --- maven-bundle-plugin:2.3.7:manifest (bundle-manifest) @ olingo-odata2-annotation-processor-api ---
[WARNING] Manifest org.apache.olingo:olingo-odata2-annotation-processor-api:jar:2.0.10-SNAPSHOT : Superfluous export-package instructions: [org.apache.olingo.odata2.annotation.processor.api.*]
[INFO]
[INFO] --- maven-resources-plugin:2.6:testResources (default-testResources) @ olingo-odata2-annotation-processor-api ---
[INFO] Using 'UTF-8' encoding to copy filtered resources.
[INFO] skip non existing resourceDirectory <https://builds.apache.org/job/olingo-odata2/ws/odata2-annotation-processor/annotation-processor-api/src/test/resources>
[INFO] Copying 3 resources
[INFO]
[INFO] --- maven-compiler-plugin:2.3.2:testCompile (default-testCompile) @ olingo-odata2-annotation-processor-api ---
[INFO] No sources to compile
[INFO]
[INFO] --- maven-surefire-plugin:2.12.4:test (default-test) @ olingo-odata2-annotation-processor-api ---
[INFO]
[INFO] --- maven-jar-plugin:2.3.2:jar (default-jar) @ olingo-odata2-annotation-processor-api ---
[INFO] Building jar: <https://builds.apache.org/job/olingo-odata2/ws/odata2-annotation-processor/annotation-processor-api/target/olingo-odata2-annotation-processor-api-2.0.10-SNAPSHOT.jar>
[INFO]
[INFO] --- maven-site-plugin:3.2:attach-descriptor (attach-descriptor) @ olingo-odata2-annotation-processor-api ---
[INFO]
[INFO] --- maven-source-plugin:2.2.1:jar-no-fork (attach-sources) @ olingo-odata2-annotation-processor-api ---
[INFO] Building jar: <https://builds.apache.org/job/olingo-odata2/ws/odata2-annotation-processor/annotation-processor-api/target/olingo-odata2-annotation-processor-api-2.0.10-SNAPSHOT-sources.jar>
[INFO]
[INFO] --- maven-checkstyle-plugin:2.10:check (checkstyle) @ olingo-odata2-annotation-processor-api ---
[INFO] Starting audit...
Audit done.
[INFO]
[INFO] --- maven-install-plugin:2.3.1:install (default-install) @ olingo-odata2-annotation-processor-api ---
[INFO] Installing <https://builds.apache.org/job/olingo-odata2/ws/odata2-annotation-processor/annotation-processor-api/target/olingo-odata2-annotation-processor-api-2.0.10-SNAPSHOT.jar> to /home/jenkins/.m2/repository/org/apache/olingo/olingo-odata2-annotation-processor-api/2.0.10-SNAPSHOT/olingo-odata2-annotation-processor-api-2.0.10-SNAPSHOT.jar
[INFO] Installing <https://builds.apache.org/job/olingo-odata2/ws/odata2-annotation-processor/annotation-processor-api/pom.xml> to /home/jenkins/.m2/repository/org/apache/olingo/olingo-odata2-annotation-processor-api/2.0.10-SNAPSHOT/olingo-odata2-annotation-processor-api-2.0.10-SNAPSHOT.pom
[INFO] Installing <https://builds.apache.org/job/olingo-odata2/ws/odata2-annotation-processor/annotation-processor-api/target/olingo-odata2-annotation-processor-api-2.0.10-SNAPSHOT-sources.jar> to /home/jenkins/.m2/repository/org/apache/olingo/olingo-odata2-annotation-processor-api/2.0.10-SNAPSHOT/olingo-odata2-annotation-processor-api-2.0.10-SNAPSHOT-sources.jar
[INFO]
[INFO] --- maven-deploy-plugin:2.7:deploy (default-deploy) @ olingo-odata2-annotation-processor-api ---
Downloading from apache.snapshots.https: https://repository.apache.org/content/repositories/snapshots/org/apache/olingo/olingo-odata2-annotation-processor-api/2.0.10-SNAPSHOT/maven-metadata.xml
Progress (1): 1.0 kB Downloaded from apache.snapshots.https: https://repository.apache.org/content/repositories/snapshots/org/apache/olingo/olingo-odata2-annotation-processor-api/2.0.10-SNAPSHOT/maven-metadata.xml (1.0 kB at 1.9 kB/s)
Uploading to apache.snapshots.https: https://repository.apache.org/content/repositories/snapshots/org/apache/olingo/olingo-odata2-annotation-processor-api/2.0.10-SNAPSHOT/olingo-odata2-annotation-processor-api-2.0.10-20171121.062538-17.jar
Progress (1): 2.0/10 kBProgress (1): 4.1/10 kBProgress (1): 6.1/10 kBProgress (1): 8.2/10 kBProgress (1): 10/10 kB Progress (1): 10 kB Uploaded to apache.snapshots.https: https://repository.apache.org/content/repositories/snapshots/org/apache/olingo/olingo-odata2-annotation-processor-api/2.0.10-SNAPSHOT/olingo-odata2-annotation-processor-api-2.0.10-20171121.062538-17.jar (10 kB at 9.5 kB/s)
Uploading to apache.snapshots.https: https://repository.apache.org/content/repositories/snapshots/org/apache/olingo/olingo-odata2-annotation-processor-api/2.0.10-SNAPSHOT/olingo-odata2-annotation-processor-api-2.0.10-20171121.062538-17.pom
Progress (1): 2.0/3.1 kBProgress (1): 3.1 kB Uploaded to apache.snapshots.https: https://repository.apache.org/content/repositories/snapshots/org/apache/olingo/olingo-odata2-annotation-processor-api/2.0.10-SNAPSHOT/olingo-odata2-annotation-processor-api-2.0.10-20171121.062538-17.pom (3.1 kB at 2.8 kB/s)
Downloading from apache.snapshots.https: https://repository.apache.org/content/repositories/snapshots/org/apache/olingo/olingo-odata2-annotation-processor-api/maven-metadata.xml
Progress (1): 456 B Downloaded from apache.snapshots.https: https://repository.apache.org/content/repositories/snapshots/org/apache/olingo/olingo-odata2-annotation-processor-api/maven-metadata.xml (456 B at 808 B/s)
Uploading to apache.snapshots.https: https://repository.apache.org/content/repositories/snapshots/org/apache/olingo/olingo-odata2-annotation-processor-api/2.0.10-SNAPSHOT/maven-metadata.xml
Progress (1): 1.0 kB Uploaded to apache.snapshots.https: https://repository.apache.org/content/repositories/snapshots/org/apache/olingo/olingo-odata2-annotation-processor-api/2.0.10-SNAPSHOT/maven-metadata.xml (1.0 kB at 935 B/s)
Uploading to apache.snapshots.https: https://repository.apache.org/content/repositories/snapshots/org/apache/olingo/olingo-odata2-annotation-processor-api/maven-metadata.xml
Progress (1): 456 B Uploaded to apache.snapshots.https: https://repository.apache.org/content/repositories/snapshots/org/apache/olingo/olingo-odata2-annotation-processor-api/maven-metadata.xml (456 B at 410 B/s)
Uploading to apache.snapshots.https: https://repository.apache.org/content/repositories/snapshots/org/apache/olingo/olingo-odata2-annotation-processor-api/2.0.10-SNAPSHOT/olingo-odata2-annotation-processor-api-2.0.10-20171121.062538-17-sources.jar
Progress (1): 2.0/8.4 kBProgress (1): 4.1/8.4 kBProgress (1): 6.1/8.4 kBProgress (1): 8.2/8.4 kBProgress (1): 8.4 kB Uploaded to apache.snapshots.https: https://repository.apache.org/content/repositories/snapshots/org/apache/olingo/olingo-odata2-annotation-processor-api/2.0.10-SNAPSHOT/olingo-odata2-annotation-processor-api-2.0.10-20171121.062538-17-sources.jar (8.4 kB at 7.5 kB/s)
Uploading to apache.snapshots.https: https://repository.apache.org/content/repositories/snapshots/org/apache/olingo/olingo-odata2-annotation-processor-api/2.0.10-SNAPSHOT/maven-metadata.xml
Progress (1): 1.0 kB Uploaded to apache.snapshots.https: https://repository.apache.org/content/repositories/snapshots/org/apache/olingo/olingo-odata2-annotation-processor-api/2.0.10-SNAPSHOT/maven-metadata.xml (1.0 kB at 924 B/s)
[INFO]
[INFO] ------------------------------------------------------------------------
[INFO] Building olingo-odata2-annotation-processor-core 2.0.10-SNAPSHOT
[INFO] ------------------------------------------------------------------------
[INFO]
[INFO] --- maven-clean-plugin:2.5:clean (default-clean) @ olingo-odata2-annotation-processor-core ---
[INFO] Deleting <https://builds.apache.org/job/olingo-odata2/ws/odata2-annotation-processor/annotation-processor-core/target>
[INFO]
[INFO] --- buildnumber-maven-plugin:1.2:create (default) @ olingo-odata2-annotation-processor-core ---
[INFO]
[INFO] --- maven-remote-resources-plugin:1.5:process (default) @ olingo-odata2-annotation-processor-core ---
[INFO]
[INFO] --- maven-resources-plugin:2.6:resources (default-resources) @ olingo-odata2-annotation-processor-core ---
[INFO] Using 'UTF-8' encoding to copy filtered resources.
[INFO] skip non existing resourceDirectory <https://builds.apache.org/job/olingo-odata2/ws/odata2-annotation-processor/annotation-processor-core/src/main/resources>
[INFO] Copying 3 resources
[INFO]
[INFO] --- maven-compiler-plugin:2.3.2:compile (default-compile) @ olingo-odata2-annotation-processor-core ---
[INFO] Compiling 13 source files to <https://builds.apache.org/job/olingo-odata2/ws/odata2-annotation-processor/annotation-processor-core/target/classes>
[INFO]
[INFO] --- maven-bundle-plugin:2.3.7:manifest (bundle-manifest) @ olingo-odata2-annotation-processor-core ---
[INFO]
[INFO] --- maven-resources-plugin:2.6:testResources (default-testResources) @ olingo-odata2-annotation-processor-core ---
[INFO] Using 'UTF-8' encoding to copy filtered resources.
[INFO] skip non existing resourceDirectory <https://builds.apache.org/job/olingo-odata2/ws/odata2-annotation-processor/annotation-processor-core/src/test/resources>
[INFO] Copying 3 resources
[INFO]
[INFO] --- maven-compiler-plugin:2.3.2:testCompile (default-testCompile) @ olingo-odata2-annotation-processor-core ---
[INFO] Compiling 21 source files to <https://builds.apache.org/job/olingo-odata2/ws/odata2-annotation-processor/annotation-processor-core/target/test-classes>
[INFO]
[INFO] --- maven-surefire-plugin:2.12.4:test (default-test) @ olingo-odata2-annotation-processor-core ---
[INFO] Surefire report directory: <https://builds.apache.org/job/olingo-odata2/ws/odata2-annotation-processor/annotation-processor-core/target/surefire-reports>
-------------------------------------------------------
T E S T S
-------------------------------------------------------
Running org.apache.olingo.odata2.annotation.processor.core.ListsProcessorTest
Tests run: 4, Failures: 0, Errors: 0, Skipped: 0, Time elapsed: 0.246 sec
Running org.apache.olingo.odata2.annotation.processor.core.util.ClassHelperTest
Tests run: 4, Failures: 0, Errors: 1, Skipped: 0, Time elapsed: 0.021 sec <<< FAILURE!
loadFromDirWithUnsafeName(org.apache.olingo.odata2.annotation.processor.core.util.ClassHelperTest) Time elapsed: 0.008 sec <<< ERROR!
java.lang.Exception: Unexpected exception, expected<java.lang.ClassFormatError> but was<java.lang.IllegalArgumentException>
at org.junit.internal.runners.statements.ExpectException.evaluate(ExpectException.java:31)
at org.junit.runners.ParentRunner.runLeaf(ParentRunner.java:263)
at org.junit.runners.BlockJUnit4ClassRunner.runChild(BlockJUnit4ClassRunner.java:68)
at org.junit.runners.BlockJUnit4ClassRunner.runChild(BlockJUnit4ClassRunner.java:47)
at org.junit.runners.ParentRunner$3.run(ParentRunner.java:231)
at org.junit.runners.ParentRunner$1.schedule(ParentRunner.java:60)
at org.junit.runners.ParentRunner.runChildren(ParentRunner.java:229)
at org.junit.runners.ParentRunner.access$000(ParentRunner.java:50)
at org.junit.runners.ParentRunner$2.evaluate(ParentRunner.java:222)
at org.junit.runners.ParentRunner.run(ParentRunner.java:300)
at org.apache.maven.surefire.junit4.JUnit4Provider.execute(JUnit4Provider.java:252)
at org.apache.maven.surefire.junit4.JUnit4Provider.executeTestSet(JUnit4Provider.java:141)
at org.apache.maven.surefire.junit4.JUnit4Provider.invoke(JUnit4Provider.java:112)
at sun.reflect.NativeMethodAccessorImpl.invoke0(Native Method)
at sun.reflect.NativeMethodAccessorImpl.invoke(NativeMethodAccessorImpl.java:62)
at sun.reflect.DelegatingMethodAccessorImpl.invoke(DelegatingMethodAccessorImpl.java:43)
at java.lang.reflect.Method.invoke(Method.java:498)
at org.apache.maven.surefire.util.ReflectionUtils.invokeMethodWithArray(ReflectionUtils.java:189)
at org.apache.maven.surefire.booter.ProviderFactory$ProviderProxy.invoke(ProviderFactory.java:165)
at org.apache.maven.surefire.booter.ProviderFactory.invokeProvider(ProviderFactory.java:85)
at org.apache.maven.surefire.booter.ForkedBooter.runSuitesInProcess(ForkedBooter.java:115)
at org.apache.maven.surefire.booter.ForkedBooter.main(ForkedBooter.java:75)
Caused by: java.lang.IllegalArgumentException: No folder to scan found for package 'space space.package'.
at org.apache.olingo.odata2.annotation.processor.core.util.ClassHelper.getResourceUri(ClassHelper.java:110)
at org.apache.olingo.odata2.annotation.processor.core.util.ClassHelper.loadClasses(ClassHelper.java:73)
at org.apache.olingo.odata2.annotation.processor.core.util.ClassHelper.loadClasses(ClassHelper.java:66)
at org.apache.olingo.odata2.annotation.processor.core.util.ClassHelperTest.loadFromDirWithUnsafeName(ClassHelperTest.java:91)
at sun.reflect.NativeMethodAccessorImpl.invoke0(Native Method)
at sun.reflect.NativeMethodAccessorImpl.invoke(NativeMethodAccessorImpl.java:62)
at sun.reflect.DelegatingMethodAccessorImpl.invoke(DelegatingMethodAccessorImpl.java:43)
at java.lang.reflect.Method.invoke(Method.java:498)
at org.junit.runners.model.FrameworkMethod$1.runReflectiveCall(FrameworkMethod.java:45)
at org.junit.internal.runners.model.ReflectiveCallable.run(ReflectiveCallable.java:15)
at org.junit.runners.model.FrameworkMethod.invokeExplosively(FrameworkMethod.java:42)
at org.junit.internal.runners.statements.InvokeMethod.evaluate(InvokeMethod.java:20)
at org.junit.internal.runners.statements.ExpectException.evaluate(ExpectException.java:22)
... 21 more
Running org.apache.olingo.odata2.annotation.processor.core.util.AnnotationHelperTest
Tests run: 21, Failures: 0, Errors: 0, Skipped: 0, Time elapsed: 0.035 sec
Running org.apache.olingo.odata2.annotation.processor.core.AnnotationServiceFactoryImplTest
Tests run: 3, Failures: 0, Errors: 0, Skipped: 0, Time elapsed: 0.025 sec
Running org.apache.olingo.odata2.annotation.processor.core.datasource.AnnotationsInMemoryDsTest
Tests run: 34, Failures: 0, Errors: 0, Skipped: 2, Time elapsed: 0.413 sec
Running org.apache.olingo.odata2.annotation.processor.core.datasource.AnnotationValueAccessTest
Tests run: 17, Failures: 0, Errors: 0, Skipped: 0, Time elapsed: 0.021 sec
Running org.apache.olingo.odata2.annotation.processor.core.datasource.BeanPropertyAccessTest
Tests run: 15, Failures: 0, Errors: 0, Skipped: 0, Time elapsed: 0.013 sec
Running org.apache.olingo.odata2.annotation.processor.core.edm.AnnotationEdmProviderNamespacesTest
Tests run: 5, Failures: 0, Errors: 0, Skipped: 1, Time elapsed: 0.042 sec
Running org.apache.olingo.odata2.annotation.processor.core.edm.AnnotationEdmProviderTest
Tests run: 17, Failures: 0, Errors: 0, Skipped: 0, Time elapsed: 0.023 sec
Results :
Tests in error:
loadFromDirWithUnsafeName(org.apache.olingo.odata2.annotation.processor.core.util.ClassHelperTest): Unexpected exception, expected<java.lang.ClassFormatError> but was<java.lang.IllegalArgumentException>
Tests run: 120, Failures: 0, Errors: 1, Skipped: 3
[INFO] ------------------------------------------------------------------------
[INFO] Reactor Summary:
[INFO]
[INFO] olingo-odata2-parent ............................... SUCCESS [ 7.369 s]
[INFO] olingo-odata2-lib .................................. SUCCESS [ 4.618 s]
[INFO] olingo-odata2-api .................................. SUCCESS [ 12.803 s]
[INFO] olingo-odata2-api-annotation ....................... SUCCESS [ 8.869 s]
[INFO] olingo-odata2-testutil ............................. SUCCESS [ 2.913 s]
[INFO] olingo-odata2-core ................................. SUCCESS [ 36.861 s]
[INFO] olingo-odata2-ref .................................. SUCCESS [ 11.502 s]
[INFO] olingo-odata2-fit .................................. SUCCESS [05:38 min]
[INFO] olingo-odata2-ref-web .............................. SUCCESS [ 1.269 s]
[INFO] olingo-odata2-jpa-processor ........................ SUCCESS [ 4.728 s]
[INFO] olingo-odata2-jpa-processor-api .................... SUCCESS [ 9.582 s]
[INFO] olingo-odata2-jpa-processor-core ................... SUCCESS [ 15.471 s]
[INFO] olingo-odata2-jpa-processor-ref .................... SUCCESS [ 9.350 s]
[INFO] olingo-odata2-jpa-processor-ref-web ................ SUCCESS [ 2.197 s]
[INFO] olingo-odata2-annotation-processor ................. SUCCESS [ 4.555 s]
[INFO] olingo-odata2-annotation-processor-api ............. SUCCESS [ 8.454 s]
[INFO] olingo-odata2-annotation-processor-core ............ FAILURE [ 3.898 s]
[INFO] olingo-odata2-annotation-processor-ref ............. SKIPPED
[INFO] olingo-odata2-annotation-processor-ref-web ......... SKIPPED
[INFO] olingo-odata2-dist ................................. SKIPPED
[INFO] olingo-odata2-dist-lib ............................. SKIPPED
[INFO] olingo-odata2-dist-jpa ............................. SKIPPED
[INFO] olingo-odata2-dist-janos ........................... SKIPPED
[INFO] olingo-odata2-dist-ref ............................. SKIPPED
[INFO] olingo-odata2-dist-javadoc ......................... SKIPPED
[INFO] olingo-odata2-sample ............................... SKIPPED
[INFO] olingo-odata2-sample-cars-service-archetype ........ SKIPPED
[INFO] olingo-odata2-sample-cars-annotation-archetype ..... SKIPPED
[INFO] olingo-odata2-sample-cars-jpa-archetype ............ SKIPPED
[INFO] ------------------------------------------------------------------------
[INFO] BUILD FAILURE
[INFO] ------------------------------------------------------------------------
[INFO] Total time: 08:03 min
[INFO] Finished at: 2017-11-21T06:25:49Z
[INFO] Final Memory: 144M/3407M
[INFO] ------------------------------------------------------------------------
[ERROR] Failed to execute goal org.apache.maven.plugins:maven-surefire-plugin:2.12.4:test (default-test) on project olingo-odata2-annotation-processor-core: There are test failures.
[ERROR]
[ERROR] Please refer to <https://builds.apache.org/job/olingo-odata2/ws/odata2-annotation-processor/annotation-processor-core/target/surefire-reports> for the individual test results.
[ERROR] -> [Help 1]
[ERROR]
[ERROR] To see the full stack trace of the errors, re-run Maven with the -e switch.
[ERROR] Re-run Maven using the -X switch to enable full debug logging.
[ERROR]
[ERROR] For more information about the errors and possible solutions, please read the following articles:
[ERROR] [Help 1] http://cwiki.apache.org/confluence/display/MAVEN/MojoFailureException
[ERROR]
[ERROR] After correcting the problems, you can resume the build with the command
[ERROR] mvn <goals> -rf :olingo-odata2-annotation-processor-core
Build step 'Invoke top-level Maven targets' marked build as failure
Not sending mail to unregistered user ramya.vasanth@sap.com
Not sending mail to unregistered user archana.rai@sap.com