You are viewing a plain text version of this content. The canonical link for it is here.
Posted to dev@lucene.apache.org by Apache Jenkins Server <je...@builds.apache.org> on 2012/04/14 01:22:16 UTC

[JENKINS] Lucene-Solr-tests-only-trunk - Build # 13095 - Failure

Build: https://builds.apache.org/job/Lucene-Solr-tests-only-trunk/13095/

14 tests failed.
REGRESSION:  org.apache.lucene.index.TestDirectoryReaderReopen.testThreadSafety

Error Message:
Uncaught exception by thread: Thread[Lucene Merge Thread #0,6,]

Stack Trace:
org.apache.lucene.util.UncaughtExceptionsRule$UncaughtExceptionsInBackgroundThread: Uncaught exception by thread: Thread[Lucene Merge Thread #0,6,]
	at org.apache.lucene.util.UncaughtExceptionsRule$1.evaluate(UncaughtExceptionsRule.java:84)
	at org.apache.lucene.util.LuceneTestCase$SaveThreadAndTestNameRule$1.evaluate(LuceneTestCase.java:642)
	at org.junit.rules.RunRules.evaluate(RunRules.java:18)
	at org.junit.runners.ParentRunner.runLeaf(ParentRunner.java:263)
	at org.junit.runners.BlockJUnit4ClassRunner.runChild(BlockJUnit4ClassRunner.java:68)
	at org.apache.lucene.util.LuceneTestCaseRunner.runChild(LuceneTestCaseRunner.java:164)
	at org.apache.lucene.util.LuceneTestCaseRunner.runChild(LuceneTestCaseRunner.java:57)
	at org.junit.runners.ParentRunner$3.run(ParentRunner.java:231)
	at org.junit.runners.ParentRunner$1.schedule(ParentRunner.java:60)
	at org.junit.runners.ParentRunner.runChildren(ParentRunner.java:229)
	at org.junit.runners.ParentRunner.access$000(ParentRunner.java:50)
	at org.junit.runners.ParentRunner$2.evaluate(ParentRunner.java:222)
	at org.junit.internal.runners.statements.RunBefores.evaluate(RunBefores.java:28)
	at org.junit.internal.runners.statements.RunAfters.evaluate(RunAfters.java:30)
	at org.apache.lucene.util.UncaughtExceptionsRule$1.evaluate(UncaughtExceptionsRule.java:75)
	at org.apache.lucene.util.StoreClassNameRule$1.evaluate(StoreClassNameRule.java:38)
	at org.apache.lucene.util.SystemPropertiesInvariantRule$1.evaluate(SystemPropertiesInvariantRule.java:69)
	at org.junit.rules.RunRules.evaluate(RunRules.java:18)
	at org.junit.runners.ParentRunner.run(ParentRunner.java:300)
	at junit.framework.JUnit4TestAdapter.run(JUnit4TestAdapter.java:39)
	at org.apache.tools.ant.taskdefs.optional.junit.JUnitTestRunner.run(JUnitTestRunner.java:420)
	at org.apache.tools.ant.taskdefs.optional.junit.JUnitTestRunner.launch(JUnitTestRunner.java:911)
	at org.apache.tools.ant.taskdefs.optional.junit.JUnitTestRunner.main(JUnitTestRunner.java:743)
Caused by: org.apache.lucene.index.MergePolicy$MergeException: java.io.FileNotFoundException: /usr/home/hudson/hudson-slave/workspace/Lucene-Solr-tests-only-trunk/checkout/lucene/build/core/test/1/index4071340716tmp/_8_0.prx (Too many open files in system)
	at org.apache.lucene.index.ConcurrentMergeScheduler.handleMergeException(ConcurrentMergeScheduler.java:507)
	at org.apache.lucene.index.ConcurrentMergeScheduler$MergeThread.run(ConcurrentMergeScheduler.java:480)
Caused by: java.io.FileNotFoundException: /usr/home/hudson/hudson-slave/workspace/Lucene-Solr-tests-only-trunk/checkout/lucene/build/core/test/1/index4071340716tmp/_8_0.prx (Too many open files in system)
	at java.io.RandomAccessFile.open(Native Method)
	at java.io.RandomAccessFile.<init>(RandomAccessFile.java:233)
	at org.apache.lucene.store.SimpleFSDirectory$SimpleFSIndexInput$Descriptor.<init>(SimpleFSDirectory.java:98)
	at org.apache.lucene.store.SimpleFSDirectory$SimpleFSIndexInput.<init>(SimpleFSDirectory.java:121)
	at org.apache.lucene.store.NIOFSDirectory$NIOFSIndexInput.<init>(NIOFSDirectory.java:116)
	at org.apache.lucene.store.NIOFSDirectory.openInput(NIOFSDirectory.java:81)
	at org.apache.lucene.store.MockDirectoryWrapper.openInput(MockDirectoryWrapper.java:503)
	at org.apache.lucene.codecs.lucene40.Lucene40PostingsReader.<init>(Lucene40PostingsReader.java:64)
	at org.apache.lucene.codecs.mockrandom.MockRandomPostingsFormat.fieldsProducer(MockRandomPostingsFormat.java:302)
	at org.apache.lucene.codecs.perfield.PerFieldPostingsFormat$FieldsReader$1.visitOneFormat(PerFieldPostingsFormat.java:197)
	at org.apache.lucene.codecs.perfield.PerFieldPostingsFormat$VisitPerFieldFile.<init>(PerFieldPostingsFormat.java:288)
	at org.apache.lucene.codecs.perfield.PerFieldPostingsFormat$FieldsReader$1.<init>(PerFieldPostingsFormat.java:194)
	at org.apache.lucene.codecs.perfield.PerFieldPostingsFormat$FieldsReader.<init>(PerFieldPostingsFormat.java:194)
	at org.apache.lucene.codecs.perfield.PerFieldPostingsFormat.fieldsProducer(PerFieldPostingsFormat.java:264)
	at org.apache.lucene.index.SegmentCoreReaders.<init>(SegmentCoreReaders.java:108)
	at org.apache.lucene.index.SegmentReader.<init>(SegmentReader.java:55)
	at org.apache.lucene.index.ReadersAndLiveDocs.getMergeReader(ReadersAndLiveDocs.java:152)
	at org.apache.lucene.index.IndexWriter.mergeMiddle(IndexWriter.java:3344)
	at org.apache.lucene.index.IndexWriter.merge(IndexWriter.java:3004)
	at org.apache.lucene.index.ConcurrentMergeScheduler.doMerge(ConcurrentMergeScheduler.java:382)
	at org.apache.lucene.index.ConcurrentMergeScheduler$MergeThread.run(ConcurrentMergeScheduler.java:451)


REGRESSION:  org.apache.lucene.index.TestIndexWriter.testManyFields

Error Message:
/usr/home/hudson/hudson-slave/workspace/Lucene-Solr-tests-only-trunk/checkout/lucene/build/core/test/3/index5144351482tmp/_b_0.skp (Too many open files in system)

Stack Trace:
java.io.FileNotFoundException: /usr/home/hudson/hudson-slave/workspace/Lucene-Solr-tests-only-trunk/checkout/lucene/build/core/test/3/index5144351482tmp/_b_0.skp (Too many open files in system)
	at java.io.RandomAccessFile.open(Native Method)
	at java.io.RandomAccessFile.<init>(RandomAccessFile.java:233)
	at org.apache.lucene.store.SimpleFSDirectory$SimpleFSIndexInput$Descriptor.<init>(SimpleFSDirectory.java:98)
	at org.apache.lucene.store.SimpleFSDirectory$SimpleFSIndexInput.<init>(SimpleFSDirectory.java:121)
	at org.apache.lucene.store.NIOFSDirectory$NIOFSIndexInput.<init>(NIOFSDirectory.java:116)
	at org.apache.lucene.store.NIOFSDirectory.openInput(NIOFSDirectory.java:81)
	at org.apache.lucene.store.MockDirectoryWrapper.openInput(MockDirectoryWrapper.java:503)
	at org.apache.lucene.codecs.sep.SepPostingsReader.<init>(SepPostingsReader.java:70)
	at org.apache.lucene.codecs.mockintblock.MockVariableIntBlockPostingsFormat.fieldsProducer(MockVariableIntBlockPostingsFormat.java:182)
	at org.apache.lucene.codecs.perfield.PerFieldPostingsFormat$FieldsReader$1.visitOneFormat(PerFieldPostingsFormat.java:197)
	at org.apache.lucene.codecs.perfield.PerFieldPostingsFormat$VisitPerFieldFile.<init>(PerFieldPostingsFormat.java:288)
	at org.apache.lucene.codecs.perfield.PerFieldPostingsFormat$FieldsReader$1.<init>(PerFieldPostingsFormat.java:194)
	at org.apache.lucene.codecs.perfield.PerFieldPostingsFormat$FieldsReader.<init>(PerFieldPostingsFormat.java:194)
	at org.apache.lucene.codecs.perfield.PerFieldPostingsFormat.fieldsProducer(PerFieldPostingsFormat.java:264)
	at org.apache.lucene.index.SegmentCoreReaders.<init>(SegmentCoreReaders.java:108)
	at org.apache.lucene.index.SegmentReader.<init>(SegmentReader.java:55)
	at org.apache.lucene.index.ReadersAndLiveDocs.getMergeReader(ReadersAndLiveDocs.java:152)
	at org.apache.lucene.index.IndexWriter.mergeMiddle(IndexWriter.java:3344)
	at org.apache.lucene.index.IndexWriter.merge(IndexWriter.java:3004)
	at org.apache.lucene.index.SerialMergeScheduler.merge(SerialMergeScheduler.java:37)
	at org.apache.lucene.index.IndexWriter.maybeMerge(IndexWriter.java:1644)
	at org.apache.lucene.index.IndexWriter.maybeMerge(IndexWriter.java:1638)
	at org.apache.lucene.index.IndexWriter.updateDocument(IndexWriter.java:1287)
	at org.apache.lucene.index.IndexWriter.addDocument(IndexWriter.java:1034)
	at org.apache.lucene.index.IndexWriter.addDocument(IndexWriter.java:1015)
	at org.apache.lucene.index.TestIndexWriter.testManyFields(TestIndexWriter.java:253)
	at sun.reflect.NativeMethodAccessorImpl.invoke0(Native Method)
	at sun.reflect.NativeMethodAccessorImpl.invoke(NativeMethodAccessorImpl.java:57)
	at sun.reflect.DelegatingMethodAccessorImpl.invoke(DelegatingMethodAccessorImpl.java:43)
	at java.lang.reflect.Method.invoke(Method.java:616)
	at org.junit.runners.model.FrameworkMethod$1.runReflectiveCall(FrameworkMethod.java:45)
	at org.junit.internal.runners.model.ReflectiveCallable.run(ReflectiveCallable.java:15)
	at org.junit.runners.model.FrameworkMethod.invokeExplosively(FrameworkMethod.java:42)
	at org.junit.internal.runners.statements.InvokeMethod.evaluate(InvokeMethod.java:20)
	at org.junit.internal.runners.statements.RunBefores.evaluate(RunBefores.java:28)
	at org.junit.internal.runners.statements.RunAfters.evaluate(RunAfters.java:30)
	at org.apache.lucene.util.LuceneTestCase$SubclassSetupTeardownRule$1.evaluate(LuceneTestCase.java:754)
	at org.apache.lucene.util.LuceneTestCase$InternalSetupTeardownRule$1.evaluate(LuceneTestCase.java:670)
	at org.apache.lucene.util.SystemPropertiesInvariantRule$1.evaluate(SystemPropertiesInvariantRule.java:69)
	at org.apache.lucene.util.LuceneTestCase$TestResultInterceptorRule$1.evaluate(LuceneTestCase.java:591)
	at org.apache.lucene.util.UncaughtExceptionsRule$1.evaluate(UncaughtExceptionsRule.java:75)
	at org.apache.lucene.util.LuceneTestCase$SaveThreadAndTestNameRule$1.evaluate(LuceneTestCase.java:642)
	at org.junit.rules.RunRules.evaluate(RunRules.java:18)
	at org.junit.runners.ParentRunner.runLeaf(ParentRunner.java:263)
	at org.junit.runners.BlockJUnit4ClassRunner.runChild(BlockJUnit4ClassRunner.java:68)
	at org.apache.lucene.util.LuceneTestCaseRunner.runChild(LuceneTestCaseRunner.java:164)
	at org.apache.lucene.util.LuceneTestCaseRunner.runChild(LuceneTestCaseRunner.java:57)
	at org.junit.runners.ParentRunner$3.run(ParentRunner.java:231)
	at org.junit.runners.ParentRunner$1.schedule(ParentRunner.java:60)
	at org.junit.runners.ParentRunner.runChildren(ParentRunner.java:229)
	at org.junit.runners.ParentRunner.access$000(ParentRunner.java:50)
	at org.junit.runners.ParentRunner$2.evaluate(ParentRunner.java:222)
	at org.junit.internal.runners.statements.RunBefores.evaluate(RunBefores.java:28)
	at org.junit.internal.runners.statements.RunAfters.evaluate(RunAfters.java:30)
	at org.apache.lucene.util.UncaughtExceptionsRule$1.evaluate(UncaughtExceptionsRule.java:75)
	at org.apache.lucene.util.StoreClassNameRule$1.evaluate(StoreClassNameRule.java:38)
	at org.apache.lucene.util.SystemPropertiesInvariantRule$1.evaluate(SystemPropertiesInvariantRule.java:69)
	at org.junit.rules.RunRules.evaluate(RunRules.java:18)
	at org.junit.runners.ParentRunner.run(ParentRunner.java:300)
	at junit.framework.JUnit4TestAdapter.run(JUnit4TestAdapter.java:39)
	at org.apache.tools.ant.taskdefs.optional.junit.JUnitTestRunner.run(JUnitTestRunner.java:420)
	at org.apache.tools.ant.taskdefs.optional.junit.JUnitTestRunner.launch(JUnitTestRunner.java:911)
	at org.apache.tools.ant.taskdefs.optional.junit.JUnitTestRunner.main(JUnitTestRunner.java:743)


REGRESSION:  org.apache.lucene.search.TestSearcherManager.testSearcherManager

Error Message:
/usr/home/hudson/hudson-slave/workspace/Lucene-Solr-tests-only-trunk/checkout/lucene/build/core/test/1/TestSearcherManager4071340731tmp/_6_0.tim (Too many open files in system)

Stack Trace:
java.io.FileNotFoundException: /usr/home/hudson/hudson-slave/workspace/Lucene-Solr-tests-only-trunk/checkout/lucene/build/core/test/1/TestSearcherManager4071340731tmp/_6_0.tim (Too many open files in system)
	at java.io.RandomAccessFile.open(Native Method)
	at java.io.RandomAccessFile.<init>(RandomAccessFile.java:233)
	at org.apache.lucene.store.FSDirectory$FSIndexOutput.<init>(FSDirectory.java:449)
	at org.apache.lucene.store.FSDirectory.createOutput(FSDirectory.java:288)
	at org.apache.lucene.store.MockDirectoryWrapper.createOutput(MockDirectoryWrapper.java:450)
	at org.apache.lucene.codecs.BlockTreeTermsWriter.<init>(BlockTreeTermsWriter.java:149)
	at org.apache.lucene.codecs.nestedpulsing.NestedPulsingPostingsFormat.fieldsConsumer(NestedPulsingPostingsFormat.java:60)
	at org.apache.lucene.codecs.perfield.PerFieldPostingsFormat$FieldsWriter.addField(PerFieldPostingsFormat.java:126)
	at org.apache.lucene.index.FreqProxTermsWriterPerField.flush(FreqProxTermsWriterPerField.java:322)
	at org.apache.lucene.index.FreqProxTermsWriter.flush(FreqProxTermsWriter.java:92)
	at org.apache.lucene.index.TermsHash.flush(TermsHash.java:117)
	at org.apache.lucene.index.DocInverter.flush(DocInverter.java:53)
	at org.apache.lucene.index.DocFieldProcessor.flush(DocFieldProcessor.java:81)
	at org.apache.lucene.index.DocumentsWriterPerThread.flush(DocumentsWriterPerThread.java:475)
	at org.apache.lucene.index.DocumentsWriter.doFlush(DocumentsWriter.java:422)
	at org.apache.lucene.index.DocumentsWriter.flushAllThreads(DocumentsWriter.java:553)
	at org.apache.lucene.index.IndexWriter.prepareCommit(IndexWriter.java:2416)
	at org.apache.lucene.index.IndexWriter.commitInternal(IndexWriter.java:2548)
	at org.apache.lucene.index.IndexWriter.commit(IndexWriter.java:2530)
	at org.apache.lucene.index.IndexWriter.commit(IndexWriter.java:2514)
	at org.apache.lucene.search.TestSearcherManager.getFinalSearcher(TestSearcherManager.java:60)
	at org.apache.lucene.index.ThreadedIndexingAndSearchingTestCase.runTest(ThreadedIndexingAndSearchingTestCase.java:508)
	at org.apache.lucene.search.TestSearcherManager.testSearcherManager(TestSearcherManager.java:54)
	at sun.reflect.NativeMethodAccessorImpl.invoke0(Native Method)
	at sun.reflect.NativeMethodAccessorImpl.invoke(NativeMethodAccessorImpl.java:57)
	at sun.reflect.DelegatingMethodAccessorImpl.invoke(DelegatingMethodAccessorImpl.java:43)
	at java.lang.reflect.Method.invoke(Method.java:616)
	at org.junit.runners.model.FrameworkMethod$1.runReflectiveCall(FrameworkMethod.java:45)
	at org.junit.internal.runners.model.ReflectiveCallable.run(ReflectiveCallable.java:15)
	at org.junit.runners.model.FrameworkMethod.invokeExplosively(FrameworkMethod.java:42)
	at org.junit.internal.runners.statements.InvokeMethod.evaluate(InvokeMethod.java:20)
	at org.junit.internal.runners.statements.RunBefores.evaluate(RunBefores.java:28)
	at org.junit.internal.runners.statements.RunAfters.evaluate(RunAfters.java:30)
	at org.apache.lucene.util.LuceneTestCase$SubclassSetupTeardownRule$1.evaluate(LuceneTestCase.java:754)
	at org.apache.lucene.util.LuceneTestCase$InternalSetupTeardownRule$1.evaluate(LuceneTestCase.java:670)
	at org.apache.lucene.util.SystemPropertiesInvariantRule$1.evaluate(SystemPropertiesInvariantRule.java:69)
	at org.apache.lucene.util.LuceneTestCase$TestResultInterceptorRule$1.evaluate(LuceneTestCase.java:591)
	at org.apache.lucene.util.UncaughtExceptionsRule$1.evaluate(UncaughtExceptionsRule.java:75)
	at org.apache.lucene.util.LuceneTestCase$SaveThreadAndTestNameRule$1.evaluate(LuceneTestCase.java:642)
	at org.junit.rules.RunRules.evaluate(RunRules.java:18)
	at org.junit.runners.ParentRunner.runLeaf(ParentRunner.java:263)
	at org.junit.runners.BlockJUnit4ClassRunner.runChild(BlockJUnit4ClassRunner.java:68)
	at org.apache.lucene.util.LuceneTestCaseRunner.runChild(LuceneTestCaseRunner.java:164)
	at org.apache.lucene.util.LuceneTestCaseRunner.runChild(LuceneTestCaseRunner.java:57)
	at org.junit.runners.ParentRunner$3.run(ParentRunner.java:231)
	at org.junit.runners.ParentRunner$1.schedule(ParentRunner.java:60)
	at org.junit.runners.ParentRunner.runChildren(ParentRunner.java:229)
	at org.junit.runners.ParentRunner.access$000(ParentRunner.java:50)
	at org.junit.runners.ParentRunner$2.evaluate(ParentRunner.java:222)
	at org.junit.internal.runners.statements.RunBefores.evaluate(RunBefores.java:28)
	at org.junit.internal.runners.statements.RunAfters.evaluate(RunAfters.java:30)
	at org.apache.lucene.util.UncaughtExceptionsRule$1.evaluate(UncaughtExceptionsRule.java:75)
	at org.apache.lucene.util.StoreClassNameRule$1.evaluate(StoreClassNameRule.java:38)
	at org.apache.lucene.util.SystemPropertiesInvariantRule$1.evaluate(SystemPropertiesInvariantRule.java:69)
	at org.junit.rules.RunRules.evaluate(RunRules.java:18)
	at org.junit.runners.ParentRunner.run(ParentRunner.java:300)
	at junit.framework.JUnit4TestAdapter.run(JUnit4TestAdapter.java:39)
	at org.apache.tools.ant.taskdefs.optional.junit.JUnitTestRunner.run(JUnitTestRunner.java:420)
	at org.apache.tools.ant.taskdefs.optional.junit.JUnitTestRunner.launch(JUnitTestRunner.java:911)
	at org.apache.tools.ant.taskdefs.optional.junit.JUnitTestRunner.main(JUnitTestRunner.java:743)


REGRESSION:  org.apache.lucene.search.TestShardSearching.testSimple

Error Message:
Cannot delete /usr/home/hudson/hudson-slave/workspace/Lucene-Solr-tests-only-trunk/checkout/lucene/build/core/test/4/TestShardSearching4877948812tmp.3/_2_2.doc

Stack Trace:
java.io.IOException: Cannot delete /usr/home/hudson/hudson-slave/workspace/Lucene-Solr-tests-only-trunk/checkout/lucene/build/core/test/4/TestShardSearching4877948812tmp.3/_2_2.doc
	at org.apache.lucene.store.FSDirectory.deleteFile(FSDirectory.java:278)
	at org.apache.lucene.store.MockDirectoryWrapper.deleteFile(MockDirectoryWrapper.java:398)
	at org.apache.lucene.store.MockDirectoryWrapper.crash(MockDirectoryWrapper.java:210)
	at org.apache.lucene.store.MockDirectoryWrapper.close(MockDirectoryWrapper.java:566)
	at org.apache.lucene.search.ShardSearchingTestBase$NodeState.close(ShardSearchingTestBase.java:510)
	at org.apache.lucene.search.ShardSearchingTestBase.finish(ShardSearchingTestBase.java:597)
	at org.apache.lucene.search.TestShardSearching.testSimple(TestShardSearching.java:270)
	at sun.reflect.NativeMethodAccessorImpl.invoke0(Native Method)
	at sun.reflect.NativeMethodAccessorImpl.invoke(NativeMethodAccessorImpl.java:57)
	at sun.reflect.DelegatingMethodAccessorImpl.invoke(DelegatingMethodAccessorImpl.java:43)
	at java.lang.reflect.Method.invoke(Method.java:616)
	at org.junit.runners.model.FrameworkMethod$1.runReflectiveCall(FrameworkMethod.java:45)
	at org.junit.internal.runners.model.ReflectiveCallable.run(ReflectiveCallable.java:15)
	at org.junit.runners.model.FrameworkMethod.invokeExplosively(FrameworkMethod.java:42)
	at org.junit.internal.runners.statements.InvokeMethod.evaluate(InvokeMethod.java:20)
	at org.junit.internal.runners.statements.RunBefores.evaluate(RunBefores.java:28)
	at org.junit.internal.runners.statements.RunAfters.evaluate(RunAfters.java:30)
	at org.apache.lucene.util.LuceneTestCase$SubclassSetupTeardownRule$1.evaluate(LuceneTestCase.java:754)
	at org.apache.lucene.util.LuceneTestCase$InternalSetupTeardownRule$1.evaluate(LuceneTestCase.java:670)
	at org.apache.lucene.util.SystemPropertiesInvariantRule$1.evaluate(SystemPropertiesInvariantRule.java:69)
	at org.apache.lucene.util.LuceneTestCase$TestResultInterceptorRule$1.evaluate(LuceneTestCase.java:591)
	at org.apache.lucene.util.UncaughtExceptionsRule$1.evaluate(UncaughtExceptionsRule.java:75)
	at org.apache.lucene.util.LuceneTestCase$SaveThreadAndTestNameRule$1.evaluate(LuceneTestCase.java:642)
	at org.junit.rules.RunRules.evaluate(RunRules.java:18)
	at org.junit.runners.ParentRunner.runLeaf(ParentRunner.java:263)
	at org.junit.runners.BlockJUnit4ClassRunner.runChild(BlockJUnit4ClassRunner.java:68)
	at org.apache.lucene.util.LuceneTestCaseRunner.runChild(LuceneTestCaseRunner.java:164)
	at org.apache.lucene.util.LuceneTestCaseRunner.runChild(LuceneTestCaseRunner.java:57)
	at org.junit.runners.ParentRunner$3.run(ParentRunner.java:231)
	at org.junit.runners.ParentRunner$1.schedule(ParentRunner.java:60)
	at org.junit.runners.ParentRunner.runChildren(ParentRunner.java:229)
	at org.junit.runners.ParentRunner.access$000(ParentRunner.java:50)
	at org.junit.runners.ParentRunner$2.evaluate(ParentRunner.java:222)
	at org.junit.internal.runners.statements.RunBefores.evaluate(RunBefores.java:28)
	at org.junit.internal.runners.statements.RunAfters.evaluate(RunAfters.java:30)
	at org.apache.lucene.util.UncaughtExceptionsRule$1.evaluate(UncaughtExceptionsRule.java:75)
	at org.apache.lucene.util.StoreClassNameRule$1.evaluate(StoreClassNameRule.java:38)
	at org.apache.lucene.util.SystemPropertiesInvariantRule$1.evaluate(SystemPropertiesInvariantRule.java:69)
	at org.junit.rules.RunRules.evaluate(RunRules.java:18)
	at org.junit.runners.ParentRunner.run(ParentRunner.java:300)
	at junit.framework.JUnit4TestAdapter.run(JUnit4TestAdapter.java:39)
	at org.apache.tools.ant.taskdefs.optional.junit.JUnitTestRunner.run(JUnitTestRunner.java:420)
	at org.apache.tools.ant.taskdefs.optional.junit.JUnitTestRunner.launch(JUnitTestRunner.java:911)
	at org.apache.tools.ant.taskdefs.optional.junit.JUnitTestRunner.main(JUnitTestRunner.java:743)


FAILED:  <init>.org.apache.lucene.util.TestNamedSPILoader

Error Message:
org.apache.lucene.util.TestNamedSPILoader

Stack Trace:
java.lang.ClassNotFoundException: org.apache.lucene.util.TestNamedSPILoader
	at java.net.URLClassLoader$1.run(URLClassLoader.java:214)
	at java.security.AccessController.doPrivileged(Native Method)
	at java.net.URLClassLoader.findClass(URLClassLoader.java:205)
	at java.lang.ClassLoader.loadClass(ClassLoader.java:321)
	at sun.misc.Launcher$AppClassLoader.loadClass(Launcher.java:294)
	at java.lang.ClassLoader.loadClass(ClassLoader.java:266)
	at java.lang.Class.forName0(Native Method)
	at java.lang.Class.forName(Class.java:186)
	at org.apache.tools.ant.taskdefs.optional.junit.JUnitTestRunner.run(JUnitTestRunner.java:335)
	at org.apache.tools.ant.taskdefs.optional.junit.JUnitTestRunner.launch(JUnitTestRunner.java:911)
	at org.apache.tools.ant.taskdefs.optional.junit.JUnitTestRunner.main(JUnitTestRunner.java:743)
Caused by: java.io.FileNotFoundException: /usr/home/hudson/hudson-slave/workspace/Lucene-Solr-tests-only-trunk/checkout/lucene/build/core/classes/test/org/apache/lucene/util/TestNamedSPILoader.class (Too many open files in system)
	at java.io.FileInputStream.open(Native Method)
	at java.io.FileInputStream.<init>(FileInputStream.java:137)
	at sun.misc.URLClassPath$FileLoader$1.getInputStream(URLClassPath.java:1005)
	at sun.misc.Resource.cachedInputStream(Resource.java:77)
	at sun.misc.Resource.getByteBuffer(Resource.java:160)
	at java.net.URLClassLoader.defineClass(URLClassLoader.java:266)
	at java.net.URLClassLoader.access$000(URLClassLoader.java:73)
	at java.net.URLClassLoader$1.run(URLClassLoader.java:212)
	... 10 more


FAILED:  <init>.org.apache.lucene.util.TestOpenBitSet

Error Message:
org.apache.lucene.util.TestOpenBitSet

Stack Trace:
java.lang.ClassNotFoundException: org.apache.lucene.util.TestOpenBitSet
	at java.net.URLClassLoader$1.run(URLClassLoader.java:214)
	at java.security.AccessController.doPrivileged(Native Method)
	at java.net.URLClassLoader.findClass(URLClassLoader.java:205)
	at java.lang.ClassLoader.loadClass(ClassLoader.java:321)
	at sun.misc.Launcher$AppClassLoader.loadClass(Launcher.java:294)
	at java.lang.ClassLoader.loadClass(ClassLoader.java:266)
	at java.lang.Class.forName0(Native Method)
	at java.lang.Class.forName(Class.java:186)
	at org.apache.tools.ant.taskdefs.optional.junit.JUnitTestRunner.run(JUnitTestRunner.java:335)
	at org.apache.tools.ant.taskdefs.optional.junit.JUnitTestRunner.launch(JUnitTestRunner.java:911)
	at org.apache.tools.ant.taskdefs.optional.junit.JUnitTestRunner.main(JUnitTestRunner.java:743)
Caused by: java.io.FileNotFoundException: /usr/home/hudson/hudson-slave/workspace/Lucene-Solr-tests-only-trunk/checkout/lucene/build/core/classes/test/org/apache/lucene/util/TestOpenBitSet.class (Too many open files in system)
	at java.io.FileInputStream.open(Native Method)
	at java.io.FileInputStream.<init>(FileInputStream.java:137)
	at sun.misc.URLClassPath$FileLoader$1.getInputStream(URLClassPath.java:1005)
	at sun.misc.Resource.cachedInputStream(Resource.java:77)
	at sun.misc.Resource.getByteBuffer(Resource.java:160)
	at java.net.URLClassLoader.defineClass(URLClassLoader.java:266)
	at java.net.URLClassLoader.access$000(URLClassLoader.java:73)
	at java.net.URLClassLoader$1.run(URLClassLoader.java:212)
	... 10 more


FAILED:  <init>.org.apache.lucene.util.TestRamUsageEstimator

Error Message:
org.apache.lucene.util.TestRamUsageEstimator

Stack Trace:
java.lang.ClassNotFoundException: org.apache.lucene.util.TestRamUsageEstimator
	at java.net.URLClassLoader$1.run(URLClassLoader.java:214)
	at java.security.AccessController.doPrivileged(Native Method)
	at java.net.URLClassLoader.findClass(URLClassLoader.java:205)
	at java.lang.ClassLoader.loadClass(ClassLoader.java:321)
	at sun.misc.Launcher$AppClassLoader.loadClass(Launcher.java:294)
	at java.lang.ClassLoader.loadClass(ClassLoader.java:266)
	at java.lang.Class.forName0(Native Method)
	at java.lang.Class.forName(Class.java:186)
	at org.apache.tools.ant.taskdefs.optional.junit.JUnitTestRunner.run(JUnitTestRunner.java:335)
	at org.apache.tools.ant.taskdefs.optional.junit.JUnitTestRunner.launch(JUnitTestRunner.java:911)
	at org.apache.tools.ant.taskdefs.optional.junit.JUnitTestRunner.main(JUnitTestRunner.java:743)
Caused by: java.io.FileNotFoundException: /usr/home/hudson/hudson-slave/workspace/Lucene-Solr-tests-only-trunk/checkout/lucene/build/core/classes/test/org/apache/lucene/util/TestRamUsageEstimator.class (Too many open files in system)
	at java.io.FileInputStream.open(Native Method)
	at java.io.FileInputStream.<init>(FileInputStream.java:137)
	at sun.misc.URLClassPath$FileLoader$1.getInputStream(URLClassPath.java:1005)
	at sun.misc.Resource.cachedInputStream(Resource.java:77)
	at sun.misc.Resource.getByteBuffer(Resource.java:160)
	at java.net.URLClassLoader.defineClass(URLClassLoader.java:266)
	at java.net.URLClassLoader.access$000(URLClassLoader.java:73)
	at java.net.URLClassLoader$1.run(URLClassLoader.java:212)
	... 10 more


FAILED:  <init>.org.apache.lucene.util.TestSmallFloat

Error Message:
org.apache.lucene.util.TestSmallFloat

Stack Trace:
java.lang.ClassNotFoundException: org.apache.lucene.util.TestSmallFloat
	at java.net.URLClassLoader$1.run(URLClassLoader.java:214)
	at java.security.AccessController.doPrivileged(Native Method)
	at java.net.URLClassLoader.findClass(URLClassLoader.java:205)
	at java.lang.ClassLoader.loadClass(ClassLoader.java:321)
	at sun.misc.Launcher$AppClassLoader.loadClass(Launcher.java:294)
	at java.lang.ClassLoader.loadClass(ClassLoader.java:266)
	at java.lang.Class.forName0(Native Method)
	at java.lang.Class.forName(Class.java:186)
	at org.apache.tools.ant.taskdefs.optional.junit.JUnitTestRunner.run(JUnitTestRunner.java:335)
	at org.apache.tools.ant.taskdefs.optional.junit.JUnitTestRunner.launch(JUnitTestRunner.java:911)
	at org.apache.tools.ant.taskdefs.optional.junit.JUnitTestRunner.main(JUnitTestRunner.java:743)
Caused by: java.io.FileNotFoundException: /usr/home/hudson/hudson-slave/workspace/Lucene-Solr-tests-only-trunk/checkout/lucene/build/core/classes/test/org/apache/lucene/util/TestSmallFloat.class (Too many open files in system)
	at java.io.FileInputStream.open(Native Method)
	at java.io.FileInputStream.<init>(FileInputStream.java:137)
	at sun.misc.URLClassPath$FileLoader$1.getInputStream(URLClassPath.java:1005)
	at sun.misc.Resource.cachedInputStream(Resource.java:77)
	at sun.misc.Resource.getByteBuffer(Resource.java:160)
	at java.net.URLClassLoader.defineClass(URLClassLoader.java:266)
	at java.net.URLClassLoader.access$000(URLClassLoader.java:73)
	at java.net.URLClassLoader$1.run(URLClassLoader.java:212)
	... 10 more


FAILED:  <init>.org.apache.lucene.util.TestSortedVIntList

Error Message:
org.apache.lucene.util.TestSortedVIntList

Stack Trace:
java.lang.ClassNotFoundException: org.apache.lucene.util.TestSortedVIntList
	at java.net.URLClassLoader$1.run(URLClassLoader.java:214)
	at java.security.AccessController.doPrivileged(Native Method)
	at java.net.URLClassLoader.findClass(URLClassLoader.java:205)
	at java.lang.ClassLoader.loadClass(ClassLoader.java:321)
	at sun.misc.Launcher$AppClassLoader.loadClass(Launcher.java:294)
	at java.lang.ClassLoader.loadClass(ClassLoader.java:266)
	at java.lang.Class.forName0(Native Method)
	at java.lang.Class.forName(Class.java:186)
	at org.apache.tools.ant.taskdefs.optional.junit.JUnitTestRunner.run(JUnitTestRunner.java:335)
	at org.apache.tools.ant.taskdefs.optional.junit.JUnitTestRunner.launch(JUnitTestRunner.java:911)
	at org.apache.tools.ant.taskdefs.optional.junit.JUnitTestRunner.main(JUnitTestRunner.java:743)
Caused by: java.io.FileNotFoundException: /usr/home/hudson/hudson-slave/workspace/Lucene-Solr-tests-only-trunk/checkout/lucene/build/core/classes/test/org/apache/lucene/util/TestSortedVIntList.class (Too many open files in system)
	at java.io.FileInputStream.open(Native Method)
	at java.io.FileInputStream.<init>(FileInputStream.java:137)
	at sun.misc.URLClassPath$FileLoader$1.getInputStream(URLClassPath.java:1005)
	at sun.misc.Resource.cachedInputStream(Resource.java:77)
	at sun.misc.Resource.getByteBuffer(Resource.java:160)
	at java.net.URLClassLoader.defineClass(URLClassLoader.java:266)
	at java.net.URLClassLoader.access$000(URLClassLoader.java:73)
	at java.net.URLClassLoader$1.run(URLClassLoader.java:212)
	... 10 more


FAILED:  <init>.org.apache.lucene.util.TestUnicodeUtil

Error Message:
org.apache.lucene.util.TestUnicodeUtil

Stack Trace:
java.lang.ClassNotFoundException: org.apache.lucene.util.TestUnicodeUtil
	at java.net.URLClassLoader$1.run(URLClassLoader.java:214)
	at java.security.AccessController.doPrivileged(Native Method)
	at java.net.URLClassLoader.findClass(URLClassLoader.java:205)
	at java.lang.ClassLoader.loadClass(ClassLoader.java:321)
	at sun.misc.Launcher$AppClassLoader.loadClass(Launcher.java:294)
	at java.lang.ClassLoader.loadClass(ClassLoader.java:266)
	at java.lang.Class.forName0(Native Method)
	at java.lang.Class.forName(Class.java:186)
	at org.apache.tools.ant.taskdefs.optional.junit.JUnitTestRunner.run(JUnitTestRunner.java:335)
	at org.apache.tools.ant.taskdefs.optional.junit.JUnitTestRunner.launch(JUnitTestRunner.java:911)
	at org.apache.tools.ant.taskdefs.optional.junit.JUnitTestRunner.main(JUnitTestRunner.java:743)
Caused by: java.io.FileNotFoundException: /usr/home/hudson/hudson-slave/workspace/Lucene-Solr-tests-only-trunk/checkout/lucene/build/core/classes/test/org/apache/lucene/util/TestUnicodeUtil.class (Too many open files in system)
	at java.io.FileInputStream.open(Native Method)
	at java.io.FileInputStream.<init>(FileInputStream.java:137)
	at sun.misc.URLClassPath$FileLoader$1.getInputStream(URLClassPath.java:1005)
	at sun.misc.Resource.cachedInputStream(Resource.java:77)
	at sun.misc.Resource.getByteBuffer(Resource.java:160)
	at java.net.URLClassLoader.defineClass(URLClassLoader.java:266)
	at java.net.URLClassLoader.access$000(URLClassLoader.java:73)
	at java.net.URLClassLoader$1.run(URLClassLoader.java:212)
	... 10 more


FAILED:  <init>.org.apache.lucene.util.TestVersion

Error Message:
org.apache.lucene.util.TestVersion

Stack Trace:
java.lang.ClassNotFoundException: org.apache.lucene.util.TestVersion
	at java.net.URLClassLoader$1.run(URLClassLoader.java:214)
	at java.security.AccessController.doPrivileged(Native Method)
	at java.net.URLClassLoader.findClass(URLClassLoader.java:205)
	at java.lang.ClassLoader.loadClass(ClassLoader.java:321)
	at sun.misc.Launcher$AppClassLoader.loadClass(Launcher.java:294)
	at java.lang.ClassLoader.loadClass(ClassLoader.java:266)
	at java.lang.Class.forName0(Native Method)
	at java.lang.Class.forName(Class.java:186)
	at org.apache.tools.ant.taskdefs.optional.junit.JUnitTestRunner.run(JUnitTestRunner.java:335)
	at org.apache.tools.ant.taskdefs.optional.junit.JUnitTestRunner.launch(JUnitTestRunner.java:911)
	at org.apache.tools.ant.taskdefs.optional.junit.JUnitTestRunner.main(JUnitTestRunner.java:743)
Caused by: java.io.FileNotFoundException: /usr/home/hudson/hudson-slave/workspace/Lucene-Solr-tests-only-trunk/checkout/lucene/build/core/classes/test/org/apache/lucene/util/TestVersion.class (Too many open files in system)
	at java.io.FileInputStream.open(Native Method)
	at java.io.FileInputStream.<init>(FileInputStream.java:137)
	at sun.misc.URLClassPath$FileLoader$1.getInputStream(URLClassPath.java:1005)
	at sun.misc.Resource.cachedInputStream(Resource.java:77)
	at sun.misc.Resource.getByteBuffer(Resource.java:160)
	at java.net.URLClassLoader.defineClass(URLClassLoader.java:266)
	at java.net.URLClassLoader.access$000(URLClassLoader.java:73)
	at java.net.URLClassLoader$1.run(URLClassLoader.java:212)
	... 10 more


FAILED:  <init>.org.apache.lucene.util.automaton.TestBasicOperations

Error Message:
org.apache.lucene.util.automaton.TestBasicOperations

Stack Trace:
java.lang.ClassNotFoundException: org.apache.lucene.util.automaton.TestBasicOperations
	at java.net.URLClassLoader$1.run(URLClassLoader.java:214)
	at java.security.AccessController.doPrivileged(Native Method)
	at java.net.URLClassLoader.findClass(URLClassLoader.java:205)
	at java.lang.ClassLoader.loadClass(ClassLoader.java:321)
	at sun.misc.Launcher$AppClassLoader.loadClass(Launcher.java:294)
	at java.lang.ClassLoader.loadClass(ClassLoader.java:266)
	at java.lang.Class.forName0(Native Method)
	at java.lang.Class.forName(Class.java:186)
	at org.apache.tools.ant.taskdefs.optional.junit.JUnitTestRunner.run(JUnitTestRunner.java:335)
	at org.apache.tools.ant.taskdefs.optional.junit.JUnitTestRunner.launch(JUnitTestRunner.java:911)
	at org.apache.tools.ant.taskdefs.optional.junit.JUnitTestRunner.main(JUnitTestRunner.java:743)
Caused by: java.io.FileNotFoundException: /usr/home/hudson/hudson-slave/workspace/Lucene-Solr-tests-only-trunk/checkout/lucene/build/core/classes/test/org/apache/lucene/util/automaton/TestBasicOperations.class (Too many open files in system)
	at java.io.FileInputStream.open(Native Method)
	at java.io.FileInputStream.<init>(FileInputStream.java:137)
	at sun.misc.URLClassPath$FileLoader$1.getInputStream(URLClassPath.java:1005)
	at sun.misc.Resource.cachedInputStream(Resource.java:77)
	at sun.misc.Resource.getByteBuffer(Resource.java:160)
	at java.net.URLClassLoader.defineClass(URLClassLoader.java:266)
	at java.net.URLClassLoader.access$000(URLClassLoader.java:73)
	at java.net.URLClassLoader$1.run(URLClassLoader.java:212)
	... 10 more


FAILED:  <init>.org.apache.lucene.util.automaton.TestUTF32ToUTF8

Error Message:
org.apache.lucene.util.automaton.TestUTF32ToUTF8

Stack Trace:
java.lang.ClassNotFoundException: org.apache.lucene.util.automaton.TestUTF32ToUTF8
	at java.net.URLClassLoader$1.run(URLClassLoader.java:214)
	at java.security.AccessController.doPrivileged(Native Method)
	at java.net.URLClassLoader.findClass(URLClassLoader.java:205)
	at java.lang.ClassLoader.loadClass(ClassLoader.java:321)
	at sun.misc.Launcher$AppClassLoader.loadClass(Launcher.java:294)
	at java.lang.ClassLoader.loadClass(ClassLoader.java:266)
	at java.lang.Class.forName0(Native Method)
	at java.lang.Class.forName(Class.java:186)
	at org.apache.tools.ant.taskdefs.optional.junit.JUnitTestRunner.run(JUnitTestRunner.java:335)
	at org.apache.tools.ant.taskdefs.optional.junit.JUnitTestRunner.launch(JUnitTestRunner.java:911)
	at org.apache.tools.ant.taskdefs.optional.junit.JUnitTestRunner.main(JUnitTestRunner.java:743)
Caused by: java.io.FileNotFoundException: /usr/home/hudson/hudson-slave/workspace/Lucene-Solr-tests-only-trunk/checkout/lucene/build/core/classes/test/org/apache/lucene/util/automaton/TestUTF32ToUTF8.class (Too many open files in system)
	at java.io.FileInputStream.open(Native Method)
	at java.io.FileInputStream.<init>(FileInputStream.java:137)
	at sun.misc.URLClassPath$FileLoader$1.getInputStream(URLClassPath.java:1005)
	at sun.misc.Resource.cachedInputStream(Resource.java:77)
	at sun.misc.Resource.getByteBuffer(Resource.java:160)
	at java.net.URLClassLoader.defineClass(URLClassLoader.java:266)
	at java.net.URLClassLoader.access$000(URLClassLoader.java:73)
	at java.net.URLClassLoader$1.run(URLClassLoader.java:212)
	... 10 more


FAILED:  <init>.org.apache.lucene.util.junitcompat.TestSetupTeardownChaining

Error Message:
org.apache.lucene.util.junitcompat.TestSetupTeardownChaining

Stack Trace:
java.lang.ClassNotFoundException: org.apache.lucene.util.junitcompat.TestSetupTeardownChaining
	at java.net.URLClassLoader$1.run(URLClassLoader.java:214)
	at java.security.AccessController.doPrivileged(Native Method)
	at java.net.URLClassLoader.findClass(URLClassLoader.java:205)
	at java.lang.ClassLoader.loadClass(ClassLoader.java:321)
	at sun.misc.Launcher$AppClassLoader.loadClass(Launcher.java:294)
	at java.lang.ClassLoader.loadClass(ClassLoader.java:266)
	at java.lang.Class.forName0(Native Method)
	at java.lang.Class.forName(Class.java:186)
	at org.apache.tools.ant.taskdefs.optional.junit.JUnitTestRunner.run(JUnitTestRunner.java:335)
	at org.apache.tools.ant.taskdefs.optional.junit.JUnitTestRunner.launch(JUnitTestRunner.java:911)
	at org.apache.tools.ant.taskdefs.optional.junit.JUnitTestRunner.main(JUnitTestRunner.java:743)
Caused by: java.io.FileNotFoundException: /usr/home/hudson/hudson-slave/workspace/Lucene-Solr-tests-only-trunk/checkout/lucene/build/core/classes/test/org/apache/lucene/util/junitcompat/TestSetupTeardownChaining.class (Too many open files in system)
	at java.io.FileInputStream.open(Native Method)
	at java.io.FileInputStream.<init>(FileInputStream.java:137)
	at sun.misc.URLClassPath$FileLoader$1.getInputStream(URLClassPath.java:1005)
	at sun.misc.Resource.cachedInputStream(Resource.java:77)
	at sun.misc.Resource.getByteBuffer(Resource.java:160)
	at java.net.URLClassLoader.defineClass(URLClassLoader.java:266)
	at java.net.URLClassLoader.access$000(URLClassLoader.java:73)
	at java.net.URLClassLoader$1.run(URLClassLoader.java:212)
	... 10 more




Build Log (for compile errors):
[...truncated 2786 lines...]