You are viewing a plain text version of this content. The canonical link for it is here.
Posted to builds@beam.apache.org by Apache Jenkins Server <je...@builds.apache.org> on 2023/04/05 19:50:12 UTC
Build failed in Jenkins: beam_PostCommit_Java_DataflowV2 #2884
See <https://ci-beam.apache.org/job/beam_PostCommit_Java_DataflowV2/2884/display/redirect?page=changes>
Changes:
[noreply] Bump golang.org/x/sys from 0.6.0 to 0.7.0 in /sdks (#26110)
------------------------------------------
[...truncated 82.22 KB...]
W0405 15:58:03.616494 85 library.go:101] "golang.org/x/sys/unix" contains non-Go code that can't be inspected for further dependencies:
/go/pkg/mod/golang.org/x/sys@v0.5.0/unix/asm_linux_amd64.s
github.com/apache/beam/sdks/v2/go/pkg/beam,https://github.com/apache/beam/blob/sdks/v2.46.0/sdks/go/README.md,Apache-2.0
github.com/apache/beam/sdks/v2/java/container,https://github.com/apache/beam/blob/sdks/v2.46.0/sdks/LICENSE,Apache-2.0
github.com/golang/protobuf,https://github.com/golang/protobuf/blob/v1.5.2/LICENSE,BSD-3-Clause
golang.org/x/net,https://cs.opensource.google/go/x/net/+/v0.5.0:LICENSE,BSD-3-Clause
golang.org/x/sys/unix,https://cs.opensource.google/go/x/sys/+/v0.5.0:LICENSE,BSD-3-Clause
golang.org/x/text,https://cs.opensource.google/go/x/text/+/v0.7.0:LICENSE,BSD-3-Clause
google.golang.org/genproto/googleapis/rpc/status,https://github.com/googleapis/go-genproto/blob/76db0878b65f/LICENSE,Apache-2.0
google.golang.org/grpc,https://github.com/grpc/grpc-go/blob/v1.52.3/LICENSE,Apache-2.0
google.golang.org/protobuf,https://github.com/protocolbuffers/protobuf-go/blob/v1.28.1/LICENSE,BSD-3-Clause
+ chmod -R a+w /output/licenses
> Task :sdks:java:container:java8:copySdkHarnessLauncher
Execution optimizations have been disabled for task ':sdks:java:container:java8:copySdkHarnessLauncher' to ensure correctness due to the following reasons:
- Gradle detected a problem with the following location: '<https://ci-beam.apache.org/job/beam_PostCommit_Java_DataflowV2/ws/src/sdks/java/container/build/target'.> Reason: Task ':sdks:java:container:java8:copySdkHarnessLauncher' uses this output of task ':sdks:java:container:downloadCloudProfilerAgent' without declaring an explicit or implicit dependency. This can lead to incorrect results being produced, depending on what order the tasks are executed. Please refer to https://docs.gradle.org/7.5.1/userguide/validation_problems.html#implicit_dependency for more details about this problem.
- Gradle detected a problem with the following location: '<https://ci-beam.apache.org/job/beam_PostCommit_Java_DataflowV2/ws/src/sdks/java/container/build/target'.> Reason: Task ':sdks:java:container:java8:copySdkHarnessLauncher' uses this output of task ':sdks:java:container:pullLicenses' without declaring an explicit or implicit dependency. This can lead to incorrect results being produced, depending on what order the tasks are executed. Please refer to https://docs.gradle.org/7.5.1/userguide/validation_problems.html#implicit_dependency for more details about this problem.
> Task :release:go-licenses:java:createLicenses
> Task :sdks:java:container:java8:copyGolangLicenses
> Task :sdks:java:container:java8:dockerPrepare
> Task :sdks:java:container:java8:docker
#1 [internal] load build definition from Dockerfile
#1 transferring dockerfile: 2.85kB done
#1 DONE 0.0s
#2 [internal] load .dockerignore
#2 transferring context: 2B done
#2 DONE 0.0s
#3 [internal] load metadata for docker.io/library/eclipse-temurin:8
#3 DONE 0.3s
#4 [ 1/18] FROM docker.io/library/eclipse-temurin:8@sha256:005d3189b2ec1612c3ade6eadabd1935c312f03aa7905cf0528e9d71980ad512
#4 resolve docker.io/library/eclipse-temurin:8@sha256:005d3189b2ec1612c3ade6eadabd1935c312f03aa7905cf0528e9d71980ad512 0.0s done
#4 CACHED
#5 [internal] load build context
#5 transferring context: 46.73MB 0.3s done
#5 DONE 0.4s
#6 [ 2/18] ADD target/slf4j-api.jar /opt/apache/beam/jars/
#6 DONE 1.1s
#7 [ 3/18] ADD target/slf4j-jdk14.jar /opt/apache/beam/jars/
#7 DONE 0.1s
#8 [ 4/18] ADD target/jcl-over-slf4j.jar /opt/apache/beam/jars/
#8 DONE 0.1s
#9 [ 5/18] ADD target/log4j-over-slf4j.jar /opt/apache/beam/jars/
#9 DONE 0.1s
#10 [ 6/18] ADD target/log4j-to-slf4j.jar /opt/apache/beam/jars/
#10 DONE 0.1s
#11 [ 7/18] ADD target/beam-sdks-java-harness.jar /opt/apache/beam/jars/
#11 DONE 0.1s
#12 [ 8/18] COPY target/jamm.jar target/open-module-agent*.jar /opt/apache/beam/jars/
#12 DONE 0.1s
#13 [ 9/18] COPY target/linux_amd64/boot /opt/apache/beam/
#13 DONE 0.2s
#14 [10/18] COPY target/LICENSE /opt/apache/beam/
#14 DONE 0.1s
#15 [11/18] COPY target/NOTICE /opt/apache/beam/
#15 DONE 0.1s
#16 [12/18] ADD target/third_party_licenses /opt/apache/beam/third_party_licenses/
#16 DONE 0.2s
#17 [13/18] COPY target/LICENSE target/options/* /opt/apache/beam/options/
#17 DONE 0.1s
#18 [14/18] RUN rm /opt/apache/beam/options/LICENSE
#18 DONE 0.4s
#19 [15/18] COPY target/LICENSE target/go-licenses/* /opt/apache/beam/third_party_licenses/golang/
#19 DONE 0.1s
#20 [16/18] RUN rm /opt/apache/beam/third_party_licenses/golang/LICENSE
#20 DONE 0.4s
#21 [17/18] RUN if [ "true" = "false" ] ; then rm -rf /opt/apache/beam/third_party_licenses ; fi
#21 DONE 0.4s
#22 [18/18] COPY target/profiler/* /opt/google_cloud_profiler/
#22 DONE 0.1s
#23 exporting to image
#23 exporting layers
#23 exporting layers 0.2s done
#23 writing image sha256:a40fae68eb810f6735f7b47a2651678e585930cf5bca9010727a81b72d65b717 done
#23 naming to docker.io/apache/beam_java8_sdk:2.47.0.dev done
#23 DONE 0.2s
> Task :runners:google-cloud-dataflow-java:buildAndPushDockerJavaContainer
WARNING: `gcloud docker` will not be supported for Docker client versions above 18.03.
As an alternative, use `gcloud auth configure-docker` to configure `docker` to
use `gcloud` as a credential helper, then use `docker` as you would for non-GCR
registries, e.g. `docker pull gcr.io/project-id/my-image`. Add
`--verbosity=error` to silence this warning: `gcloud docker
--verbosity=error -- pull gcr.io/project-id/my-image`.
See: https://cloud.google.com/container-registry/docs/support/deprecation-notices#gcloud-docker
The push refers to repository [us.gcr.io/apache-beam-testing/java-postcommit-it/java]
626af11066ab: Preparing
5f70bf18a086: Preparing
ae61cf579aaf: Preparing
f873eec2271f: Preparing
f69795713bf7: Preparing
fb6705e090a7: Preparing
1039af054a6f: Preparing
5dd7acc0ce88: Preparing
43861653794c: Preparing
82b21ee608d6: Preparing
1e8ecffbc162: Preparing
fcc34661f5a4: Preparing
909cc05b6dc8: Preparing
451164c682c4: Preparing
e06d5fe40d92: Preparing
d4be057533c2: Preparing
db72bc15551b: Preparing
533af4d05d89: Preparing
d09fdd9ad3ef: Preparing
04d1dcab20cb: Preparing
fb6705e090a7: Waiting
b93c1bd012ab: Preparing
43861653794c: Waiting
5dd7acc0ce88: Waiting
82b21ee608d6: Waiting
1e8ecffbc162: Waiting
db72bc15551b: Waiting
d4be057533c2: Waiting
fcc34661f5a4: Waiting
451164c682c4: Waiting
533af4d05d89: Waiting
e06d5fe40d92: Waiting
b93c1bd012ab: Waiting
909cc05b6dc8: Waiting
5f70bf18a086: Layer already exists
f69795713bf7: Pushed
f873eec2271f: Pushed
ae61cf579aaf: Pushed
fb6705e090a7: Pushed
626af11066ab: Pushed
5dd7acc0ce88: Pushed
43861653794c: Pushed
1039af054a6f: Pushed
82b21ee608d6: Pushed
1e8ecffbc162: Pushed
909cc05b6dc8: Pushed
fcc34661f5a4: Pushed
533af4d05d89: Layer already exists
d09fdd9ad3ef: Layer already exists
04d1dcab20cb: Layer already exists
b93c1bd012ab: Layer already exists
451164c682c4: Pushed
e06d5fe40d92: Pushed
d4be057533c2: Pushed
db72bc15551b: Pushed
20230405155742: digest: sha256:978a668866cedc1bfbbab2c087ba14cc74600bba829bac46ab644476b6818e3c size: 4710
> Task :runners:google-cloud-dataflow-java:coreSDKJavaRunnerV2IntegrationTest NO-SOURCE
> Task :runners:google-cloud-dataflow-java:examplesJavaRunnerV2IntegrationTest
***********************************************************
***********************************************************
**********************Set Up Pubsub************************
The Pub/Sub topic has been set up for this example: projects/apache-beam-testing/topics/testpipeline-jenkins-0405155833-5910939b
The Pub/Sub subscription has been set up for this example: projects/apache-beam-testing/subscriptions/testpipeline-jenkins-0405155833-5910939b
*************************Tear Down*************************
The Pub/Sub topic has been deleted: projects/apache-beam-testing/topics/testpipeline-jenkins-0405155833-5910939b
The Pub/Sub subscription has been deleted: projects/apache-beam-testing/subscriptions/testpipeline-jenkins-0405155833-5910939b
***********************************************************
***********************************************************
***********************************************************
***********************************************************
**********************Set Up Pubsub************************
The Pub/Sub topic has been set up for this example: projects/apache-beam-testing/topics/testpipeline-jenkins-0405155833-d83e7762
The Pub/Sub subscription has been set up for this example: projects/apache-beam-testing/subscriptions/testpipeline-jenkins-0405155833-d83e7762
*************************Tear Down*************************
The Pub/Sub topic has been deleted: projects/apache-beam-testing/topics/testpipeline-jenkins-0405155833-d83e7762
The Pub/Sub subscription has been deleted: projects/apache-beam-testing/subscriptions/testpipeline-jenkins-0405155833-d83e7762
***********************************************************
***********************************************************
> Task :runners:google-cloud-dataflow-java:googleCloudPlatformRunnerV2IntegrationTest
org.apache.beam.sdk.io.gcp.bigquery.BigQueryIOStorageReadIT > testBigQueryStorageRead1GAvro FAILED
java.lang.RuntimeException at BigQueryIOStorageReadIT.java:114
org.apache.beam.sdk.io.gcp.pubsub.PubsubReadIT > testReadPubsubMessageId FAILED
java.lang.AssertionError at PubsubReadIT.java:85
87 tests completed, 2 failed, 2 skipped
> Task :runners:google-cloud-dataflow-java:googleCloudPlatformRunnerV2IntegrationTest FAILED
> Task :runners:google-cloud-dataflow-java:cleanUpDockerJavaImages
Untagged: us.gcr.io/apache-beam-testing/java-postcommit-it/java:20230405155742
Untagged: us.gcr.io/apache-beam-testing/java-postcommit-it/java@sha256:978a668866cedc1bfbbab2c087ba14cc74600bba829bac46ab644476b6818e3c
Deleted: sha256:a40fae68eb810f6735f7b47a2651678e585930cf5bca9010727a81b72d65b717
WARNING: Successfully resolved tag to sha256, but it is recommended to use sha256 directly.
Tag: [us.gcr.io/apache-beam-testing/java-postcommit-it/java:20230405155742]
- referencing digest: [us.gcr.io/apache-beam-testing/java-postcommit-it/java@sha256:978a668866cedc1bfbbab2c087ba14cc74600bba829bac46ab644476b6818e3c]
Deleted [[us.gcr.io/apache-beam-testing/java-postcommit-it/java:20230405155742] (referencing [us.gcr.io/apache-beam-testing/java-postcommit-it/java@sha256:978a668866cedc1bfbbab2c087ba14cc74600bba829bac46ab644476b6818e3c])].
Removing untagged image us.gcr.io/apache-beam-testing/java-postcommit-it/java@sha256:978a668866cedc1bfbbab2c087ba14cc74600bba829bac46ab644476b6818e3c
Digests:
- us.gcr.io/apache-beam-testing/java-postcommit-it/java@sha256:978a668866cedc1bfbbab2c087ba14cc74600bba829bac46ab644476b6818e3c
Deleted [us.gcr.io/apache-beam-testing/java-postcommit-it/java@sha256:978a668866cedc1bfbbab2c087ba14cc74600bba829bac46ab644476b6818e3c].
FAILURE: Build failed with an exception.
* What went wrong:
Execution failed for task ':runners:google-cloud-dataflow-java:googleCloudPlatformRunnerV2IntegrationTest'.
> There were failing tests. See the report at: file://<https://ci-beam.apache.org/job/beam_PostCommit_Java_DataflowV2/ws/src/runners/google-cloud-dataflow-java/build/reports/tests/googleCloudPlatformRunnerV2IntegrationTest/index.html>
* Try:
> Run with --stacktrace option to get the stack trace.
> Run with --info or --debug option to get more log output.
* Get more help at https://help.gradle.org
Deprecated Gradle features were used in this build, making it incompatible with Gradle 8.0.
You can use '--warning-mode all' to show the individual deprecation warnings and determine if they come from your own scripts or plugins.
See https://docs.gradle.org/7.5.1/userguide/command_line_interface.html#sec:command_line_warnings
Execution optimizations have been disabled for 1 invalid unit(s) of work during this build to ensure correctness.
Please consult deprecation warnings for more details.
BUILD FAILED in 3h 52m 41s
152 actionable tasks: 98 executed, 50 from cache, 4 up-to-date
Publishing build scan...
https://gradle.com/s/r7u7i4ucsgtzk
Build step 'Invoke Gradle script' changed build result to FAILURE
Build step 'Invoke Gradle script' marked build as failure
---------------------------------------------------------------------
To unsubscribe, e-mail: builds-unsubscribe@beam.apache.org
For additional commands, e-mail: builds-help@beam.apache.org
Jenkins build is back to normal : beam_PostCommit_Java_DataflowV2 #2885
Posted by Apache Jenkins Server <je...@builds.apache.org>.
See <https://ci-beam.apache.org/job/beam_PostCommit_Java_DataflowV2/2885/display/redirect>
---------------------------------------------------------------------
To unsubscribe, e-mail: builds-unsubscribe@beam.apache.org
For additional commands, e-mail: builds-help@beam.apache.org