You are viewing a plain text version of this content. The canonical link for it is here.
Posted to commits@cayenne.apache.org by Apache Jenkins Server <je...@builds.apache.org> on 2016/04/09 12:25:30 UTC
Build failed in Jenkins: cayenne-31 » h2,latest1.8,Ubuntu #130
See <https://builds.apache.org/job/cayenne-31/cayenneTestConnection=h2,jdk=latest1.8,label=Ubuntu/130/changes>
Changes:
[aadamchik] lax javadoc rules for Java 8
------------------------------------------
[...truncated 101408 lines...]
Apr 09, 2016 10:25:36 AM org.apache.cayenne.test.jdbc.UtilityLogger log
INFO: INSERT INTO COLLECTION_TO_MANY_TARGET (ID, COLLECTION_TO_MANY_ID) VALUES (?, ?)
Apr 09, 2016 10:25:36 AM org.apache.cayenne.test.jdbc.UtilityLogger log
INFO: INSERT INTO COLLECTION_TO_MANY_TARGET (ID, COLLECTION_TO_MANY_ID) VALUES (?, ?)
Apr 09, 2016 10:25:36 AM org.apache.cayenne.test.jdbc.UtilityLogger log
INFO: INSERT INTO COLLECTION_TO_MANY_TARGET (ID, COLLECTION_TO_MANY_ID) VALUES (?, ?)
Apr 09, 2016 10:25:36 AM org.apache.cayenne.log.CommonsJdbcEventLogger logBeginTransaction
INFO: --- transaction started.
Apr 09, 2016 10:25:36 AM org.apache.cayenne.log.CommonsJdbcEventLogger logQuery
INFO: SELECT t0.ID FROM COLLECTION_TO_MANY t0 WHERE t0.ID = ? [bind: 1->ID:1]
Apr 09, 2016 10:25:36 AM org.apache.cayenne.log.CommonsJdbcEventLogger logSelectCount
INFO: === returned 1 row. - took 0 ms.
Apr 09, 2016 10:25:36 AM org.apache.cayenne.log.CommonsJdbcEventLogger logCommitTransaction
INFO: +++ transaction committed.
Apr 09, 2016 10:25:36 AM org.apache.cayenne.log.CommonsJdbcEventLogger logBeginTransaction
INFO: --- transaction started.
Apr 09, 2016 10:25:36 AM org.apache.cayenne.log.CommonsJdbcEventLogger logQuery
INFO: SELECT t0.COLLECTION_TO_MANY_ID, t0.ID FROM COLLECTION_TO_MANY_TARGET t0 WHERE t0.COLLECTION_TO_MANY_ID = ? [bind: 1->COLLECTION_TO_MANY_ID:1]
Apr 09, 2016 10:25:36 AM org.apache.cayenne.log.CommonsJdbcEventLogger logSelectCount
INFO: === returned 3 rows. - took 0 ms.
Apr 09, 2016 10:25:36 AM org.apache.cayenne.log.CommonsJdbcEventLogger logCommitTransaction
INFO: +++ transaction committed.
Apr 09, 2016 10:25:36 AM org.apache.cayenne.log.CommonsJdbcEventLogger logBeginTransaction
INFO: --- transaction started.
Apr 09, 2016 10:25:36 AM org.apache.cayenne.log.CommonsJdbcEventLogger logQuery
INFO: UPDATE COLLECTION_TO_MANY_TARGET SET COLLECTION_TO_MANY_ID = ? WHERE ID = ?
Apr 09, 2016 10:25:36 AM org.apache.cayenne.log.CommonsJdbcEventLogger logQueryParameters
INFO: [bind: 1->COLLECTION_TO_MANY_ID:NULL, 2->ID:2]
Apr 09, 2016 10:25:36 AM org.apache.cayenne.log.CommonsJdbcEventLogger logUpdateCount
INFO: === updated 1 row.
Apr 09, 2016 10:25:36 AM org.apache.cayenne.log.CommonsJdbcEventLogger logCommitTransaction
INFO: +++ transaction committed.
Apr 09, 2016 10:25:36 AM org.apache.cayenne.log.CommonsJdbcEventLogger logBeginTransaction
INFO: --- transaction started.
Apr 09, 2016 10:25:36 AM org.apache.cayenne.log.CommonsJdbcEventLogger logQuery
INFO: SELECT t0.ID FROM COLLECTION_TO_MANY t0 WHERE t0.ID = ? [bind: 1->ID:1]
Apr 09, 2016 10:25:36 AM org.apache.cayenne.log.CommonsJdbcEventLogger logSelectCount
INFO: === returned 1 row. - took 1 ms.
Apr 09, 2016 10:25:36 AM org.apache.cayenne.log.CommonsJdbcEventLogger logCommitTransaction
INFO: +++ transaction committed.
Apr 09, 2016 10:25:36 AM org.apache.cayenne.log.CommonsJdbcEventLogger logBeginTransaction
INFO: --- transaction started.
Apr 09, 2016 10:25:36 AM org.apache.cayenne.log.CommonsJdbcEventLogger logQuery
INFO: SELECT t0.COLLECTION_TO_MANY_ID, t0.ID FROM COLLECTION_TO_MANY_TARGET t0 WHERE t0.COLLECTION_TO_MANY_ID = ? [bind: 1->COLLECTION_TO_MANY_ID:1]
Apr 09, 2016 10:25:36 AM org.apache.cayenne.log.CommonsJdbcEventLogger logSelectCount
INFO: === returned 2 rows. - took 1 ms.
Apr 09, 2016 10:25:36 AM org.apache.cayenne.log.CommonsJdbcEventLogger logCommitTransaction
INFO: +++ transaction committed.
Apr 09, 2016 10:25:36 AM org.apache.cayenne.configuration.XMLDataChannelDescriptorLoader load
INFO: Loading XML configuration resource from file:/x1/jenkins/jenkins-slave/workspace/cayenne-31/cayenneTestConnection/h2/jdk/latest1.8/label/Ubuntu/framework/cayenne-jdk1.5-unpublished/target/test-classes/cayenne-relationships.xml
Apr 09, 2016 10:25:36 AM org.apache.cayenne.configuration.XMLDataChannelDescriptorLoader$DataChannelChildrenHandler createChildTagHandler
INFO: Loading XML DataMap resource from file:/x1/jenkins/jenkins-slave/workspace/cayenne-31/cayenneTestConnection/h2/jdk/latest1.8/label/Ubuntu/framework/cayenne-jdk1.5-unpublished/target/test-classes/relationships.map.xml
Apr 09, 2016 10:25:36 AM org.apache.cayenne.map.EntityResolver applyDBLayerDefaults
INFO: added runtime complimentary DbRelationship from DELETE_RULE_TEST3 to DELETE_RULE_TEST1
Apr 09, 2016 10:25:36 AM org.apache.cayenne.map.EntityResolver applyObjectLayerDefaults
INFO: added runtime complimentary ObjRelationship from FlattenedTest3 to FlattenedTest1
Apr 09, 2016 10:25:36 AM org.apache.cayenne.map.EntityResolver applyObjectLayerDefaults
INFO: added runtime complimentary ObjRelationship from FlattenedTest4 to FlattenedTest1
Apr 09, 2016 10:25:36 AM org.apache.cayenne.test.jdbc.UtilityLogger log
INFO: delete from COLLECTION_TO_MANY_TARGET
Apr 09, 2016 10:25:36 AM org.apache.cayenne.test.jdbc.UtilityLogger log
INFO: delete from COLLECTION_TO_MANY
Apr 09, 2016 10:25:36 AM org.apache.cayenne.test.jdbc.UtilityLogger log
INFO: INSERT INTO COLLECTION_TO_MANY (ID) VALUES (?)
Apr 09, 2016 10:25:36 AM org.apache.cayenne.test.jdbc.UtilityLogger log
INFO: INSERT INTO COLLECTION_TO_MANY (ID) VALUES (?)
Apr 09, 2016 10:25:36 AM org.apache.cayenne.test.jdbc.UtilityLogger log
INFO: INSERT INTO COLLECTION_TO_MANY_TARGET (ID, COLLECTION_TO_MANY_ID) VALUES (?, ?)
Apr 09, 2016 10:25:36 AM org.apache.cayenne.test.jdbc.UtilityLogger log
INFO: INSERT INTO COLLECTION_TO_MANY_TARGET (ID, COLLECTION_TO_MANY_ID) VALUES (?, ?)
Apr 09, 2016 10:25:36 AM org.apache.cayenne.test.jdbc.UtilityLogger log
INFO: INSERT INTO COLLECTION_TO_MANY_TARGET (ID, COLLECTION_TO_MANY_ID) VALUES (?, ?)
Apr 09, 2016 10:25:36 AM org.apache.cayenne.test.jdbc.UtilityLogger log
INFO: INSERT INTO COLLECTION_TO_MANY_TARGET (ID, COLLECTION_TO_MANY_ID) VALUES (?, ?)
Apr 09, 2016 10:25:36 AM org.apache.cayenne.log.CommonsJdbcEventLogger logBeginTransaction
INFO: --- transaction started.
Apr 09, 2016 10:25:36 AM org.apache.cayenne.log.CommonsJdbcEventLogger logQuery
INFO: SELECT t0.ID FROM COLLECTION_TO_MANY t0 WHERE t0.ID = ? [bind: 1->ID:1]
Apr 09, 2016 10:25:36 AM org.apache.cayenne.log.CommonsJdbcEventLogger logSelectCount
INFO: === returned 1 row. - took 0 ms.
Apr 09, 2016 10:25:36 AM org.apache.cayenne.log.CommonsJdbcEventLogger logCommitTransaction
INFO: +++ transaction committed.
Apr 09, 2016 10:25:36 AM org.apache.cayenne.log.CommonsJdbcEventLogger logBeginTransaction
INFO: --- transaction started.
Apr 09, 2016 10:25:36 AM org.apache.cayenne.log.CommonsJdbcEventLogger logQuery
INFO: SELECT t0.COLLECTION_TO_MANY_ID, t0.ID FROM COLLECTION_TO_MANY_TARGET t0 WHERE t0.COLLECTION_TO_MANY_ID = ? [bind: 1->COLLECTION_TO_MANY_ID:1]
Apr 09, 2016 10:25:36 AM org.apache.cayenne.log.CommonsJdbcEventLogger logSelectCount
INFO: === returned 3 rows. - took 0 ms.
Apr 09, 2016 10:25:36 AM org.apache.cayenne.log.CommonsJdbcEventLogger logCommitTransaction
INFO: +++ transaction committed.
Apr 09, 2016 10:25:36 AM org.apache.cayenne.log.CommonsJdbcEventLogger logBeginTransaction
INFO: --- transaction started.
Apr 09, 2016 10:25:36 AM org.apache.cayenne.log.CommonsJdbcEventLogger logQuery
INFO: INSERT INTO COLLECTION_TO_MANY_TARGET (COLLECTION_TO_MANY_ID, ID) VALUES (?, ?)
Apr 09, 2016 10:25:36 AM org.apache.cayenne.log.CommonsJdbcEventLogger logQueryParameters
INFO: [bind: 1->COLLECTION_TO_MANY_ID:1, 2->ID:201]
Apr 09, 2016 10:25:36 AM org.apache.cayenne.log.CommonsJdbcEventLogger logUpdateCount
INFO: === updated 1 row.
Apr 09, 2016 10:25:36 AM org.apache.cayenne.log.CommonsJdbcEventLogger logCommitTransaction
INFO: +++ transaction committed.
Apr 09, 2016 10:25:36 AM org.apache.cayenne.log.CommonsJdbcEventLogger logBeginTransaction
INFO: --- transaction started.
Apr 09, 2016 10:25:36 AM org.apache.cayenne.log.CommonsJdbcEventLogger logQuery
INFO: SELECT t0.ID FROM COLLECTION_TO_MANY t0 WHERE t0.ID = ? [bind: 1->ID:1]
Apr 09, 2016 10:25:36 AM org.apache.cayenne.log.CommonsJdbcEventLogger logSelectCount
INFO: === returned 1 row. - took 1 ms.
Apr 09, 2016 10:25:36 AM org.apache.cayenne.log.CommonsJdbcEventLogger logCommitTransaction
INFO: +++ transaction committed.
Apr 09, 2016 10:25:36 AM org.apache.cayenne.log.CommonsJdbcEventLogger logBeginTransaction
INFO: --- transaction started.
Apr 09, 2016 10:25:36 AM org.apache.cayenne.log.CommonsJdbcEventLogger logQuery
INFO: SELECT t0.COLLECTION_TO_MANY_ID, t0.ID FROM COLLECTION_TO_MANY_TARGET t0 WHERE t0.COLLECTION_TO_MANY_ID = ? [bind: 1->COLLECTION_TO_MANY_ID:1]
Apr 09, 2016 10:25:36 AM org.apache.cayenne.log.CommonsJdbcEventLogger logSelectCount
INFO: === returned 4 rows. - took 0 ms.
Apr 09, 2016 10:25:36 AM org.apache.cayenne.log.CommonsJdbcEventLogger logCommitTransaction
INFO: +++ transaction committed.
Tests run: 5, Failures: 0, Errors: 0, Skipped: 0, Time elapsed: 0.081 sec
Running org.apache.cayenne.cache.MapQueryCacheTest
Tests run: 1, Failures: 0, Errors: 0, Skipped: 0, Time elapsed: 0.003 sec
Results :
Tests in error:
testObjectQueryStringBoolean(org.apache.cayenne.access.DataContextPerformQueryAPITest)
testProcedureQueryStringMapBoolean(org.apache.cayenne.access.DataContextPerformQueryAPITest)
testObjectQueryStringMapBoolean(org.apache.cayenne.access.DataContextPerformQueryAPITest)
testNonSelectingQueryString(org.apache.cayenne.access.DataContextPerformQueryAPITest)
testNonSelectingQueryStringMap(org.apache.cayenne.access.DataContextPerformQueryAPITest)
testPerfomQueryNonSelecting(org.apache.cayenne.access.DataContextPerformQueryAPITest)
testObjectQueryWithLocalCache(org.apache.cayenne.access.DataContextPerformQueryAPITest)
testObjectQueryWithSharedCache(org.apache.cayenne.access.DataContextPerformQueryAPITest)
testJointPrefetch_ToMany_FetchLimit(org.apache.cayenne.access.JointPrefetchTest)
testJointPrefetchDataRows(org.apache.cayenne.access.JointPrefetchTest)
testJointPrefetchSQLTemplate(org.apache.cayenne.access.JointPrefetchTest)
testJointPrefetchToOne(org.apache.cayenne.access.JointPrefetchTest)
testJointPrefetchDataTypes(org.apache.cayenne.access.JointPrefetchTest)
testJointPrefetchToMany(org.apache.cayenne.access.JointPrefetchTest)
testJointPrefetchToManyNonConflictingQualifier(org.apache.cayenne.access.JointPrefetchTest)
testJointPrefetchMultiStep(org.apache.cayenne.access.JointPrefetchTest)
testJointPrefetch_ToOne_FetchLimit(org.apache.cayenne.access.JointPrefetchTest)
testSelectWithToManyDBQualifier(org.apache.cayenne.CDOOne2ManyTest)
testNewAdd(org.apache.cayenne.CDOOne2ManyTest)
testPostLoad_MixedResult(org.apache.cayenne.access.DataDomainCallbacksTest)
testPostLoad_Relationship(org.apache.cayenne.access.DataDomainCallbacksTest)
testPostLoad_Prefetch(org.apache.cayenne.access.DataDomainCallbacksTest)
testPostLoad(org.apache.cayenne.access.DataDomainCallbacksTest)
testPostLoad_LocalObject(org.apache.cayenne.access.DataDomainCallbacksTest)
testPreUpdate(org.apache.cayenne.access.DataDomainCallbacksTest)
testPostUpdate(org.apache.cayenne.access.DataDomainCallbacksTest)
testPostRemove(org.apache.cayenne.access.DataDomainCallbacksTest)
testPostRemove_UpdatedDeleted(org.apache.cayenne.access.DataDomainCallbacksTest)
testPostRemove_InsertedUpdatedDeleted(org.apache.cayenne.access.DataDomainCallbacksTest)
testPostPersist(org.apache.cayenne.access.DataDomainCallbacksTest)
Tests run: 2151, Failures: 0, Errors: 30, Skipped: 0
[INFO] ------------------------------------------------------------------------
[INFO] Reactor Summary:
[INFO]
[INFO] Cayenne ........................................... SUCCESS [0.252s]
[INFO] Common Unit Test Utilities ........................ SUCCESS [1.647s]
[INFO] Cayenne Internal Build Plugin ..................... SUCCESS [1.253s]
[INFO] Cayenne Build Tools Parent ........................ SUCCESS [0.004s]
[INFO] Cayenne License and Notice Bundle ................. SUCCESS [0.329s]
[INFO] Cayenne Dependency Injection Container ............ SUCCESS [2.354s]
[INFO] Cayenne Java 1.5 Unpublished ...................... FAILURE [1:11.758s]
[INFO] Cayenne WebObjects Compatibility Library .......... SKIPPED
[INFO] Cayenne Aggregated Server Jar ..................... SKIPPED
[INFO] Cayenne Aggregated Client Jar ..................... SKIPPED
[INFO] Cayenne Project ................................... SKIPPED
[INFO] Cayenne Tools ..................................... SKIPPED
[INFO] Library: cayenne-lifecycle ........................ SKIPPED
[INFO] Cayenne Maven Plugin .............................. SKIPPED
[INFO] Cayenne Framework Aggregator Project .............. SKIPPED
[INFO] Cayenne Integration Tests Parent .................. SKIPPED
[INFO] Integration Tests - Cayenne Runtime ............... SKIPPED
[INFO] Integration Tests - Cayenne Tools ................. SKIPPED
[INFO] Cayenne Modeler ................................... SKIPPED
[INFO] Cayenne Modeler Maven Plugin ...................... SKIPPED
[INFO] Cayenne Modeler Generic and Windows Extensions .... SKIPPED
[INFO] Cayenne Modeler Generic ........................... SKIPPED
[INFO] Cayenne Modeler Mac OS X Extensions ............... SKIPPED
[INFO] Cayenne Modeler Mac OS X .......................... SKIPPED
[INFO] Cayenne Modeler Mac OS X - Old Apple Java ......... SKIPPED
[INFO] Cayenne Modeler Windows ........................... SKIPPED
[INFO] Cayenne Modeler Parent ............................ SKIPPED
[INFO] Cayenne Tutorial .................................. SKIPPED
[INFO] Cayenne ROP Server Tutorial ....................... SKIPPED
[INFO] Cayenne ROP Client Tutorial ....................... SKIPPED
[INFO] Cayenne Tutorials ................................. SKIPPED
[INFO] Cayenne Documentation ............................. SKIPPED
[INFO] Cayenne Documenation Parent ....................... SKIPPED
[INFO] Cayenne Docbook Documentation ..................... SKIPPED
[INFO] Docbook: Cayenne Stylesheets ...................... SKIPPED
[INFO] Docbook: Cayenne Guide ............................ SKIPPED
[INFO] Docbook: Getting Started with Cayenne ............. SKIPPED
[INFO] Docbook: Getting Started with Cayenne ROP ......... SKIPPED
[INFO] Docbook: Cayenne New Features and Upgrade Guide ... SKIPPED
[INFO] Cayenne Release Assembly .......................... SKIPPED
[INFO] ------------------------------------------------------------------------
[INFO] BUILD FAILURE
[INFO] ------------------------------------------------------------------------
[INFO] Total time: 1:18.350s
[INFO] Finished at: Sat Apr 09 10:25:37 UTC 2016
[INFO] Final Memory: 53M/347M
[INFO] ------------------------------------------------------------------------
[ERROR] Failed to execute goal org.apache.maven.plugins:maven-surefire-plugin:2.5:test (default-test) on project cayenne-jdk1.5-unpublished: There are test failures.
[ERROR]
[ERROR] Please refer to /x1/jenkins/jenkins-slave/workspace/cayenne-31/cayenneTestConnection/h2/jdk/latest1.8/label/Ubuntu/framework/cayenne-jdk1.5-unpublished/target/surefire-reports for the individual test results.
[ERROR] -> [Help 1]
org.apache.maven.lifecycle.LifecycleExecutionException: Failed to execute goal org.apache.maven.plugins:maven-surefire-plugin:2.5:test (default-test) on project cayenne-jdk1.5-unpublished: There are test failures.
Please refer to /x1/jenkins/jenkins-slave/workspace/cayenne-31/cayenneTestConnection/h2/jdk/latest1.8/label/Ubuntu/framework/cayenne-jdk1.5-unpublished/target/surefire-reports for the individual test results.
at org.apache.maven.lifecycle.internal.MojoExecutor.execute(MojoExecutor.java:213)
at org.apache.maven.lifecycle.internal.MojoExecutor.execute(MojoExecutor.java:153)
at org.apache.maven.lifecycle.internal.MojoExecutor.execute(MojoExecutor.java:145)
at org.apache.maven.lifecycle.internal.LifecycleModuleBuilder.buildProject(LifecycleModuleBuilder.java:84)
at org.apache.maven.lifecycle.internal.LifecycleModuleBuilder.buildProject(LifecycleModuleBuilder.java:59)
at org.apache.maven.lifecycle.internal.LifecycleStarter.singleThreadedBuild(LifecycleStarter.java:183)
at org.apache.maven.lifecycle.internal.LifecycleStarter.execute(LifecycleStarter.java:161)
at org.apache.maven.DefaultMaven.doExecute(DefaultMaven.java:320)
at org.apache.maven.DefaultMaven.execute(DefaultMaven.java:156)
at org.apache.maven.cli.MavenCli.execute(MavenCli.java:537)
at org.apache.maven.cli.MavenCli.doMain(MavenCli.java:196)
at org.apache.maven.cli.MavenCli.main(MavenCli.java:141)
at sun.reflect.NativeMethodAccessorImpl.invoke0(Native Method)
at sun.reflect.NativeMethodAccessorImpl.invoke(NativeMethodAccessorImpl.java:62)
at sun.reflect.DelegatingMethodAccessorImpl.invoke(DelegatingMethodAccessorImpl.java:43)
at java.lang.reflect.Method.invoke(Method.java:498)
at org.codehaus.plexus.classworlds.launcher.Launcher.launchEnhanced(Launcher.java:290)
at org.codehaus.plexus.classworlds.launcher.Launcher.launch(Launcher.java:230)
at org.codehaus.plexus.classworlds.launcher.Launcher.mainWithExitCode(Launcher.java:409)
at org.codehaus.plexus.classworlds.launcher.Launcher.main(Launcher.java:352)
Caused by: org.apache.maven.plugin.MojoFailureException: There are test failures.
Please refer to /x1/jenkins/jenkins-slave/workspace/cayenne-31/cayenneTestConnection/h2/jdk/latest1.8/label/Ubuntu/framework/cayenne-jdk1.5-unpublished/target/surefire-reports for the individual test results.
at org.apache.maven.plugin.surefire.SurefirePlugin.execute(SurefirePlugin.java:629)
at org.apache.maven.plugin.DefaultBuildPluginManager.executeMojo(DefaultBuildPluginManager.java:101)
at org.apache.maven.lifecycle.internal.MojoExecutor.execute(MojoExecutor.java:209)
... 19 more
[ERROR]
[ERROR] Re-run Maven using the -X switch to enable full debug logging.
[ERROR]
[ERROR] For more information about the errors and possible solutions, please read the following articles:
[ERROR] [Help 1] http://cwiki.apache.org/confluence/display/MAVEN/MojoFailureException
[ERROR]
[ERROR] After correcting the problems, you can resume the build with the command
[ERROR] mvn <goals> -rf :cayenne-jdk1.5-unpublished
Build step 'Invoke top-level Maven targets' marked build as failure
Jenkins build is back to normal : cayenne-31 » h2,latest1.8,Ubuntu #131
Posted by Apache Jenkins Server <je...@builds.apache.org>.
See <https://builds.apache.org/job/cayenne-31/cayenneTestConnection=h2,jdk=latest1.8,label=Ubuntu/131/changes>