You are viewing a plain text version of this content. The canonical link for it is here.
Posted to builds@solr.apache.org by Apache Jenkins Server <je...@builds.apache.org> on 2026/01/11 02:39:22 UTC
[JENKINS] Solr » Solr-Test-9.10 - Build # 469 - Still Failing!
Build: https://ci-builds.apache.org/job/Solr/job/Solr-Test-9.10/469/
All tests passed
Build Log:
[...truncated 448 lines...]
BUILD FAILED in 42m 33s
165 actionable tasks: 165 executed
Publishing build scan...
https://develocity.apache.org/s/jdwvovmjfayyc
Build step 'Invoke Gradle script' changed build result to FAILURE
Build step 'Invoke Gradle script' marked build as failure
Archiving artifacts
Recording test results
[Checks API] No suitable checks publisher found.
Email was triggered for: Failure - Any
Sending email for trigger: Failure - Any
[JENKINS] Solr » Solr-Test-9.10 - Build # 474 - Still Failing!
Posted by Apache Jenkins Server <je...@builds.apache.org>.
Build: https://ci-builds.apache.org/job/Solr/job/Solr-Test-9.10/474/
All tests passed
Build Log:
[...truncated 442 lines...]
BUILD FAILED in 42m 47s
165 actionable tasks: 165 executed
Publishing build scan...
https://develocity.apache.org/s/s4vv3e3ic3dr4
Build step 'Invoke Gradle script' changed build result to FAILURE
Build step 'Invoke Gradle script' marked build as failure
Archiving artifacts
Recording test results
[Checks API] No suitable checks publisher found.
Email was triggered for: Failure - Any
Sending email for trigger: Failure - Any
[JENKINS] Solr » Solr-Test-9.10 - Build # 473 - Still Failing!
Posted by Apache Jenkins Server <je...@builds.apache.org>.
Build: https://ci-builds.apache.org/job/Solr/job/Solr-Test-9.10/473/
All tests passed
Build Log:
[...truncated 444 lines...]
BUILD FAILED in 40m 5s
165 actionable tasks: 165 executed
Publishing build scan...
https://develocity.apache.org/s/ho33oe35f55zy
Build step 'Invoke Gradle script' changed build result to FAILURE
Build step 'Invoke Gradle script' marked build as failure
Archiving artifacts
Recording test results
[Checks API] No suitable checks publisher found.
Email was triggered for: Failure - Any
Sending email for trigger: Failure - Any
[JENKINS] Solr » Solr-Test-9.10 - Build # 472 - Still Failing!
Posted by Apache Jenkins Server <je...@builds.apache.org>.
Build: https://ci-builds.apache.org/job/Solr/job/Solr-Test-9.10/472/
All tests passed
Build Log:
[...truncated 446 lines...]
BUILD FAILED in 42m 3s
165 actionable tasks: 165 executed
Publishing build scan...
https://develocity.apache.org/s/tf2vkdt5caiui
Build step 'Invoke Gradle script' changed build result to FAILURE
Build step 'Invoke Gradle script' marked build as failure
Archiving artifacts
Recording test results
[Checks API] No suitable checks publisher found.
Email was triggered for: Failure - Any
Sending email for trigger: Failure - Any
[JENKINS] Solr » Solr-Test-9.10 - Build # 471 - Still Failing!
Posted by Apache Jenkins Server <je...@builds.apache.org>.
Build: https://ci-builds.apache.org/job/Solr/job/Solr-Test-9.10/471/
All tests passed
Build Log:
[...truncated 445 lines...]
BUILD FAILED in 40m 9s
165 actionable tasks: 165 executed
Publishing build scan...
https://develocity.apache.org/s/f3s23eh63fy5e
Build step 'Invoke Gradle script' changed build result to FAILURE
Build step 'Invoke Gradle script' marked build as failure
Archiving artifacts
Recording test results
[Checks API] No suitable checks publisher found.
Email was triggered for: Failure - Any
Sending email for trigger: Failure - Any
[JENKINS] Solr » Solr-Test-9.10 - Build # 470 - Still Failing!
Posted by Apache Jenkins Server <je...@builds.apache.org>.
Build: https://ci-builds.apache.org/job/Solr/job/Solr-Test-9.10/470/
All tests passed
Build Log:
[...truncated 444 lines...]
BUILD FAILED in 41m 29s
165 actionable tasks: 165 executed
Publishing build scan...
https://develocity.apache.org/s/g2ex5jletkxe4
Build step 'Invoke Gradle script' changed build result to FAILURE
Build step 'Invoke Gradle script' marked build as failure
Archiving artifacts
Recording test results
[Checks API] No suitable checks publisher found.
Email was triggered for: Failure - Any
Sending email for trigger: Failure - Any