You are viewing a plain text version of this content. The canonical link for it is here.
Posted to notifications@directory.apache.org by Apache Hudson Server <hu...@hudson.apache.org> on 2010/10/09 06:13:57 UTC

Build failed in Hudson: dir-studio-jdk15-ubuntu-deploy » Apache Directory Studio Apache DS Configuration #53

See <https://hudson.apache.org/hudson/job/dir-studio-jdk15-ubuntu-deploy/org.apache.directory.studio$apacheds.configuration/53/changes>

Changes:

[pamarcelot] Merged the 'shared-trunk-merge' branch back into trunk.
It includes all changes related to the use of the current Shared trunk into Studio (which was stuck at version 0.9.17 until now).

------------------------------------------
[INFO] ------------------------------------------------------------------------
[INFO] Building Apache Directory Studio Apache DS Configuration
[INFO]    task-segment: [clean, deploy]
[INFO] ------------------------------------------------------------------------
[INFO] [clean:clean {execution: default-clean}]
[INFO] Deleting <https://hudson.apache.org/hudson/job/dir-studio-jdk15-ubuntu-deploy/org.apache.directory.studio$apacheds.configuration/ws/target>
[INFO] [remote-resources:process {execution: default}]
[INFO] [resources:resources {execution: default-resources}]
[INFO] Using 'UTF-8' encoding to copy filtered resources.
[INFO] Copying 6 resources
[INFO] Copying 9 resources to resources
[INFO] Copying 9 resources
[INFO] Copying 48 resources
[INFO] Copying 3 resources
[INFO] [studio:prepare-jar-package {execution: default}]
[INFO] [compiler:compile {execution: default-compile}]
[INFO] Compiling 244 source files to <https://hudson.apache.org/hudson/job/dir-studio-jdk15-ubuntu-deploy/org.apache.directory.studio$apacheds.configuration/ws/target/classes>
[INFO] -------------------------------------------------------------
[ERROR] COMPILATION ERROR : 
[INFO] -------------------------------------------------------------
[ERROR] Failure executing javac, but could not parse the error:
An exception has occurred in the compiler (1.5.0_22). Please file a bug at the Java Developer Connection (http://java.sun.com/webapps/bugreport)  after checking the Bug Parade for duplicates. Include your program and the following diagnostic in your report.  Thank you.
com.sun.tools.javac.code.Symbol$CompletionFailure: file edu/umd/cs/findbugs/annotations/SuppressWarnings.class not found

[INFO] 1 error
[INFO] -------------------------------------------------------------
[HUDSON] Archiving <https://hudson.apache.org/hudson/job/dir-studio-jdk15-ubuntu-deploy/org.apache.directory.studio$apacheds.configuration/ws/pom.xml> to /home/hudson/hudson/jobs/dir-studio-jdk15-ubuntu-deploy/modules/org.apache.directory.studio$apacheds.configuration/builds/2010-10-09_04-04-23/archive/org.apache.directory.studio/apacheds.configuration/2.0.0-SNAPSHOT/pom.xml
[INFO] ------------------------------------------------------------------------
[ERROR] BUILD FAILURE
[INFO] ------------------------------------------------------------------------
[INFO] Compilation failure
Failure executing javac, but could not parse the error:
An exception has occurred in the compiler (1.5.0_22). Please file a bug at the Java Developer Connection (http://java.sun.com/webapps/bugreport)  after checking the Bug Parade for duplicates. Include your program and the following diagnostic in your report.  Thank you.
com.sun.tools.javac.code.Symbol$CompletionFailure: file edu/umd/cs/findbugs/annotations/SuppressWarnings.class not found


[INFO] ------------------------------------------------------------------------
[INFO] For more information, run Maven with the -e switch
[INFO] ------------------------------------------------------------------------
[INFO] Total time: 9 minutes 20 seconds
[INFO] Finished at: Sat Oct 09 04:13:56 UTC 2010
[INFO] Final Memory: 81M/153M
[INFO] ------------------------------------------------------------------------


Hudson build is back to normal : dir-studio-jdk15-ubuntu-deploy » Apache Directory Studio Apache DS Configuration #56

Posted by Apache Hudson Server <hu...@hudson.apache.org>.
See <https://hudson.apache.org/hudson/job/dir-studio-jdk15-ubuntu-deploy/org.apache.directory.studio$apacheds.configuration/56/>



Build failed in Hudson: dir-studio-jdk15-ubuntu-deploy » Apache Directory Studio Apache DS Configuration #55

Posted by Apache Hudson Server <hu...@hudson.apache.org>.
See <https://hudson.apache.org/hudson/job/dir-studio-jdk15-ubuntu-deploy/org.apache.directory.studio$apacheds.configuration/55/>

------------------------------------------
[INFO] ------------------------------------------------------------------------
[INFO] Building Apache Directory Studio Apache DS Configuration
[INFO]    task-segment: [clean, deploy]
[INFO] ------------------------------------------------------------------------
[INFO] [clean:clean {execution: default-clean}]
[INFO] Deleting <https://hudson.apache.org/hudson/job/dir-studio-jdk15-ubuntu-deploy/org.apache.directory.studio$apacheds.configuration/ws/target>
[INFO] [remote-resources:process {execution: default}]
[INFO] [resources:resources {execution: default-resources}]
[INFO] Using 'UTF-8' encoding to copy filtered resources.
[INFO] Copying 6 resources
[INFO] Copying 9 resources to resources
[INFO] Copying 9 resources
[INFO] Copying 48 resources
[INFO] Copying 3 resources
[INFO] [studio:prepare-jar-package {execution: default}]
[INFO] [compiler:compile {execution: default-compile}]
[INFO] Compiling 244 source files to <https://hudson.apache.org/hudson/job/dir-studio-jdk15-ubuntu-deploy/org.apache.directory.studio$apacheds.configuration/ws/target/classes>
[INFO] -------------------------------------------------------------
[ERROR] COMPILATION ERROR : 
[INFO] -------------------------------------------------------------
[ERROR] Failure executing javac, but could not parse the error:
An exception has occurred in the compiler (1.5.0_22). Please file a bug at the Java Developer Connection (http://java.sun.com/webapps/bugreport)  after checking the Bug Parade for duplicates. Include your program and the following diagnostic in your report.  Thank you.
com.sun.tools.javac.code.Symbol$CompletionFailure: file edu/umd/cs/findbugs/annotations/SuppressWarnings.class not found

[INFO] 1 error
[INFO] -------------------------------------------------------------
[HUDSON] Archiving <https://hudson.apache.org/hudson/job/dir-studio-jdk15-ubuntu-deploy/org.apache.directory.studio$apacheds.configuration/ws/pom.xml> to /home/hudson/hudson/jobs/dir-studio-jdk15-ubuntu-deploy/modules/org.apache.directory.studio$apacheds.configuration/builds/2010-10-10_04-02-08/archive/org.apache.directory.studio/apacheds.configuration/2.0.0-SNAPSHOT/pom.xml
[INFO] ------------------------------------------------------------------------
[ERROR] BUILD FAILURE
[INFO] ------------------------------------------------------------------------
[INFO] Compilation failure
Failure executing javac, but could not parse the error:
An exception has occurred in the compiler (1.5.0_22). Please file a bug at the Java Developer Connection (http://java.sun.com/webapps/bugreport)  after checking the Bug Parade for duplicates. Include your program and the following diagnostic in your report.  Thank you.
com.sun.tools.javac.code.Symbol$CompletionFailure: file edu/umd/cs/findbugs/annotations/SuppressWarnings.class not found


[INFO] ------------------------------------------------------------------------
[INFO] For more information, run Maven with the -e switch
[INFO] ------------------------------------------------------------------------
[INFO] Total time: 13 minutes 23 seconds
[INFO] Finished at: Sun Oct 10 04:15:42 UTC 2010
[INFO] Final Memory: 84M/154M
[INFO] ------------------------------------------------------------------------


Build failed in Hudson: dir-studio-jdk15-ubuntu-deploy » Apache Directory Studio Apache DS Configuration #54

Posted by Apache Hudson Server <hu...@hudson.apache.org>.
See <https://hudson.apache.org/hudson/job/dir-studio-jdk15-ubuntu-deploy/org.apache.directory.studio$apacheds.configuration/54/>

------------------------------------------
[INFO] ------------------------------------------------------------------------
[INFO] Building Apache Directory Studio Apache DS Configuration
[INFO]    task-segment: [clean, deploy]
[INFO] ------------------------------------------------------------------------
[INFO] [clean:clean {execution: default-clean}]
[INFO] Deleting <https://hudson.apache.org/hudson/job/dir-studio-jdk15-ubuntu-deploy/org.apache.directory.studio$apacheds.configuration/ws/target>
[INFO] [remote-resources:process {execution: default}]
[INFO] [resources:resources {execution: default-resources}]
[INFO] Using 'UTF-8' encoding to copy filtered resources.
[INFO] Copying 6 resources
[INFO] Copying 9 resources to resources
[INFO] Copying 9 resources
[INFO] Copying 48 resources
[INFO] Copying 3 resources
[INFO] [studio:prepare-jar-package {execution: default}]
[INFO] [compiler:compile {execution: default-compile}]
[INFO] Compiling 244 source files to <https://hudson.apache.org/hudson/job/dir-studio-jdk15-ubuntu-deploy/org.apache.directory.studio$apacheds.configuration/ws/target/classes>
[INFO] -------------------------------------------------------------
[ERROR] COMPILATION ERROR : 
[INFO] -------------------------------------------------------------
[ERROR] Failure executing javac, but could not parse the error:
An exception has occurred in the compiler (1.5.0_22). Please file a bug at the Java Developer Connection (http://java.sun.com/webapps/bugreport)  after checking the Bug Parade for duplicates. Include your program and the following diagnostic in your report.  Thank you.
com.sun.tools.javac.code.Symbol$CompletionFailure: file edu/umd/cs/findbugs/annotations/SuppressWarnings.class not found

[INFO] 1 error
[INFO] -------------------------------------------------------------
[HUDSON] Archiving <https://hudson.apache.org/hudson/job/dir-studio-jdk15-ubuntu-deploy/org.apache.directory.studio$apacheds.configuration/ws/pom.xml> to /home/hudson/hudson/jobs/dir-studio-jdk15-ubuntu-deploy/modules/org.apache.directory.studio$apacheds.configuration/builds/2010-10-09_18-27-05/archive/org.apache.directory.studio/apacheds.configuration/2.0.0-SNAPSHOT/pom.xml
[INFO] ------------------------------------------------------------------------
[ERROR] BUILD FAILURE
[INFO] ------------------------------------------------------------------------
[INFO] Compilation failure
Failure executing javac, but could not parse the error:
An exception has occurred in the compiler (1.5.0_22). Please file a bug at the Java Developer Connection (http://java.sun.com/webapps/bugreport)  after checking the Bug Parade for duplicates. Include your program and the following diagnostic in your report.  Thank you.
com.sun.tools.javac.code.Symbol$CompletionFailure: file edu/umd/cs/findbugs/annotations/SuppressWarnings.class not found


[INFO] ------------------------------------------------------------------------
[INFO] For more information, run Maven with the -e switch
[INFO] ------------------------------------------------------------------------
[INFO] Total time: 6 minutes 47 seconds
[INFO] Finished at: Sat Oct 09 18:34:02 UTC 2010
[INFO] Final Memory: 81M/149M
[INFO] ------------------------------------------------------------------------