You are viewing a plain text version of this content. The canonical link for it is here.
Posted to yarn-dev@hadoop.apache.org by Apache Jenkins Server <je...@builds.apache.org> on 2015/04/02 01:12:28 UTC
Failed: YARN-1572 PreCommit Build #7195
Jira: https://issues.apache.org/jira/browse/YARN-1572
Build: https://builds.apache.org/job/PreCommit-YARN-Build/7195/
###################################################################################
########################## LAST 60 LINES OF THE CONSOLE ###########################
[...truncated 38 lines...]
YARN-1572 patch is being downloaded at Wed Apr 1 23:12:23 UTC 2015 from
http://issues.apache.org/jira/secure/attachment/12708801/0001-Fix-for-YARN-1572.patch
cp: cannot stat '/home/jenkins/buildSupport/lib/*': No such file or directory
Checking patch hadoop-yarn-project/hadoop-yarn/hadoop-yarn-server/hadoop-yarn-server-resourcemanager/src/main/java/org/apache/hadoop/yarn/server/resourcemanager/scheduler/AppSchedulingInfo.java...
error: while searching for:
ResourceRequest rackLocalRequest = requests.get(priority).get(
node.getRackName());
rackLocalRequest.setNumContainers(rackLocalRequest.getNumContainers() - 1);
if (rackLocalRequest.getNumContainers() == 0) {
this.requests.get(priority).remove(node.getRackName());
}
decrementOutstanding(requests.get(priority).get(ResourceRequest.ANY));
}
error: patch failed: hadoop-yarn-project/hadoop-yarn/hadoop-yarn-server/hadoop-yarn-server-resourcemanager/src/main/java/org/apache/hadoop/yarn/server/resourcemanager/scheduler/AppSchedulingInfo.java:288
error: hadoop-yarn-project/hadoop-yarn/hadoop-yarn-server/hadoop-yarn-server-resourcemanager/src/main/java/org/apache/hadoop/yarn/server/resourcemanager/scheduler/AppSchedulingInfo.java: patch does not apply
PATCH APPLICATION FAILED
{color:red}-1 overall{color}. Here are the results of testing the latest attachment
http://issues.apache.org/jira/secure/attachment/12708801/0001-Fix-for-YARN-1572.patch
against trunk revision 3c7adaa.
{color:red}-1 patch{color}. The patch command could not apply the patch.
Console output: https://builds.apache.org/job/PreCommit-YARN-Build/7195//console
This message is automatically generated.
======================================================================
======================================================================
Adding comment to Jira.
======================================================================
======================================================================
Comment added.
8c88889bb133c0ada95a37a03062d8849fea25a6 logged out
======================================================================
======================================================================
Finished build.
======================================================================
======================================================================
Build step 'Execute shell' marked build as failure
Archiving artifacts
[description-setter] Could not determine description.
Recording test results
Email was triggered for: Failure
Sending email for trigger: Failure
###################################################################################
############################## FAILED TESTS (if any) ##############################
No tests ran.
Failed: YARN-3388 PreCommit Build #7201
Posted by Apache Jenkins Server <je...@builds.apache.org>.
Jira: https://issues.apache.org/jira/browse/YARN-3388
Build: https://builds.apache.org/job/PreCommit-YARN-Build/7201/
###################################################################################
########################## LAST 60 LINES OF THE CONSOLE ###########################
[...truncated 4050 lines...]
{color:green}+1 release audit{color}. The applied patch does not increase the total number of release audit warnings.
{color:red}-1 core tests{color}. The patch failed these unit tests in hadoop-yarn-project/hadoop-yarn/hadoop-yarn-server/hadoop-yarn-server-resourcemanager:
org.apache.hadoop.yarn.server.resourcemanager.webapp.TestRMWebServicesAppsModification
org.apache.hadoop.yarn.server.resourcemanager.scheduler.fair.TestFairScheduler
org.apache.hadoop.yarn.server.resourcemanager.webapp.TestRMWebServicesApps
org.apache.hadoop.yarn.server.resourcemanager.TestRM
The following test timeouts occurred in hadoop-yarn-project/hadoop-yarn/hadoop-yarn-server/hadoop-yarn-server-resourcemanager:
org.apache.hadoop.yarn.server.resourcemanager.scheduler.capacity.TestContainerAllocation
Test results: https://builds.apache.org/job/PreCommit-YARN-Build/7201//testReport/
Console output: https://builds.apache.org/job/PreCommit-YARN-Build/7201//console
This message is automatically generated.
======================================================================
======================================================================
Adding comment to Jira.
======================================================================
======================================================================
Comment added.
85ee94735d9b8379aa1e6909980139dea99c2d8e logged out
======================================================================
======================================================================
Finished build.
======================================================================
======================================================================
Build step 'Execute shell' marked build as failure
Archiving artifacts
Sending artifact delta relative to PreCommit-YARN-Build #7189
ERROR: Failed to archive {patchprocess/patchJavacWarnings.txt=patchprocess/patchJavacWarnings.txt, patchprocess/trunkJavacWarnings.txt=patchprocess/trunkJavacWarnings.txt, patchprocess/patchFindbugsWarningshadoop-yarn-server-nodemanager.xml=patchprocess/patchFindbugsWarningshadoop-yarn-server-nodemanager.xml, patchprocess/patchJavadocWarnings.txt=patchprocess/patchJavadocWarnings.txt, patchprocess/newPatchFindbugsWarningshadoop-yarn-server-resourcemanager.html=patchprocess/newPatchFindbugsWarningshadoop-yarn-server-resourcemanager.html, patchprocess/newPatchFindbugsWarningshadoop-yarn-server-resourcemanager.xml=patchprocess/newPatchFindbugsWarningshadoop-yarn-server-resourcemanager.xml, patchprocess/testrun_hadoop-yarn-server-resourcemanager.txt=patchprocess/testrun_hadoop-yarn-server-resourcemanager.txt, patchprocess/trunkJavadocWarnings.txt=patchprocess/trunkJavadocWarnings.txt, patchprocess/newPatchFindbugsWarningshadoop-yarn-server-nodemanager.html=patchprocess/newPatchFindbugsWarningshadoop-yarn-server-nodemanager.html, patchprocess/patchReleaseAuditOutput.txt=patchprocess/patchReleaseAuditOutput.txt, patchprocess/patchReleaseAuditWarnings.txt=patchprocess/patchReleaseAuditWarnings.txt, patchprocess/patchFindBugsOutputhadoop-yarn-server-nodemanager.txt=patchprocess/patchFindBugsOutputhadoop-yarn-server-nodemanager.txt, patchprocess/filteredPatchJavacWarnings.txt=patchprocess/filteredPatchJavacWarnings.txt, patchprocess/patchFindbugsWarningshadoop-yarn-server-resourcemanager.xml=patchprocess/patchFindbugsWarningshadoop-yarn-server-resourcemanager.xml, patchprocess/patchEclipseOutput.txt=patchprocess/patchEclipseOutput.txt, patchprocess/diffJavadocWarnings.txt=patchprocess/diffJavadocWarnings.txt, patchprocess/testrun_hadoop-yarn-server-nodemanager.txt=patchprocess/testrun_hadoop-yarn-server-nodemanager.txt, patchprocess/newPatchFindbugsWarningshadoop-yarn-server-nodemanager.xml=patchprocess/newPatchFindbugsWarningshadoop-yarn-server-nodemanager.xml, patchprocess/filteredTrunkJavacWarnings.txt=patchprocess/filteredTrunkJavacWarnings.txt, patchprocess/patchFindBugsOutputhadoop-yarn-server-resourcemanager.txt=patchprocess/patchFindBugsOutputhadoop-yarn-server-resourcemanager.txt} due to internal error; falling back to full archiving
java.lang.IllegalStateException: checksum mismatch after transfer (6081393815818629749 vs. 3031855320); /x1/jenkins/jenkins-home/jobs/PreCommit-YARN-Build/builds/2015-04-02_20-10-23/archive/patchprocess/testrun_hadoop-yarn-server-nodemanager.txt may be corrupted
at jsync.protocol.FileSequenceReader.read(FileSequenceReader.java:45)
at com.cloudbees.jenkins.plugins.jsync.archiver.JSyncArtifactManager.remoteSync(JSyncArtifactManager.java:145)
at com.cloudbees.jenkins.plugins.jsync.archiver.JSyncArtifactManager.archive(JSyncArtifactManager.java:68)
at hudson.tasks.ArtifactArchiver.perform(ArtifactArchiver.java:140)
at hudson.tasks.BuildStepMonitor$1.perform(BuildStepMonitor.java:20)
at hudson.model.AbstractBuild$AbstractBuildExecution.perform(AbstractBuild.java:756)
at hudson.model.AbstractBuild$AbstractBuildExecution.performAllBuildSteps(AbstractBuild.java:720)
at hudson.model.Build$BuildExecution.post2(Build.java:182)
at hudson.model.AbstractBuild$AbstractBuildExecution.post(AbstractBuild.java:669)
at hudson.model.Run.execute(Run.java:1731)
at hudson.model.FreeStyleBuild.run(FreeStyleBuild.java:43)
at hudson.model.ResourceController.execute(ResourceController.java:88)
at hudson.model.Executor.run(Executor.java:232)
Description set: MAPREDUCE-6303
Recording test results
Email was triggered for: Failure
Sending email for trigger: Failure
###################################################################################
############################## FAILED TESTS (if any) ##############################
23 tests failed.
REGRESSION: org.apache.hadoop.yarn.server.resourcemanager.TestRM.testAppOnMultiNode[0]
Error Message:
test timed out after 30000 milliseconds
Stack Trace:
java.lang.Exception: test timed out after 30000 milliseconds
at java.net.Inet4AddressImpl.lookupAllHostAddr(Native Method)
at java.net.InetAddress$1.lookupAllHostAddr(InetAddress.java:901)
at java.net.InetAddress.getAddressesFromNameService(InetAddress.java:1293)
at java.net.InetAddress.getAllByName0(InetAddress.java:1246)
at java.net.InetAddress.getAllByName(InetAddress.java:1162)
at java.net.InetAddress.getAllByName(InetAddress.java:1098)
at java.net.InetAddress.getByName(InetAddress.java:1048)
at org.apache.hadoop.net.NetUtils.normalizeHostName(NetUtils.java:563)
at org.apache.hadoop.yarn.server.resourcemanager.NodesListManager.isValidNode(NodesListManager.java:147)
at org.apache.hadoop.yarn.server.resourcemanager.ResourceTrackerService.nodeHeartbeat(ResourceTrackerService.java:402)
at org.apache.hadoop.yarn.server.resourcemanager.MockNM.nodeHeartbeat(MockNM.java:178)
at org.apache.hadoop.yarn.server.resourcemanager.MockNM.nodeHeartbeat(MockNM.java:136)
at org.apache.hadoop.yarn.server.resourcemanager.TestRM.testAppOnMultiNode(TestRM.java:187)
REGRESSION: org.apache.hadoop.yarn.server.resourcemanager.scheduler.fair.TestFairScheduler.testContinuousScheduling
Error Message:
expected:<2> but was:<1>
Stack Trace:
java.lang.AssertionError: expected:<2> but was:<1>
at org.junit.Assert.fail(Assert.java:88)
at org.junit.Assert.failNotEquals(Assert.java:743)
at org.junit.Assert.assertEquals(Assert.java:118)
at org.junit.Assert.assertEquals(Assert.java:555)
at org.junit.Assert.assertEquals(Assert.java:542)
at org.apache.hadoop.yarn.server.resourcemanager.scheduler.fair.TestFairScheduler.testContinuousScheduling(TestFairScheduler.java:3910)
REGRESSION: org.apache.hadoop.yarn.server.resourcemanager.webapp.TestRMWebServicesApps.testInvalidAppAttempts
Error Message:
expected:<Bad Request> but was:<Internal Server Error>
Stack Trace:
java.lang.AssertionError: expected:<Bad Request> but was:<Internal Server Error>
at org.junit.Assert.fail(Assert.java:88)
at org.junit.Assert.failNotEquals(Assert.java:743)
at org.junit.Assert.assertEquals(Assert.java:118)
at org.junit.Assert.assertEquals(Assert.java:144)
at org.apache.hadoop.yarn.server.resourcemanager.webapp.TestRMWebServicesApps.testInvalidAppAttempts(TestRMWebServicesApps.java:1470)
REGRESSION: org.apache.hadoop.yarn.server.resourcemanager.webapp.TestRMWebServicesApps.testAppsQueryFinishBegin
Error Message:
org/apache/hadoop/yarn/proto/YarnSecurityTokenProtos$AMRMTokenIdentifierProto
Stack Trace:
java.lang.NoClassDefFoundError: org/apache/hadoop/yarn/proto/YarnSecurityTokenProtos$AMRMTokenIdentifierProto
at java.net.URLClassLoader$1.run(URLClassLoader.java:366)
at java.net.URLClassLoader$1.run(URLClassLoader.java:355)
at java.security.AccessController.doPrivileged(Native Method)
at java.net.URLClassLoader.findClass(URLClassLoader.java:354)
at java.lang.ClassLoader.loadClass(ClassLoader.java:425)
at sun.misc.Launcher$AppClassLoader.loadClass(Launcher.java:308)
at java.lang.ClassLoader.loadClass(ClassLoader.java:358)
at org.apache.hadoop.yarn.security.AMRMTokenIdentifier.<init>(AMRMTokenIdentifier.java:56)
at org.apache.hadoop.yarn.server.resourcemanager.security.AMRMTokenSecretManager.createAndGetAMRMToken(AMRMTokenSecretManager.java:196)
at org.apache.hadoop.yarn.server.resourcemanager.MockRM.sendAMLaunched(MockRM.java:497)
at org.apache.hadoop.yarn.server.resourcemanager.webapp.TestRMWebServicesApps.testAppsQueryFinishBegin(TestRMWebServicesApps.java:702)
REGRESSION: org.apache.hadoop.yarn.server.resourcemanager.webapp.TestRMWebServicesApps.testAppsQueryStates
Error Message:
org/apache/hadoop/yarn/api/protocolrecords/KillApplicationRequest
Stack Trace:
java.lang.NoClassDefFoundError: org/apache/hadoop/yarn/api/protocolrecords/KillApplicationRequest
at java.net.URLClassLoader$1.run(URLClassLoader.java:366)
at java.net.URLClassLoader$1.run(URLClassLoader.java:355)
at java.security.AccessController.doPrivileged(Native Method)
at java.net.URLClassLoader.findClass(URLClassLoader.java:354)
at java.lang.ClassLoader.loadClass(ClassLoader.java:425)
at sun.misc.Launcher$AppClassLoader.loadClass(Launcher.java:308)
at java.lang.ClassLoader.loadClass(ClassLoader.java:358)
at org.apache.hadoop.yarn.server.resourcemanager.MockRM.killApp(MockRM.java:487)
at org.apache.hadoop.yarn.server.resourcemanager.webapp.TestRMWebServicesApps.testAppsQueryStates(TestRMWebServicesApps.java:246)
REGRESSION: org.apache.hadoop.yarn.server.resourcemanager.webapp.TestRMWebServicesApps.testAppStatistics
Error Message:
org/apache/hadoop/yarn/proto/YarnSecurityTokenProtos$AMRMTokenIdentifierProto
Stack Trace:
java.lang.NoClassDefFoundError: org/apache/hadoop/yarn/proto/YarnSecurityTokenProtos$AMRMTokenIdentifierProto
at org.apache.hadoop.yarn.security.AMRMTokenIdentifier.<init>(AMRMTokenIdentifier.java:56)
at org.apache.hadoop.yarn.server.resourcemanager.security.AMRMTokenSecretManager.createAndGetAMRMToken(AMRMTokenSecretManager.java:196)
at org.apache.hadoop.yarn.server.resourcemanager.MockRM.sendAMLaunched(MockRM.java:497)
at org.apache.hadoop.yarn.server.resourcemanager.webapp.TestRMWebServicesApps.testAppStatistics(TestRMWebServicesApps.java:987)
REGRESSION: org.apache.hadoop.yarn.server.resourcemanager.webapp.TestRMWebServicesApps.testAppsQueryStatesComma
Error Message:
org/apache/hadoop/yarn/api/protocolrecords/KillApplicationRequest
Stack Trace:
java.lang.NoClassDefFoundError: org/apache/hadoop/yarn/api/protocolrecords/KillApplicationRequest
at org.apache.hadoop.yarn.server.resourcemanager.MockRM.killApp(MockRM.java:487)
at org.apache.hadoop.yarn.server.resourcemanager.webapp.TestRMWebServicesApps.testAppsQueryStatesComma(TestRMWebServicesApps.java:295)
REGRESSION: org.apache.hadoop.yarn.server.resourcemanager.webapp.TestRMWebServicesApps.testAppsQueryStatesInvalid
Error Message:
expected:<Bad Request> but was:<Internal Server Error>
Stack Trace:
java.lang.AssertionError: expected:<Bad Request> but was:<Internal Server Error>
at org.junit.Assert.fail(Assert.java:88)
at org.junit.Assert.failNotEquals(Assert.java:743)
at org.junit.Assert.assertEquals(Assert.java:118)
at org.junit.Assert.assertEquals(Assert.java:144)
at org.apache.hadoop.yarn.server.resourcemanager.webapp.TestRMWebServicesApps.testAppsQueryStatesInvalid(TestRMWebServicesApps.java:391)
REGRESSION: org.apache.hadoop.yarn.server.resourcemanager.webapp.TestRMWebServicesApps.testMultipleAppAttempts
Error Message:
org/apache/hadoop/yarn/proto/YarnSecurityTokenProtos$AMRMTokenIdentifierProto
Stack Trace:
java.lang.NoClassDefFoundError: org/apache/hadoop/yarn/proto/YarnSecurityTokenProtos$AMRMTokenIdentifierProto
at org.apache.hadoop.yarn.security.AMRMTokenIdentifier.<init>(AMRMTokenIdentifier.java:56)
at org.apache.hadoop.yarn.server.resourcemanager.security.AMRMTokenSecretManager.createAndGetAMRMToken(AMRMTokenSecretManager.java:196)
at org.apache.hadoop.yarn.server.resourcemanager.MockRM.sendAMLaunched(MockRM.java:497)
at org.apache.hadoop.yarn.server.resourcemanager.MockRM.launchAM(MockRM.java:660)
at org.apache.hadoop.yarn.server.resourcemanager.MockRM.launchAndRegisterAM(MockRM.java:667)
at org.apache.hadoop.yarn.server.resourcemanager.webapp.TestRMWebServicesApps.testMultipleAppAttempts(TestRMWebServicesApps.java:1407)
REGRESSION: org.apache.hadoop.yarn.server.resourcemanager.webapp.TestRMWebServicesApps.testAppsQueryFinishEnd
Error Message:
org/apache/hadoop/yarn/proto/YarnSecurityTokenProtos$AMRMTokenIdentifierProto
Stack Trace:
java.lang.NoClassDefFoundError: org/apache/hadoop/yarn/proto/YarnSecurityTokenProtos$AMRMTokenIdentifierProto
at org.apache.hadoop.yarn.security.AMRMTokenIdentifier.<init>(AMRMTokenIdentifier.java:56)
at org.apache.hadoop.yarn.server.resourcemanager.security.AMRMTokenSecretManager.createAndGetAMRMToken(AMRMTokenSecretManager.java:196)
at org.apache.hadoop.yarn.server.resourcemanager.MockRM.sendAMLaunched(MockRM.java:497)
at org.apache.hadoop.yarn.server.resourcemanager.webapp.TestRMWebServicesApps.testAppsQueryFinishEnd(TestRMWebServicesApps.java:732)
REGRESSION: org.apache.hadoop.yarn.server.resourcemanager.webapp.TestRMWebServicesApps.testAppsQueryStateInvalid
Error Message:
expected:<Bad Request> but was:<Internal Server Error>
Stack Trace:
java.lang.AssertionError: expected:<Bad Request> but was:<Internal Server Error>
at org.junit.Assert.fail(Assert.java:88)
at org.junit.Assert.failNotEquals(Assert.java:743)
at org.junit.Assert.assertEquals(Assert.java:118)
at org.junit.Assert.assertEquals(Assert.java:144)
at org.apache.hadoop.yarn.server.resourcemanager.webapp.TestRMWebServicesApps.testAppsQueryStateInvalid(TestRMWebServicesApps.java:428)
REGRESSION: org.apache.hadoop.yarn.server.resourcemanager.webapp.TestRMWebServicesApps.testAppsQueryAppTypes
Error Message:
org/apache/hadoop/yarn/proto/YarnSecurityTokenProtos$AMRMTokenIdentifierProto
Stack Trace:
java.lang.NoClassDefFoundError: org/apache/hadoop/yarn/proto/YarnSecurityTokenProtos$AMRMTokenIdentifierProto
at org.apache.hadoop.yarn.security.AMRMTokenIdentifier.<init>(AMRMTokenIdentifier.java:56)
at org.apache.hadoop.yarn.server.resourcemanager.security.AMRMTokenSecretManager.createAndGetAMRMToken(AMRMTokenSecretManager.java:196)
at org.apache.hadoop.yarn.server.resourcemanager.MockRM.sendAMLaunched(MockRM.java:497)
at org.apache.hadoop.yarn.server.resourcemanager.webapp.TestRMWebServicesApps.testAppsQueryAppTypes(TestRMWebServicesApps.java:800)
REGRESSION: org.apache.hadoop.yarn.server.resourcemanager.webapp.TestRMWebServicesApps.testAppsQueryFinalStatusInvalid
Error Message:
expected:<Bad Request> but was:<Internal Server Error>
Stack Trace:
java.lang.AssertionError: expected:<Bad Request> but was:<Internal Server Error>
at org.junit.Assert.fail(Assert.java:88)
at org.junit.Assert.failNotEquals(Assert.java:743)
at org.junit.Assert.assertEquals(Assert.java:118)
at org.junit.Assert.assertEquals(Assert.java:144)
at org.apache.hadoop.yarn.server.resourcemanager.webapp.TestRMWebServicesApps.testAppsQueryFinalStatusInvalid(TestRMWebServicesApps.java:506)
REGRESSION: org.apache.hadoop.yarn.server.resourcemanager.webapp.TestRMWebServicesApps.testInvalidApp
Error Message:
expected:<Bad Request> but was:<Internal Server Error>
Stack Trace:
java.lang.AssertionError: expected:<Bad Request> but was:<Internal Server Error>
at org.junit.Assert.fail(Assert.java:88)
at org.junit.Assert.failNotEquals(Assert.java:743)
at org.junit.Assert.assertEquals(Assert.java:118)
at org.junit.Assert.assertEquals(Assert.java:144)
at org.apache.hadoop.yarn.server.resourcemanager.webapp.TestRMWebServicesApps.testInvalidApp(TestRMWebServicesApps.java:1188)
REGRESSION: org.apache.hadoop.yarn.server.resourcemanager.webapp.TestRMWebServicesApps.testAppsQueryFinishBeginEnd
Error Message:
org/apache/hadoop/yarn/proto/YarnSecurityTokenProtos$AMRMTokenIdentifierProto
Stack Trace:
java.lang.NoClassDefFoundError: org/apache/hadoop/yarn/proto/YarnSecurityTokenProtos$AMRMTokenIdentifierProto
at org.apache.hadoop.yarn.security.AMRMTokenIdentifier.<init>(AMRMTokenIdentifier.java:56)
at org.apache.hadoop.yarn.server.resourcemanager.security.AMRMTokenSecretManager.createAndGetAMRMToken(AMRMTokenSecretManager.java:196)
at org.apache.hadoop.yarn.server.resourcemanager.MockRM.sendAMLaunched(MockRM.java:497)
at org.apache.hadoop.yarn.server.resourcemanager.webapp.TestRMWebServicesApps.testAppsQueryFinishBeginEnd(TestRMWebServicesApps.java:766)
REGRESSION: org.apache.hadoop.yarn.server.resourcemanager.webapp.TestRMWebServicesAppsModification.testSingleAppKill[3]
Error Message:
Guice creation errors:
1) An exception was caught and reported. Message: java.util.zip.ZipException: invalid code lengths set
at com.google.inject.internal.InjectorShell$Builder.build(InjectorShell.java:133)
1 error
Stack Trace:
com.google.inject.CreationException: Guice creation errors:
1) An exception was caught and reported. Message: java.util.zip.ZipException: invalid code lengths set
at com.google.inject.internal.InjectorShell$Builder.build(InjectorShell.java:133)
1 error
at java.util.zip.InflaterInputStream.read(InflaterInputStream.java:164)
at java.util.zip.InflaterInputStream.read(InflaterInputStream.java:122)
at java.io.FilterInputStream.read(FilterInputStream.java:83)
at org.apache.xerces.impl.XMLEntityManager$RewindableInputStream.read(Unknown Source)
at org.apache.xerces.impl.XMLEntityManager.setupCurrentEntity(Unknown Source)
at org.apache.xerces.impl.XMLVersionDetector.determineDocVersion(Unknown Source)
at org.apache.xerces.parsers.XML11Configuration.parse(Unknown Source)
at org.apache.xerces.parsers.XML11Configuration.parse(Unknown Source)
at org.apache.xerces.parsers.XMLParser.parse(Unknown Source)
at org.apache.xerces.parsers.DOMParser.parse(Unknown Source)
at org.apache.xerces.jaxp.DocumentBuilderImpl.parse(Unknown Source)
at javax.xml.parsers.DocumentBuilder.parse(DocumentBuilder.java:150)
at org.apache.hadoop.conf.Configuration.parse(Configuration.java:2501)
at org.apache.hadoop.conf.Configuration.parse(Configuration.java:2489)
at org.apache.hadoop.conf.Configuration.loadResource(Configuration.java:2560)
at org.apache.hadoop.conf.Configuration.loadResources(Configuration.java:2513)
at org.apache.hadoop.conf.Configuration.getProps(Configuration.java:2424)
at org.apache.hadoop.conf.Configuration.set(Configuration.java:1160)
at org.apache.hadoop.conf.Configuration.set(Configuration.java:1132)
at org.apache.hadoop.conf.Configuration.setBoolean(Configuration.java:1468)
at org.apache.hadoop.yarn.server.resourcemanager.webapp.TestRMWebServicesAppsModification$4.configureServlets(TestRMWebServicesAppsModification.java:256)
at com.google.inject.servlet.ServletModule.configure(ServletModule.java:53)
at com.google.inject.AbstractModule.configure(AbstractModule.java:59)
at com.google.inject.spi.Elements$RecordingBinder.install(Elements.java:223)
at com.google.inject.spi.Elements.getElements(Elements.java:101)
at com.google.inject.internal.InjectorShell$Builder.build(InjectorShell.java:133)
at com.google.inject.internal.InternalInjectorCreator.build(InternalInjectorCreator.java:103)
at com.google.inject.Guice.createInjector(Guice.java:95)
at com.google.inject.Guice.createInjector(Guice.java:72)
at com.google.inject.Guice.createInjector(Guice.java:62)
at org.apache.hadoop.yarn.server.resourcemanager.webapp.TestRMWebServicesAppsModification.getSimpleAuthInjectorFair(TestRMWebServicesAppsModification.java:252)
at org.apache.hadoop.yarn.server.resourcemanager.webapp.TestRMWebServicesAppsModification.<init>(TestRMWebServicesAppsModification.java:299)
REGRESSION: org.apache.hadoop.yarn.server.resourcemanager.webapp.TestRMWebServicesAppsModification.testSingleAppKillInvalidState[3]
Error Message:
java.net.BindException: Address already in use
Stack Trace:
com.sun.jersey.test.framework.spi.container.TestContainerException: java.net.BindException: Address already in use
at sun.nio.ch.Net.bind0(Native Method)
at sun.nio.ch.Net.bind(Net.java:444)
at sun.nio.ch.Net.bind(Net.java:436)
at sun.nio.ch.ServerSocketChannelImpl.bind(ServerSocketChannelImpl.java:214)
at sun.nio.ch.ServerSocketAdaptor.bind(ServerSocketAdaptor.java:74)
at org.glassfish.grizzly.nio.transport.TCPNIOTransport.bind(TCPNIOTransport.java:413)
at org.glassfish.grizzly.nio.transport.TCPNIOTransport.bind(TCPNIOTransport.java:384)
at org.glassfish.grizzly.nio.transport.TCPNIOTransport.bind(TCPNIOTransport.java:375)
at org.glassfish.grizzly.http.server.NetworkListener.start(NetworkListener.java:549)
at org.glassfish.grizzly.http.server.HttpServer.start(HttpServer.java:255)
at com.sun.jersey.api.container.grizzly2.GrizzlyServerFactory.createHttpServer(GrizzlyServerFactory.java:326)
at com.sun.jersey.api.container.grizzly2.GrizzlyServerFactory.createHttpServer(GrizzlyServerFactory.java:343)
at com.sun.jersey.test.framework.spi.container.grizzly2.web.GrizzlyWebTestContainerFactory$GrizzlyWebTestContainer.instantiateGrizzlyWebServer(GrizzlyWebTestContainerFactory.java:219)
at com.sun.jersey.test.framework.spi.container.grizzly2.web.GrizzlyWebTestContainerFactory$GrizzlyWebTestContainer.<init>(GrizzlyWebTestContainerFactory.java:129)
at com.sun.jersey.test.framework.spi.container.grizzly2.web.GrizzlyWebTestContainerFactory$GrizzlyWebTestContainer.<init>(GrizzlyWebTestContainerFactory.java:86)
at com.sun.jersey.test.framework.spi.container.grizzly2.web.GrizzlyWebTestContainerFactory.create(GrizzlyWebTestContainerFactory.java:79)
at com.sun.jersey.test.framework.JerseyTest.getContainer(JerseyTest.java:342)
at com.sun.jersey.test.framework.JerseyTest.<init>(JerseyTest.java:217)
at org.apache.hadoop.yarn.webapp.JerseyTestBase.<init>(JerseyTestBase.java:27)
at org.apache.hadoop.yarn.server.resourcemanager.webapp.TestRMWebServicesAppsModification.<init>(TestRMWebServicesAppsModification.java:277)
REGRESSION: org.apache.hadoop.yarn.server.resourcemanager.webapp.TestRMWebServicesAppsModification.testSingleAppKillUnauthorized[3]
Error Message:
java.net.BindException: Address already in use
Stack Trace:
com.sun.jersey.test.framework.spi.container.TestContainerException: java.net.BindException: Address already in use
at sun.nio.ch.Net.bind0(Native Method)
at sun.nio.ch.Net.bind(Net.java:444)
at sun.nio.ch.Net.bind(Net.java:436)
at sun.nio.ch.ServerSocketChannelImpl.bind(ServerSocketChannelImpl.java:214)
at sun.nio.ch.ServerSocketAdaptor.bind(ServerSocketAdaptor.java:74)
at org.glassfish.grizzly.nio.transport.TCPNIOTransport.bind(TCPNIOTransport.java:413)
at org.glassfish.grizzly.nio.transport.TCPNIOTransport.bind(TCPNIOTransport.java:384)
at org.glassfish.grizzly.nio.transport.TCPNIOTransport.bind(TCPNIOTransport.java:375)
at org.glassfish.grizzly.http.server.NetworkListener.start(NetworkListener.java:549)
at org.glassfish.grizzly.http.server.HttpServer.start(HttpServer.java:255)
at com.sun.jersey.api.container.grizzly2.GrizzlyServerFactory.createHttpServer(GrizzlyServerFactory.java:326)
at com.sun.jersey.api.container.grizzly2.GrizzlyServerFactory.createHttpServer(GrizzlyServerFactory.java:343)
at com.sun.jersey.test.framework.spi.container.grizzly2.web.GrizzlyWebTestContainerFactory$GrizzlyWebTestContainer.instantiateGrizzlyWebServer(GrizzlyWebTestContainerFactory.java:219)
at com.sun.jersey.test.framework.spi.container.grizzly2.web.GrizzlyWebTestContainerFactory$GrizzlyWebTestContainer.<init>(GrizzlyWebTestContainerFactory.java:129)
at com.sun.jersey.test.framework.spi.container.grizzly2.web.GrizzlyWebTestContainerFactory$GrizzlyWebTestContainer.<init>(GrizzlyWebTestContainerFactory.java:86)
at com.sun.jersey.test.framework.spi.container.grizzly2.web.GrizzlyWebTestContainerFactory.create(GrizzlyWebTestContainerFactory.java:79)
at com.sun.jersey.test.framework.JerseyTest.getContainer(JerseyTest.java:342)
at com.sun.jersey.test.framework.JerseyTest.<init>(JerseyTest.java:217)
at org.apache.hadoop.yarn.webapp.JerseyTestBase.<init>(JerseyTestBase.java:27)
at org.apache.hadoop.yarn.server.resourcemanager.webapp.TestRMWebServicesAppsModification.<init>(TestRMWebServicesAppsModification.java:277)
REGRESSION: org.apache.hadoop.yarn.server.resourcemanager.webapp.TestRMWebServicesAppsModification.testGetNewApplication[3]
Error Message:
java.net.BindException: Address already in use
Stack Trace:
com.sun.jersey.test.framework.spi.container.TestContainerException: java.net.BindException: Address already in use
at sun.nio.ch.Net.bind0(Native Method)
at sun.nio.ch.Net.bind(Net.java:444)
at sun.nio.ch.Net.bind(Net.java:436)
at sun.nio.ch.ServerSocketChannelImpl.bind(ServerSocketChannelImpl.java:214)
at sun.nio.ch.ServerSocketAdaptor.bind(ServerSocketAdaptor.java:74)
at org.glassfish.grizzly.nio.transport.TCPNIOTransport.bind(TCPNIOTransport.java:413)
at org.glassfish.grizzly.nio.transport.TCPNIOTransport.bind(TCPNIOTransport.java:384)
at org.glassfish.grizzly.nio.transport.TCPNIOTransport.bind(TCPNIOTransport.java:375)
at org.glassfish.grizzly.http.server.NetworkListener.start(NetworkListener.java:549)
at org.glassfish.grizzly.http.server.HttpServer.start(HttpServer.java:255)
at com.sun.jersey.api.container.grizzly2.GrizzlyServerFactory.createHttpServer(GrizzlyServerFactory.java:326)
at com.sun.jersey.api.container.grizzly2.GrizzlyServerFactory.createHttpServer(GrizzlyServerFactory.java:343)
at com.sun.jersey.test.framework.spi.container.grizzly2.web.GrizzlyWebTestContainerFactory$GrizzlyWebTestContainer.instantiateGrizzlyWebServer(GrizzlyWebTestContainerFactory.java:219)
at com.sun.jersey.test.framework.spi.container.grizzly2.web.GrizzlyWebTestContainerFactory$GrizzlyWebTestContainer.<init>(GrizzlyWebTestContainerFactory.java:129)
at com.sun.jersey.test.framework.spi.container.grizzly2.web.GrizzlyWebTestContainerFactory$GrizzlyWebTestContainer.<init>(GrizzlyWebTestContainerFactory.java:86)
at com.sun.jersey.test.framework.spi.container.grizzly2.web.GrizzlyWebTestContainerFactory.create(GrizzlyWebTestContainerFactory.java:79)
at com.sun.jersey.test.framework.JerseyTest.getContainer(JerseyTest.java:342)
at com.sun.jersey.test.framework.JerseyTest.<init>(JerseyTest.java:217)
at org.apache.hadoop.yarn.webapp.JerseyTestBase.<init>(JerseyTestBase.java:27)
at org.apache.hadoop.yarn.server.resourcemanager.webapp.TestRMWebServicesAppsModification.<init>(TestRMWebServicesAppsModification.java:277)
REGRESSION: org.apache.hadoop.yarn.server.resourcemanager.webapp.TestRMWebServicesAppsModification.testSingleAppKillInvalidId[3]
Error Message:
java.net.BindException: Address already in use
Stack Trace:
com.sun.jersey.test.framework.spi.container.TestContainerException: java.net.BindException: Address already in use
at sun.nio.ch.Net.bind0(Native Method)
at sun.nio.ch.Net.bind(Net.java:444)
at sun.nio.ch.Net.bind(Net.java:436)
at sun.nio.ch.ServerSocketChannelImpl.bind(ServerSocketChannelImpl.java:214)
at sun.nio.ch.ServerSocketAdaptor.bind(ServerSocketAdaptor.java:74)
at org.glassfish.grizzly.nio.transport.TCPNIOTransport.bind(TCPNIOTransport.java:413)
at org.glassfish.grizzly.nio.transport.TCPNIOTransport.bind(TCPNIOTransport.java:384)
at org.glassfish.grizzly.nio.transport.TCPNIOTransport.bind(TCPNIOTransport.java:375)
at org.glassfish.grizzly.http.server.NetworkListener.start(NetworkListener.java:549)
at org.glassfish.grizzly.http.server.HttpServer.start(HttpServer.java:255)
at com.sun.jersey.api.container.grizzly2.GrizzlyServerFactory.createHttpServer(GrizzlyServerFactory.java:326)
at com.sun.jersey.api.container.grizzly2.GrizzlyServerFactory.createHttpServer(GrizzlyServerFactory.java:343)
at com.sun.jersey.test.framework.spi.container.grizzly2.web.GrizzlyWebTestContainerFactory$GrizzlyWebTestContainer.instantiateGrizzlyWebServer(GrizzlyWebTestContainerFactory.java:219)
at com.sun.jersey.test.framework.spi.container.grizzly2.web.GrizzlyWebTestContainerFactory$GrizzlyWebTestContainer.<init>(GrizzlyWebTestContainerFactory.java:129)
at com.sun.jersey.test.framework.spi.container.grizzly2.web.GrizzlyWebTestContainerFactory$GrizzlyWebTestContainer.<init>(GrizzlyWebTestContainerFactory.java:86)
at com.sun.jersey.test.framework.spi.container.grizzly2.web.GrizzlyWebTestContainerFactory.create(GrizzlyWebTestContainerFactory.java:79)
at com.sun.jersey.test.framework.JerseyTest.getContainer(JerseyTest.java:342)
at com.sun.jersey.test.framework.JerseyTest.<init>(JerseyTest.java:217)
at org.apache.hadoop.yarn.webapp.JerseyTestBase.<init>(JerseyTestBase.java:27)
at org.apache.hadoop.yarn.server.resourcemanager.webapp.TestRMWebServicesAppsModification.<init>(TestRMWebServicesAppsModification.java:277)
REGRESSION: org.apache.hadoop.yarn.server.resourcemanager.webapp.TestRMWebServicesAppsModification.testSingleAppState[3]
Error Message:
java.net.BindException: Address already in use
Stack Trace:
com.sun.jersey.test.framework.spi.container.TestContainerException: java.net.BindException: Address already in use
at sun.nio.ch.Net.bind0(Native Method)
at sun.nio.ch.Net.bind(Net.java:444)
at sun.nio.ch.Net.bind(Net.java:436)
at sun.nio.ch.ServerSocketChannelImpl.bind(ServerSocketChannelImpl.java:214)
at sun.nio.ch.ServerSocketAdaptor.bind(ServerSocketAdaptor.java:74)
at org.glassfish.grizzly.nio.transport.TCPNIOTransport.bind(TCPNIOTransport.java:413)
at org.glassfish.grizzly.nio.transport.TCPNIOTransport.bind(TCPNIOTransport.java:384)
at org.glassfish.grizzly.nio.transport.TCPNIOTransport.bind(TCPNIOTransport.java:375)
at org.glassfish.grizzly.http.server.NetworkListener.start(NetworkListener.java:549)
at org.glassfish.grizzly.http.server.HttpServer.start(HttpServer.java:255)
at com.sun.jersey.api.container.grizzly2.GrizzlyServerFactory.createHttpServer(GrizzlyServerFactory.java:326)
at com.sun.jersey.api.container.grizzly2.GrizzlyServerFactory.createHttpServer(GrizzlyServerFactory.java:343)
at com.sun.jersey.test.framework.spi.container.grizzly2.web.GrizzlyWebTestContainerFactory$GrizzlyWebTestContainer.instantiateGrizzlyWebServer(GrizzlyWebTestContainerFactory.java:219)
at com.sun.jersey.test.framework.spi.container.grizzly2.web.GrizzlyWebTestContainerFactory$GrizzlyWebTestContainer.<init>(GrizzlyWebTestContainerFactory.java:129)
at com.sun.jersey.test.framework.spi.container.grizzly2.web.GrizzlyWebTestContainerFactory$GrizzlyWebTestContainer.<init>(GrizzlyWebTestContainerFactory.java:86)
at com.sun.jersey.test.framework.spi.container.grizzly2.web.GrizzlyWebTestContainerFactory.create(GrizzlyWebTestContainerFactory.java:79)
at com.sun.jersey.test.framework.JerseyTest.getContainer(JerseyTest.java:342)
at com.sun.jersey.test.framework.JerseyTest.<init>(JerseyTest.java:217)
at org.apache.hadoop.yarn.webapp.JerseyTestBase.<init>(JerseyTestBase.java:27)
at org.apache.hadoop.yarn.server.resourcemanager.webapp.TestRMWebServicesAppsModification.<init>(TestRMWebServicesAppsModification.java:277)
REGRESSION: org.apache.hadoop.yarn.server.resourcemanager.webapp.TestRMWebServicesAppsModification.testGetNewApplicationAndSubmit[3]
Error Message:
java.net.BindException: Address already in use
Stack Trace:
com.sun.jersey.test.framework.spi.container.TestContainerException: java.net.BindException: Address already in use
at sun.nio.ch.Net.bind0(Native Method)
at sun.nio.ch.Net.bind(Net.java:444)
at sun.nio.ch.Net.bind(Net.java:436)
at sun.nio.ch.ServerSocketChannelImpl.bind(ServerSocketChannelImpl.java:214)
at sun.nio.ch.ServerSocketAdaptor.bind(ServerSocketAdaptor.java:74)
at org.glassfish.grizzly.nio.transport.TCPNIOTransport.bind(TCPNIOTransport.java:413)
at org.glassfish.grizzly.nio.transport.TCPNIOTransport.bind(TCPNIOTransport.java:384)
at org.glassfish.grizzly.nio.transport.TCPNIOTransport.bind(TCPNIOTransport.java:375)
at org.glassfish.grizzly.http.server.NetworkListener.start(NetworkListener.java:549)
at org.glassfish.grizzly.http.server.HttpServer.start(HttpServer.java:255)
at com.sun.jersey.api.container.grizzly2.GrizzlyServerFactory.createHttpServer(GrizzlyServerFactory.java:326)
at com.sun.jersey.api.container.grizzly2.GrizzlyServerFactory.createHttpServer(GrizzlyServerFactory.java:343)
at com.sun.jersey.test.framework.spi.container.grizzly2.web.GrizzlyWebTestContainerFactory$GrizzlyWebTestContainer.instantiateGrizzlyWebServer(GrizzlyWebTestContainerFactory.java:219)
at com.sun.jersey.test.framework.spi.container.grizzly2.web.GrizzlyWebTestContainerFactory$GrizzlyWebTestContainer.<init>(GrizzlyWebTestContainerFactory.java:129)
at com.sun.jersey.test.framework.spi.container.grizzly2.web.GrizzlyWebTestContainerFactory$GrizzlyWebTestContainer.<init>(GrizzlyWebTestContainerFactory.java:86)
at com.sun.jersey.test.framework.spi.container.grizzly2.web.GrizzlyWebTestContainerFactory.create(GrizzlyWebTestContainerFactory.java:79)
at com.sun.jersey.test.framework.JerseyTest.getContainer(JerseyTest.java:342)
at com.sun.jersey.test.framework.JerseyTest.<init>(JerseyTest.java:217)
at org.apache.hadoop.yarn.webapp.JerseyTestBase.<init>(JerseyTestBase.java:27)
at org.apache.hadoop.yarn.server.resourcemanager.webapp.TestRMWebServicesAppsModification.<init>(TestRMWebServicesAppsModification.java:277)
REGRESSION: org.apache.hadoop.yarn.server.resourcemanager.webapp.TestRMWebServicesAppsModification.testAppSubmitBadJsonAndXML[3]
Error Message:
java.net.BindException: Address already in use
Stack Trace:
com.sun.jersey.test.framework.spi.container.TestContainerException: java.net.BindException: Address already in use
at sun.nio.ch.Net.bind0(Native Method)
at sun.nio.ch.Net.bind(Net.java:444)
at sun.nio.ch.Net.bind(Net.java:436)
at sun.nio.ch.ServerSocketChannelImpl.bind(ServerSocketChannelImpl.java:214)
at sun.nio.ch.ServerSocketAdaptor.bind(ServerSocketAdaptor.java:74)
at org.glassfish.grizzly.nio.transport.TCPNIOTransport.bind(TCPNIOTransport.java:413)
at org.glassfish.grizzly.nio.transport.TCPNIOTransport.bind(TCPNIOTransport.java:384)
at org.glassfish.grizzly.nio.transport.TCPNIOTransport.bind(TCPNIOTransport.java:375)
at org.glassfish.grizzly.http.server.NetworkListener.start(NetworkListener.java:549)
at org.glassfish.grizzly.http.server.HttpServer.start(HttpServer.java:255)
at com.sun.jersey.api.container.grizzly2.GrizzlyServerFactory.createHttpServer(GrizzlyServerFactory.java:326)
at com.sun.jersey.api.container.grizzly2.GrizzlyServerFactory.createHttpServer(GrizzlyServerFactory.java:343)
at com.sun.jersey.test.framework.spi.container.grizzly2.web.GrizzlyWebTestContainerFactory$GrizzlyWebTestContainer.instantiateGrizzlyWebServer(GrizzlyWebTestContainerFactory.java:219)
at com.sun.jersey.test.framework.spi.container.grizzly2.web.GrizzlyWebTestContainerFactory$GrizzlyWebTestContainer.<init>(GrizzlyWebTestContainerFactory.java:129)
at com.sun.jersey.test.framework.spi.container.grizzly2.web.GrizzlyWebTestContainerFactory$GrizzlyWebTestContainer.<init>(GrizzlyWebTestContainerFactory.java:86)
at com.sun.jersey.test.framework.spi.container.grizzly2.web.GrizzlyWebTestContainerFactory.create(GrizzlyWebTestContainerFactory.java:79)
at com.sun.jersey.test.framework.JerseyTest.getContainer(JerseyTest.java:342)
at com.sun.jersey.test.framework.JerseyTest.<init>(JerseyTest.java:217)
at org.apache.hadoop.yarn.webapp.JerseyTestBase.<init>(JerseyTestBase.java:27)
at org.apache.hadoop.yarn.server.resourcemanager.webapp.TestRMWebServicesAppsModification.<init>(TestRMWebServicesAppsModification.java:277)
Failed: YARN-3439 PreCommit Build #7200
Posted by Apache Jenkins Server <je...@builds.apache.org>.
Jira: https://issues.apache.org/jira/browse/YARN-3439
Build: https://builds.apache.org/job/PreCommit-YARN-Build/7200/
###################################################################################
########################## LAST 60 LINES OF THE CONSOLE ###########################
[...truncated 3440 lines...]
{color:red}-1 overall{color}. Here are the results of testing the latest attachment
http://issues.apache.org/jira/secure/attachment/12709044/YARN-3439.001.patch
against trunk revision eccb7d4.
{color:green}+1 @author{color}. The patch does not contain any @author tags.
{color:green}+1 tests included{color}. The patch appears to include 1 new or modified test files.
{color:green}+1 javac{color}. The applied patch does not increase the total number of javac compiler warnings.
{color:green}+1 javadoc{color}. There were no new javadoc warning messages.
{color:green}+1 eclipse:eclipse{color}. The patch built with eclipse:eclipse.
{color:red}-1 findbugs{color}. The patch appears to introduce 2 new Findbugs (version 2.0.3) warnings.
{color:green}+1 release audit{color}. The applied patch does not increase the total number of release audit warnings.
{color:green}+1 core tests{color}. The patch passed unit tests in hadoop-yarn-project/hadoop-yarn/hadoop-yarn-server/hadoop-yarn-server-resourcemanager.
Test results: https://builds.apache.org/job/PreCommit-YARN-Build/7200//testReport/
Findbugs warnings: https://builds.apache.org/job/PreCommit-YARN-Build/7200//artifact/patchprocess/newPatchFindbugsWarningshadoop-yarn-server-resourcemanager.html
Console output: https://builds.apache.org/job/PreCommit-YARN-Build/7200//console
This message is automatically generated.
======================================================================
======================================================================
Adding comment to Jira.
======================================================================
======================================================================
Comment added.
bd1d8a9fc4a5d454cdb04c3e5b7da30d2bd8d888 logged out
======================================================================
======================================================================
Finished build.
======================================================================
======================================================================
Build step 'Execute shell' marked build as failure
Archiving artifacts
Sending artifact delta relative to PreCommit-YARN-Build #7189
Archived 15 artifacts
Archive block size is 32768
Received 52 blocks and 7387094 bytes
Compression is 18.7%
Took 3.1 sec
Description set: MAPREDUCE-6303
Recording test results
Email was triggered for: Failure
Sending email for trigger: Failure
###################################################################################
############################## FAILED TESTS (if any) ##############################
All tests passed
Failed: YARN-2901 PreCommit Build #7199
Posted by Apache Jenkins Server <je...@builds.apache.org>.
Jira: https://issues.apache.org/jira/browse/YARN-2901
Build: https://builds.apache.org/job/PreCommit-YARN-Build/7199/
###################################################################################
########################## LAST 60 LINES OF THE CONSOLE ###########################
[...truncated 3132 lines...]
{color:green}+1 javac{color}. The applied patch does not increase the total number of javac compiler warnings.
{color:green}+1 javadoc{color}. There were no new javadoc warning messages.
{color:green}+1 eclipse:eclipse{color}. The patch built with eclipse:eclipse.
{color:green}+1 findbugs{color}. The patch does not introduce any new Findbugs (version 2.0.3) warnings.
{color:green}+1 release audit{color}. The applied patch does not increase the total number of release audit warnings.
{color:green}+1 core tests{color}. The patch passed unit tests in .
Test results: https://builds.apache.org/job/PreCommit-YARN-Build/7199//testReport/
Console output: https://builds.apache.org/job/PreCommit-YARN-Build/7199//console
This message is automatically generated.
======================================================================
======================================================================
Adding comment to Jira.
======================================================================
======================================================================
Comment added.
1c3db4eddfdae607ffb55fcdd14734fe30304294 logged out
======================================================================
======================================================================
Finished build.
======================================================================
======================================================================
Archiving artifacts
Sending artifact delta relative to PreCommit-YARN-Build #7189
ERROR: Failed to archive {patchprocess/newPatchFindbugsWarningstez-runtime-library.xml=patchprocess/newPatchFindbugsWarningstez-runtime-library.xml, patchprocess/newPatchFindbugsWarningstez-dag.xml=patchprocess/newPatchFindbugsWarningstez-dag.xml, patchprocess/patchJavacWarnings.txt=patchprocess/patchJavacWarnings.txt, patchprocess/testrun.txt=patchprocess/testrun.txt, patchprocess/newPatchFindbugsWarningstez-common.html=patchprocess/newPatchFindbugsWarningstez-common.html, patchprocess/patchJavadocWarnings.txt=patchprocess/patchJavadocWarnings.txt, patchprocess/patchFindBugsOutput.txt=patchprocess/patchFindBugsOutput.txt, patchprocess/patchFindbugsWarningstez-mbeans-resource-calculator.xml=patchprocess/patchFindbugsWarningstez-mbeans-resource-calculator.xml, patchprocess/patchFindbugsWarningstez-runtime-internals.xml=patchprocess/patchFindbugsWarningstez-runtime-internals.xml, patchprocess/newPatchFindbugsWarningstez-runtime-library.html=patchprocess/newPatchFindbugsWarningstez-runtime-library.html, patchprocess/masterJavacWarnings.txt=patchprocess/masterJavacWarnings.txt, patchprocess/trunkJavadocWarnings.txt=patchprocess/trunkJavadocWarnings.txt, patchprocess/newPatchFindbugsWarningstez-runtime-internals.html=patchprocess/newPatchFindbugsWarningstez-runtime-internals.html, patchprocess/patchFindbugsWarningstez-mapreduce.xml=patchprocess/patchFindbugsWarningstez-mapreduce.xml, patchprocess/patchFindbugsWarningstez-yarn-timeline-history-with-acls.xml=patchprocess/patchFindbugsWarningstez-yarn-timeline-history-with-acls.xml, patchprocess/patchFindbugsWarningstez-yarn-timeline-history.xml=patchprocess/patchFindbugsWarningstez-yarn-timeline-history.xml, patchprocess/patchFindbugsWarningstez-dag.xml=patchprocess/patchFindbugsWarningstez-dag.xml, patchprocess/masterJavadocWarnings.txt=patchprocess/masterJavadocWarnings.txt, patchprocess/diffJavadocWarnings.txt=patchprocess/diffJavadocWarnings.txt, patchprocess/newPatchFindbugsWarningstez-examples.html=patchprocess/newPatchFindbugsWarningstez-examples.html, patchprocess/newPatchFindbugsWarningstez-yarn-timeline-history-with-acls.html=patchprocess/newPatchFindbugsWarningstez-yarn-timeline-history-with-acls.html, patchprocess/newPatchFindbugsWarningstez-yarn-timeline-history.xml=patchprocess/newPatchFindbugsWarningstez-yarn-timeline-history.xml, patchprocess/patchFindbugsWarningstez-examples.xml=patchprocess/patchFindbugsWarningstez-examples.xml, patchprocess/trunkJavacWarnings.txt=patchprocess/trunkJavacWarnings.txt, patchprocess/patchFindbugsWarningstez-runtime-library.xml=patchprocess/patchFindbugsWarningstez-runtime-library.xml, patchprocess/newPatchFindbugsWarningstez-tests.xml=patchprocess/newPatchFindbugsWarningstez-tests.xml, patchprocess/newPatchFindbugsWarningstez-runtime-internals.xml=patchprocess/newPatchFindbugsWarningstez-runtime-internals.xml, patchprocess/newPatchFindbugsWarningstez-yarn-timeline-history.html=patchprocess/newPatchFindbugsWarningstez-yarn-timeline-history.html, patchprocess/newPatchFindbugsWarningstez-common.xml=patchprocess/newPatchFindbugsWarningstez-common.xml, patchprocess/patchReleaseAuditOutput.txt=patchprocess/patchReleaseAuditOutput.txt, patchprocess/newPatchFindbugsWarningstez-tests.html=patchprocess/newPatchFindbugsWarningstez-tests.html, patchprocess/newPatchFindbugsWarningstez-api.xml=patchprocess/newPatchFindbugsWarningstez-api.xml, patchprocess/patchFindbugsWarningstez-api.xml=patchprocess/patchFindbugsWarningstez-api.xml, patchprocess/patchReleaseAuditWarnings.txt=patchprocess/patchReleaseAuditWarnings.txt, patchprocess/filteredPatchJavacWarnings.txt=patchprocess/filteredPatchJavacWarnings.txt, patchprocess/newPatchFindbugsWarningstez-yarn-timeline-history-with-acls.xml=patchprocess/newPatchFindbugsWarningstez-yarn-timeline-history-with-acls.xml, patchprocess/newPatchFindbugsWarningstez-examples.xml=patchprocess/newPatchFindbugsWarningstez-examples.xml, patchprocess/patchEclipseOutput.txt=patchprocess/patchEclipseOutput.txt, patchprocess/newPatchFindbugsWarningstez-api.html=patchprocess/newPatchFindbugsWarningstez-api.html, patchprocess/patchFindbugsWarningstez-tests.xml=patchprocess/patchFindbugsWarningstez-tests.xml, patchprocess/filteredmasterJavacWarnings.txt=patchprocess/filteredmasterJavacWarnings.txt, patchprocess/patchFindbugsWarningstez-common.xml=patchprocess/patchFindbugsWarningstez-common.xml, patchprocess/newPatchFindbugsWarningstez-mbeans-resource-calculator.xml=patchprocess/newPatchFindbugsWarningstez-mbeans-resource-calculator.xml, patchprocess/newPatchFindbugsWarningstez-mapreduce.xml=patchprocess/newPatchFindbugsWarningstez-mapreduce.xml, patchprocess/filteredTrunkJavacWarnings.txt=patchprocess/filteredTrunkJavacWarnings.txt, patchprocess/newPatchFindbugsWarningstez-dag.html=patchprocess/newPatchFindbugsWarningstez-dag.html, patchprocess/newPatchFindbugsWarningstez-mapreduce.html=patchprocess/newPatchFindbugsWarningstez-mapreduce.html, patchprocess/newPatchFindbugsWarningstez-mbeans-resource-calculator.html=patchprocess/newPatchFindbugsWarningstez-mbeans-resource-calculator.html} due to internal error; falling back to full archiving
java.lang.IllegalStateException: checksum mismatch after transfer (6081393815818629749 vs. 2835208256); /x1/jenkins/jenkins-home/jobs/PreCommit-YARN-Build/builds/2015-04-02_18-10-41/archive/patchprocess/testrun.txt may be corrupted
at jsync.protocol.FileSequenceReader.read(FileSequenceReader.java:45)
at com.cloudbees.jenkins.plugins.jsync.archiver.JSyncArtifactManager.remoteSync(JSyncArtifactManager.java:145)
at com.cloudbees.jenkins.plugins.jsync.archiver.JSyncArtifactManager.archive(JSyncArtifactManager.java:68)
at hudson.tasks.ArtifactArchiver.perform(ArtifactArchiver.java:140)
at hudson.tasks.BuildStepMonitor$1.perform(BuildStepMonitor.java:20)
at hudson.model.AbstractBuild$AbstractBuildExecution.perform(AbstractBuild.java:756)
at hudson.model.AbstractBuild$AbstractBuildExecution.performAllBuildSteps(AbstractBuild.java:720)
at hudson.model.Build$BuildExecution.post2(Build.java:182)
at hudson.model.AbstractBuild$AbstractBuildExecution.post(AbstractBuild.java:669)
at hudson.model.Run.execute(Run.java:1731)
at hudson.model.FreeStyleBuild.run(FreeStyleBuild.java:43)
at hudson.model.ResourceController.execute(ResourceController.java:88)
at hudson.model.Executor.run(Executor.java:232)
Description set: YARN-2901
Recording test results
No test report files were found. Configuration error?
Build step 'Publish JUnit test result report' changed build result to FAILURE
Email was triggered for: Failure
Sending email for trigger: Failure
###################################################################################
############################## FAILED TESTS (if any) ##############################
No tests ran.
Failed: YARN-3318 PreCommit Build #7198
Posted by Apache Jenkins Server <je...@builds.apache.org>.
Jira: https://issues.apache.org/jira/browse/YARN-3318
Build: https://builds.apache.org/job/PreCommit-YARN-Build/7198/
###################################################################################
########################## LAST 60 LINES OF THE CONSOLE ###########################
[...truncated 3861 lines...]
{color:red}-1 overall{color}. Here are the results of testing the latest attachment
http://issues.apache.org/jira/secure/attachment/12708923/YARN-3318.39.patch
against trunk revision 867d5d2.
{color:green}+1 @author{color}. The patch does not contain any @author tags.
{color:green}+1 tests included{color}. The patch appears to include 9 new or modified test files.
{color:red}-1 javac{color}. The applied patch generated 1149 javac compiler warnings (more than the trunk's current 1148 warnings).
{color:green}+1 javadoc{color}. There were no new javadoc warning messages.
{color:green}+1 eclipse:eclipse{color}. The patch built with eclipse:eclipse.
{color:green}+1 findbugs{color}. The patch does not introduce any new Findbugs (version 2.0.3) warnings.
{color:green}+1 release audit{color}. The applied patch does not increase the total number of release audit warnings.
{color:red}-1 core tests{color}. The patch failed these unit tests in hadoop-yarn-project/hadoop-yarn/hadoop-yarn-api hadoop-yarn-project/hadoop-yarn/hadoop-yarn-client hadoop-yarn-project/hadoop-yarn/hadoop-yarn-common hadoop-yarn-project/hadoop-yarn/hadoop-yarn-server/hadoop-yarn-server-resourcemanager:
org.apache.hadoop.yarn.client.api.impl.TestAMRMClient
Test results: https://builds.apache.org/job/PreCommit-YARN-Build/7198//testReport/
Javac warnings: https://builds.apache.org/job/PreCommit-YARN-Build/7198//artifact/patchprocess/diffJavacWarnings.txt
Console output: https://builds.apache.org/job/PreCommit-YARN-Build/7198//console
This message is automatically generated.
======================================================================
======================================================================
Adding comment to Jira.
======================================================================
======================================================================
Comment added.
1ca095400b0dade1ef4de125f9c7883aa9c7ee38 logged out
======================================================================
======================================================================
Finished build.
======================================================================
======================================================================
Build step 'Execute shell' marked build as failure
Archiving artifacts
Sending artifact delta relative to PreCommit-YARN-Build #7189
Archived 31 artifacts
Archive block size is 32768
Received 212 blocks and 2894146 bytes
Compression is 70.6%
Took 6.9 sec
[description-setter] Could not determine description.
Recording test results
Email was triggered for: Failure
Sending email for trigger: Failure
###################################################################################
############################## FAILED TESTS (if any) ##############################
1 tests failed.
FAILED: org.apache.hadoop.yarn.client.api.impl.TestAMRMClient.testAMRMClientOnAMRMTokenRollOver
Error Message:
null
Stack Trace:
java.lang.AssertionError: null
at org.junit.Assert.fail(Assert.java:86)
at org.junit.Assert.assertTrue(Assert.java:41)
at org.junit.Assert.assertTrue(Assert.java:52)
at org.apache.hadoop.yarn.client.api.impl.TestAMRMClient.testAMRMClientOnAMRMTokenRollOver(TestAMRMClient.java:1046)
Failed: YARN-1572 PreCommit Build #7197
Posted by Apache Jenkins Server <je...@builds.apache.org>.
Jira: https://issues.apache.org/jira/browse/YARN-1572
Build: https://builds.apache.org/job/PreCommit-YARN-Build/7197/
###################################################################################
########################## LAST 60 LINES OF THE CONSOLE ###########################
[...truncated 23 lines...]
======================================================================
======================================================================
Testing patch for YARN-1572.
======================================================================
======================================================================
HEAD is now at f383fd9 HADOOP-11731. Rework the changelog and releasenotes (aw)
Previous HEAD position was f383fd9... HADOOP-11731. Rework the changelog and releasenotes (aw)
Switched to branch 'trunk'
Your branch is behind 'origin/trunk' by 16 commits, and can be fast-forwarded.
(use "git pull" to update your local branch)
First, rewinding head to replay your work on top of it...
Fast-forwarded trunk to f383fd9b6caf4557613250c5c218b1a1b65a212b.
YARN-1572 patch is being downloaded at Thu Apr 2 02:07:03 UTC 2015 from
http://issues.apache.org/jira/secure/attachment/12708878/YARN-1572-branch-2.3.0.001.patch
cp: cannot stat '/home/jenkins/buildSupport/lib/*': No such file or directory
The patch does not appear to apply with p0 to p2
PATCH APPLICATION FAILED
{color:red}-1 overall{color}. Here are the results of testing the latest attachment
http://issues.apache.org/jira/secure/attachment/12708878/YARN-1572-branch-2.3.0.001.patch
against trunk revision f383fd9.
{color:red}-1 patch{color}. The patch command could not apply the patch.
Console output: https://builds.apache.org/job/PreCommit-YARN-Build/7197//console
This message is automatically generated.
======================================================================
======================================================================
Adding comment to Jira.
======================================================================
======================================================================
Comment added.
dc6b3d0cd5da1a1d5e9b76eaa6015c93231f35dc logged out
======================================================================
======================================================================
Finished build.
======================================================================
======================================================================
Build step 'Execute shell' marked build as failure
Archiving artifacts
[description-setter] Could not determine description.
Recording test results
Email was triggered for: Failure
Sending email for trigger: Failure
###################################################################################
############################## FAILED TESTS (if any) ##############################
No tests ran.
Failed: YARN-3415 PreCommit Build #7196
Posted by Apache Jenkins Server <je...@builds.apache.org>.
Jira: https://issues.apache.org/jira/browse/YARN-3415
Build: https://builds.apache.org/job/PreCommit-YARN-Build/7196/
###################################################################################
########################## LAST 60 LINES OF THE CONSOLE ###########################
[...truncated 3118 lines...]
cat: /home/jenkins/jenkins-slave/workspace/PreCommit-YARN-Build/../patchprocess/testrun_hadoop-yarn-server-resourcemanager.txt: No such file or directory
awk: cannot open /home/jenkins/jenkins-slave/workspace/PreCommit-YARN-Build/../patchprocess/testrun_hadoop-yarn-server-resourcemanager.txt (No such file or directory)
/home/jenkins/jenkins-slave/workspace/PreCommit-YARN-Build
{color:green}+1 overall{color}. Here are the results of testing the latest attachment
http://issues.apache.org/jira/secure/attachment/12708850/YARN-3415.002.patch
against trunk revision 4d14816.
{color:green}+1 @author{color}. The patch does not contain any @author tags.
{color:green}+1 tests included{color}. The patch appears to include 1 new or modified test files.
{color:green}+1 javac{color}. The applied patch does not increase the total number of javac compiler warnings.
{color:green}+1 javadoc{color}. There were no new javadoc warning messages.
{color:green}+1 eclipse:eclipse{color}. The patch built with eclipse:eclipse.
{color:green}+1 findbugs{color}. The patch does not introduce any new Findbugs (version 2.0.3) warnings.
{color:green}+1 release audit{color}. The applied patch does not increase the total number of release audit warnings.
{color:green}+1 core tests{color}. The patch passed unit tests in hadoop-yarn-project/hadoop-yarn/hadoop-yarn-server/hadoop-yarn-server-resourcemanager.
Test results: https://builds.apache.org/job/PreCommit-YARN-Build/7196//testReport/
Console output: https://builds.apache.org/job/PreCommit-YARN-Build/7196//console
This message is automatically generated.
======================================================================
======================================================================
Adding comment to Jira.
======================================================================
======================================================================
Comment added.
c6117a8fd890fb5d8ecf00e2817a30e7cd369ad6 logged out
======================================================================
======================================================================
Finished build.
======================================================================
======================================================================
Archiving artifacts
ERROR: No artifacts found that match the file pattern "patchprocess/*.*". Configuration error?
ERROR: ?patchprocess/*.*? doesn?t match anything, but ?*.*? does. Perhaps that?s what you mean?
Build step 'Archive the artifacts' changed build result to FAILURE
[description-setter] Could not determine description.
Recording test results
Email was triggered for: Failure
Sending email for trigger: Failure
###################################################################################
############################## FAILED TESTS (if any) ##############################
All tests passed