You are viewing a plain text version of this content. The canonical link for it is here.
Posted to derby-dev@db.apache.org by "Suresh Thalamati (JIRA)" <ji...@apache.org> on 2007/02/10 00:22:05 UTC
[jira] Created: (DERBY-2318)
testStreams(org.apache.derbyTesting.functionTests.tests.lang.StreamsTest)
failed on weme6.1 jvm/
testStreams(org.apache.derbyTesting.functionTests.tests.lang.StreamsTest) failed on weme6.1 jvm/
-------------------------------------------------------------------------------------------------
Key: DERBY-2318
URL: https://issues.apache.org/jira/browse/DERBY-2318
Project: Derby
Issue Type: Test
Affects Versions: 10.3.0.0
Environment: Java Version: J2ME Foundation Specification v1.1
Java Vendor: IBM Corporation
Java home: c:\jartest\weme6.1
Reporter: Suresh Thalamati
Priority: Minor
Time: 1,021.188
There was 1 failure:
1) testStreams(org.apache.derbyTesting.functionTests.tests.lang.StreamsTest)junit.framework.AssertionFailedError: FAILED!! level difference not expected since streams are materialized. expected:<48> but was:<49>
at org.apache.derbyTesting.functionTests.tests.lang.StreamsTest.testStreams(StreamsTest.java:118)
at java.lang.reflect.AccessibleObject.invokeV(AccessibleObject.java:205)
at org.apache.derbyTesting.junit.BaseTestCase.runBare(BaseTestCase.java:76)
at junit.extensions.TestDecorator.basicRun(TestDecorator.java:22)
at junit.extensions.TestSetup$1.protect(TestSetup.java:19)
at junit.extensions.TestSetup.run(TestSetup.java:23)
at junit.extensions.TestDecorator.basicRun(TestDecorator.java:22)
at junit.extensions.TestSetup$1.protect(TestSetup.java:19)
at junit.extensions.TestSetup.run(TestSetup.java:23)
FAILURES!!!
Tests run: 1285, Failures: 1, Errors: 0
--
This message is automatically generated by JIRA.
-
You can reply to this email to add a comment to the issue online.
[jira] Commented: (DERBY-2318)
testStreams(org.apache.derbyTesting.functionTests.tests.lang.StreamsTest)
failed on weme6.1 jvm/
Posted by "Myrna van Lunteren (JIRA)" <ji...@apache.org>.
[ https://issues.apache.org/jira/browse/DERBY-2318?page=com.atlassian.jira.plugin.system.issuetabpanels:comment-tabpanel#action_12481392 ]
Myrna van Lunteren commented on DERBY-2318:
-------------------------------------------
I don't see my commit show up on the subversion commits list (yet), so just in case that went wrong, it's revision 518814.
> testStreams(org.apache.derbyTesting.functionTests.tests.lang.StreamsTest) failed on weme6.1 jvm/
> -------------------------------------------------------------------------------------------------
>
> Key: DERBY-2318
> URL: https://issues.apache.org/jira/browse/DERBY-2318
> Project: Derby
> Issue Type: Test
> Affects Versions: 10.3.0.0
> Environment: Java Version: J2ME Foundation Specification v1.1
> Java Vendor: IBM Corporation
> Java home: c:\jartest\weme6.1
> Reporter: Suresh Thalamati
> Assigned To: Myrna van Lunteren
> Priority: Minor
> Fix For: 10.3.0.0
>
>
> Time: 1,021.188
> There was 1 failure:
> 1) testStreams(org.apache.derbyTesting.functionTests.tests.lang.StreamsTest)junit.framework.AssertionFailedError: FAILED!! level difference not expected since streams are materialized. expected:<48> but was:<49>
> at org.apache.derbyTesting.functionTests.tests.lang.StreamsTest.testStreams(StreamsTest.java:118)
> at java.lang.reflect.AccessibleObject.invokeV(AccessibleObject.java:205)
> at org.apache.derbyTesting.junit.BaseTestCase.runBare(BaseTestCase.java:76)
> at junit.extensions.TestDecorator.basicRun(TestDecorator.java:22)
> at junit.extensions.TestSetup$1.protect(TestSetup.java:19)
> at junit.extensions.TestSetup.run(TestSetup.java:23)
> at junit.extensions.TestDecorator.basicRun(TestDecorator.java:22)
> at junit.extensions.TestSetup$1.protect(TestSetup.java:19)
> at junit.extensions.TestSetup.run(TestSetup.java:23)
> FAILURES!!!
> Tests run: 1285, Failures: 1, Errors: 0
--
This message is automatically generated by JIRA.
-
You can reply to this email to add a comment to the issue online.
[jira] Closed: (DERBY-2318)
testStreams(org.apache.derbyTesting.functionTests.tests.lang.StreamsTest)
failed on weme6.1 jvm/
Posted by "Myrna van Lunteren (JIRA)" <ji...@apache.org>.
[ https://issues.apache.org/jira/browse/DERBY-2318?page=com.atlassian.jira.plugin.system.issuetabpanels:all-tabpanel ]
Myrna van Lunteren closed DERBY-2318.
-------------------------------------
Resolution: Fixed
Derby Info: (was: [Regression])
Unfortunately (or fortunately?) we can't skip running this test for both ibm15 and weme6.1.
The failure was due to an extra line in the stack trace for a new Throwable; ibm15 and weme6.1 both showed a line for Throwable<init>.
I hesitated between disabling this test altogether, spending time to come up with a different way of doing it (because, indeed, it's not necessarily valid) and accepting a range of values. In the end, I decided for a band-aid - assume there's only one Throwable line and reduce the count.
But, this is really a band-aid. I suspect this test may cause trouble in the future, with new jvms or jits...
> testStreams(org.apache.derbyTesting.functionTests.tests.lang.StreamsTest) failed on weme6.1 jvm/
> -------------------------------------------------------------------------------------------------
>
> Key: DERBY-2318
> URL: https://issues.apache.org/jira/browse/DERBY-2318
> Project: Derby
> Issue Type: Test
> Affects Versions: 10.3.0.0
> Environment: Java Version: J2ME Foundation Specification v1.1
> Java Vendor: IBM Corporation
> Java home: c:\jartest\weme6.1
> Reporter: Suresh Thalamati
> Assigned To: Myrna van Lunteren
> Priority: Minor
> Fix For: 10.3.0.0
>
>
> Time: 1,021.188
> There was 1 failure:
> 1) testStreams(org.apache.derbyTesting.functionTests.tests.lang.StreamsTest)junit.framework.AssertionFailedError: FAILED!! level difference not expected since streams are materialized. expected:<48> but was:<49>
> at org.apache.derbyTesting.functionTests.tests.lang.StreamsTest.testStreams(StreamsTest.java:118)
> at java.lang.reflect.AccessibleObject.invokeV(AccessibleObject.java:205)
> at org.apache.derbyTesting.junit.BaseTestCase.runBare(BaseTestCase.java:76)
> at junit.extensions.TestDecorator.basicRun(TestDecorator.java:22)
> at junit.extensions.TestSetup$1.protect(TestSetup.java:19)
> at junit.extensions.TestSetup.run(TestSetup.java:23)
> at junit.extensions.TestDecorator.basicRun(TestDecorator.java:22)
> at junit.extensions.TestSetup$1.protect(TestSetup.java:19)
> at junit.extensions.TestSetup.run(TestSetup.java:23)
> FAILURES!!!
> Tests run: 1285, Failures: 1, Errors: 0
--
This message is automatically generated by JIRA.
-
You can reply to this email to add a comment to the issue online.
[jira] Reopened: (DERBY-2318)
testStreams(org.apache.derbyTesting.functionTests.tests.lang.StreamsTest)
failed on weme6.1 jvm/
Posted by "Myrna van Lunteren (JIRA)" <ji...@apache.org>.
[ https://issues.apache.org/jira/browse/DERBY-2318?page=com.atlassian.jira.plugin.system.issuetabpanels:all-tabpanel ]
Myrna van Lunteren reopened DERBY-2318:
---------------------------------------
> testStreams(org.apache.derbyTesting.functionTests.tests.lang.StreamsTest) failed on weme6.1 jvm/
> -------------------------------------------------------------------------------------------------
>
> Key: DERBY-2318
> URL: https://issues.apache.org/jira/browse/DERBY-2318
> Project: Derby
> Issue Type: Test
> Components: Test
> Affects Versions: 10.3.0.0
> Environment: Java Version: J2ME Foundation Specification v1.1
> Java Vendor: IBM Corporation
> Java home: c:\jartest\weme6.1
> Reporter: Suresh Thalamati
> Assigned To: Myrna van Lunteren
> Priority: Minor
> Fix For: 10.3.0.0
>
>
> Time: 1,021.188
> There was 1 failure:
> 1) testStreams(org.apache.derbyTesting.functionTests.tests.lang.StreamsTest)junit.framework.AssertionFailedError: FAILED!! level difference not expected since streams are materialized. expected:<48> but was:<49>
> at org.apache.derbyTesting.functionTests.tests.lang.StreamsTest.testStreams(StreamsTest.java:118)
> at java.lang.reflect.AccessibleObject.invokeV(AccessibleObject.java:205)
> at org.apache.derbyTesting.junit.BaseTestCase.runBare(BaseTestCase.java:76)
> at junit.extensions.TestDecorator.basicRun(TestDecorator.java:22)
> at junit.extensions.TestSetup$1.protect(TestSetup.java:19)
> at junit.extensions.TestSetup.run(TestSetup.java:23)
> at junit.extensions.TestDecorator.basicRun(TestDecorator.java:22)
> at junit.extensions.TestSetup$1.protect(TestSetup.java:19)
> at junit.extensions.TestSetup.run(TestSetup.java:23)
> FAILURES!!!
> Tests run: 1285, Failures: 1, Errors: 0
--
This message is automatically generated by JIRA.
-
You can reply to this email to add a comment to the issue online.
[jira] Assigned: (DERBY-2318)
testStreams(org.apache.derbyTesting.functionTests.tests.lang.StreamsTest)
failed on weme6.1 jvm/
Posted by "Myrna van Lunteren (JIRA)" <ji...@apache.org>.
[ https://issues.apache.org/jira/browse/DERBY-2318?page=com.atlassian.jira.plugin.system.issuetabpanels:all-tabpanel ]
Myrna van Lunteren reassigned DERBY-2318:
-----------------------------------------
Assignee: Myrna van Lunteren
> testStreams(org.apache.derbyTesting.functionTests.tests.lang.StreamsTest) failed on weme6.1 jvm/
> -------------------------------------------------------------------------------------------------
>
> Key: DERBY-2318
> URL: https://issues.apache.org/jira/browse/DERBY-2318
> Project: Derby
> Issue Type: Test
> Affects Versions: 10.3.0.0
> Environment: Java Version: J2ME Foundation Specification v1.1
> Java Vendor: IBM Corporation
> Java home: c:\jartest\weme6.1
> Reporter: Suresh Thalamati
> Assigned To: Myrna van Lunteren
> Priority: Minor
> Fix For: 10.3.0.0
>
>
> Time: 1,021.188
> There was 1 failure:
> 1) testStreams(org.apache.derbyTesting.functionTests.tests.lang.StreamsTest)junit.framework.AssertionFailedError: FAILED!! level difference not expected since streams are materialized. expected:<48> but was:<49>
> at org.apache.derbyTesting.functionTests.tests.lang.StreamsTest.testStreams(StreamsTest.java:118)
> at java.lang.reflect.AccessibleObject.invokeV(AccessibleObject.java:205)
> at org.apache.derbyTesting.junit.BaseTestCase.runBare(BaseTestCase.java:76)
> at junit.extensions.TestDecorator.basicRun(TestDecorator.java:22)
> at junit.extensions.TestSetup$1.protect(TestSetup.java:19)
> at junit.extensions.TestSetup.run(TestSetup.java:23)
> at junit.extensions.TestDecorator.basicRun(TestDecorator.java:22)
> at junit.extensions.TestSetup$1.protect(TestSetup.java:19)
> at junit.extensions.TestSetup.run(TestSetup.java:23)
> FAILURES!!!
> Tests run: 1285, Failures: 1, Errors: 0
--
This message is automatically generated by JIRA.
-
You can reply to this email to add a comment to the issue online.
[jira] Assigned: (DERBY-2318)
testStreams(org.apache.derbyTesting.functionTests.tests.lang.StreamsTest)
failed on weme6.1 jvm/
Posted by "Daniel John Debrunner (JIRA)" <ji...@apache.org>.
[ https://issues.apache.org/jira/browse/DERBY-2318?page=com.atlassian.jira.plugin.system.issuetabpanels:all-tabpanel ]
Daniel John Debrunner reassigned DERBY-2318:
--------------------------------------------
Assignee: (was: Daniel John Debrunner)
I'm not sure what to do about this - I don't see it fail.
> testStreams(org.apache.derbyTesting.functionTests.tests.lang.StreamsTest) failed on weme6.1 jvm/
> -------------------------------------------------------------------------------------------------
>
> Key: DERBY-2318
> URL: https://issues.apache.org/jira/browse/DERBY-2318
> Project: Derby
> Issue Type: Test
> Affects Versions: 10.3.0.0
> Environment: Java Version: J2ME Foundation Specification v1.1
> Java Vendor: IBM Corporation
> Java home: c:\jartest\weme6.1
> Reporter: Suresh Thalamati
> Priority: Minor
> Fix For: 10.3.0.0
>
>
> Time: 1,021.188
> There was 1 failure:
> 1) testStreams(org.apache.derbyTesting.functionTests.tests.lang.StreamsTest)junit.framework.AssertionFailedError: FAILED!! level difference not expected since streams are materialized. expected:<48> but was:<49>
> at org.apache.derbyTesting.functionTests.tests.lang.StreamsTest.testStreams(StreamsTest.java:118)
> at java.lang.reflect.AccessibleObject.invokeV(AccessibleObject.java:205)
> at org.apache.derbyTesting.junit.BaseTestCase.runBare(BaseTestCase.java:76)
> at junit.extensions.TestDecorator.basicRun(TestDecorator.java:22)
> at junit.extensions.TestSetup$1.protect(TestSetup.java:19)
> at junit.extensions.TestSetup.run(TestSetup.java:23)
> at junit.extensions.TestDecorator.basicRun(TestDecorator.java:22)
> at junit.extensions.TestSetup$1.protect(TestSetup.java:19)
> at junit.extensions.TestSetup.run(TestSetup.java:23)
> FAILURES!!!
> Tests run: 1285, Failures: 1, Errors: 0
--
This message is automatically generated by JIRA.
-
You can reply to this email to add a comment to the issue online.
[jira] Commented: (DERBY-2318)
testStreams(org.apache.derbyTesting.functionTests.tests.lang.StreamsTest)
failed on weme6.1 jvm/
Posted by "Daniel John Debrunner (JIRA)" <ji...@apache.org>.
[ https://issues.apache.org/jira/browse/DERBY-2318?page=com.atlassian.jira.plugin.system.issuetabpanels:comment-tabpanel#action_12473819 ]
Daniel John Debrunner commented on DERBY-2318:
----------------------------------------------
One guess is that the JIT is changing the stack depth by inlining methods.
I think in some ways the test is invalid, I don't think there are no guarantees about the stack depth for subsequent similar operations.
> testStreams(org.apache.derbyTesting.functionTests.tests.lang.StreamsTest) failed on weme6.1 jvm/
> -------------------------------------------------------------------------------------------------
>
> Key: DERBY-2318
> URL: https://issues.apache.org/jira/browse/DERBY-2318
> Project: Derby
> Issue Type: Test
> Affects Versions: 10.3.0.0
> Environment: Java Version: J2ME Foundation Specification v1.1
> Java Vendor: IBM Corporation
> Java home: c:\jartest\weme6.1
> Reporter: Suresh Thalamati
> Assigned To: Myrna van Lunteren
> Priority: Minor
> Fix For: 10.3.0.0
>
>
> Time: 1,021.188
> There was 1 failure:
> 1) testStreams(org.apache.derbyTesting.functionTests.tests.lang.StreamsTest)junit.framework.AssertionFailedError: FAILED!! level difference not expected since streams are materialized. expected:<48> but was:<49>
> at org.apache.derbyTesting.functionTests.tests.lang.StreamsTest.testStreams(StreamsTest.java:118)
> at java.lang.reflect.AccessibleObject.invokeV(AccessibleObject.java:205)
> at org.apache.derbyTesting.junit.BaseTestCase.runBare(BaseTestCase.java:76)
> at junit.extensions.TestDecorator.basicRun(TestDecorator.java:22)
> at junit.extensions.TestSetup$1.protect(TestSetup.java:19)
> at junit.extensions.TestSetup.run(TestSetup.java:23)
> at junit.extensions.TestDecorator.basicRun(TestDecorator.java:22)
> at junit.extensions.TestSetup$1.protect(TestSetup.java:19)
> at junit.extensions.TestSetup.run(TestSetup.java:23)
> FAILURES!!!
> Tests run: 1285, Failures: 1, Errors: 0
--
This message is automatically generated by JIRA.
-
You can reply to this email to add a comment to the issue online.
[jira] Resolved: (DERBY-2318)
testStreams(org.apache.derbyTesting.functionTests.tests.lang.StreamsTest)
failed on weme6.1 jvm/
Posted by "Daniel John Debrunner (JIRA)" <ji...@apache.org>.
[ https://issues.apache.org/jira/browse/DERBY-2318?page=com.atlassian.jira.plugin.system.issuetabpanels:all-tabpanel ]
Daniel John Debrunner resolved DERBY-2318.
------------------------------------------
Resolution: Fixed
Fix Version/s: 10.3.0.0
Test passes for me.
> testStreams(org.apache.derbyTesting.functionTests.tests.lang.StreamsTest) failed on weme6.1 jvm/
> -------------------------------------------------------------------------------------------------
>
> Key: DERBY-2318
> URL: https://issues.apache.org/jira/browse/DERBY-2318
> Project: Derby
> Issue Type: Test
> Affects Versions: 10.3.0.0
> Environment: Java Version: J2ME Foundation Specification v1.1
> Java Vendor: IBM Corporation
> Java home: c:\jartest\weme6.1
> Reporter: Suresh Thalamati
> Assigned To: Daniel John Debrunner
> Priority: Minor
> Fix For: 10.3.0.0
>
>
> Time: 1,021.188
> There was 1 failure:
> 1) testStreams(org.apache.derbyTesting.functionTests.tests.lang.StreamsTest)junit.framework.AssertionFailedError: FAILED!! level difference not expected since streams are materialized. expected:<48> but was:<49>
> at org.apache.derbyTesting.functionTests.tests.lang.StreamsTest.testStreams(StreamsTest.java:118)
> at java.lang.reflect.AccessibleObject.invokeV(AccessibleObject.java:205)
> at org.apache.derbyTesting.junit.BaseTestCase.runBare(BaseTestCase.java:76)
> at junit.extensions.TestDecorator.basicRun(TestDecorator.java:22)
> at junit.extensions.TestSetup$1.protect(TestSetup.java:19)
> at junit.extensions.TestSetup.run(TestSetup.java:23)
> at junit.extensions.TestDecorator.basicRun(TestDecorator.java:22)
> at junit.extensions.TestSetup$1.protect(TestSetup.java:19)
> at junit.extensions.TestSetup.run(TestSetup.java:23)
> FAILURES!!!
> Tests run: 1285, Failures: 1, Errors: 0
--
This message is automatically generated by JIRA.
-
You can reply to this email to add a comment to the issue online.
[jira] Commented: (DERBY-2318)
testStreams(org.apache.derbyTesting.functionTests.tests.lang.StreamsTest)
failed on weme6.1 jvm/
Posted by "Kathey Marsden (JIRA)" <ji...@apache.org>.
[ https://issues.apache.org/jira/browse/DERBY-2318?page=com.atlassian.jira.plugin.system.issuetabpanels:comment-tabpanel&focusedCommentId=12882760#action_12882760 ]
Kathey Marsden commented on DERBY-2318:
---------------------------------------
I am seeing an incarnation of this failure with a new jvm. I am actually having a tough time seeing the difference between the two stack traces and it was passing on trunk and failing on 10.3. I think I will clean up the whereAmI() method to just get the StackTraceElements once and then see if if the problem becomes more apparent.
.readerStackLevel:45
java.lang.Throwable
at org.apache.derbyTesting.functionTests.tests.lang.DummyReader.whereAmI(StreamsTest.java:318)
at org.apache.derbyTesting.functionTests.tests.lang.DummyReader.read(StreamsTest.java:327)
at org.apache.derby.iapi.services.io.LimitReader.read(LimitReader.java:57)
at org.apache.derby.iapi.types.ReaderToUTF8Stream.fillBuffer(ReaderToUTF8Stream.java:244)
at org.apache.derby.iapi.types.ReaderToUTF8Stream.read(ReaderToUTF8Stream.java:190)
at java.io.DataInputStream.readToBuff(DataInputStream.java:154)
at java.io.DataInputStream.readUnsignedShort(DataInputStream.java:410)
at org.apache.derby.iapi.types.SQLChar.readExternal(SQLChar.java:894)
at org.apache.derby.iapi.types.SQLChar.getString(SQLChar.java:640)
at org.apache.derby.iapi.types.SQLVarchar.normalize(SQLVarchar.java:150)
at org.apache.derby.iapi.types.DataTypeDescriptor.normalize(DataTypeDescriptor.java:469)
at org.apache.derby.impl.sql.execute.NormalizeResultSet.normalizeRow(NormalizeResultSet.java:330)
at org.apache.derby.impl.sql.execute.NormalizeResultSet.getNextRowCore(NormalizeResultSet.java:189)
at org.apache.derby.impl.sql.execute.DMLWriteResultSet.getNextRowCore(DMLWriteResultSet.java:127)
at org.apache.derby.impl.sql.execute.InsertResultSet.open(InsertResultSet.java:496)
at org.apache.derby.impl.sql.GenericPreparedStatement.execute(GenericPreparedStatement.java:370)
at org.apache.derby.impl.jdbc.EmbedStatement.executeStatement(EmbedStatement.java:1203)
at org.apache.derby.impl.jdbc.EmbedPreparedStatement.executeStatement(EmbedPreparedStatement.java:1653)
at org.apache.derby.impl.jdbc.EmbedPreparedStatement.executeUpdate(EmbedPreparedStatement.java:299)
at org.apache.derbyTesting.functionTests.tests.lang.StreamsTest.insertLongString(StreamsTest.java:267)
at org.apache.derbyTesting.functionTests.tests.lang.StreamsTest.testStreams(StreamsTest.java:118)
at java.lang.reflect.Method.invokeImpl(Native Method)
at java.lang.reflect.Method.invoke(Method.java:228)
at junit.framework.TestCase.runTest(TestCase.java:154)
at junit.framework.TestCase.runBare(TestCase.java:127)
at org.apache.derbyTesting.junit.BaseTestCase.runBare(BaseTestCase.java:99)
at junit.framework.TestResult$1.protect(TestResult.java:106)
at junit.framework.TestResult.runProtected(TestResult.java:124)
at junit.framework.TestResult.run(TestResult.java:109)
at junit.framework.TestCase.run(TestCase.java:118)
at junit.framework.TestSuite.runTest(TestSuite.java:208)
at junit.framework.TestSuite.run(TestSuite.java:203)
at junit.extensions.TestDecorator.basicRun(TestDecorator.java:22)
at junit.extensions.TestSetup$1.protect(TestSetup.java:19)
at junit.framework.TestResult.runProtected(TestResult.java:124)
at junit.extensions.TestSetup.run(TestSetup.java:23)
at org.apache.derbyTesting.junit.BaseTestSetup.run(BaseTestSetup.java:57)
at junit.extensions.TestDecorator.basicRun(TestDecorator.java:22)
at junit.extensions.TestSetup$1.protect(TestSetup.java:19)
at junit.framework.TestResult.runProtected(TestResult.java:124)
at junit.extensions.TestSetup.run(TestSetup.java:23)
at org.apache.derbyTesting.junit.BaseTestSetup.run(BaseTestSetup.java:57)
at junit.textui.TestRunner.doRun(TestRunner.java:116)
at junit.textui.TestRunner.start(TestRunner.java:172)
at junit.textui.TestRunner.main(TestRunner.java:138)
readerStackLevel:46
java.lang.Throwable
at org.apache.derbyTesting.functionTests.tests.lang.DummyReader.whereAmI(StreamsTest.java:318)
at org.apache.derbyTesting.functionTests.tests.lang.DummyReader.read(StreamsTest.java:327)
at org.apache.derby.iapi.services.io.LimitReader.read(LimitReader.java:57)
at org.apache.derby.iapi.types.ReaderToUTF8Stream.fillBuffer(ReaderToUTF8Stream.java:244)
at org.apache.derby.iapi.types.ReaderToUTF8Stream.read(ReaderToUTF8Stream.java:190)
at java.io.DataInputStream.readToBuff(DataInputStream.java:154)
at java.io.DataInputStream.readUnsignedShort(DataInputStream.java:410)
at org.apache.derby.iapi.types.SQLChar.readExternal(SQLChar.java:894)
at org.apache.derby.iapi.types.SQLChar.getString(SQLChar.java:640)
at org.apache.derby.iapi.types.SQLVarchar.normalize(SQLVarchar.java:150)
at org.apache.derby.iapi.types.DataTypeDescriptor.normalize(DataTypeDescriptor.java:469)
at org.apache.derby.impl.sql.execute.NormalizeResultSet.normalizeRow(NormalizeResultSet.java:330)
at org.apache.derby.impl.sql.execute.NormalizeResultSet.getNextRowCore(NormalizeResultSet.java:189)
at org.apache.derby.impl.sql.execute.DMLWriteResultSet.getNextRowCore(DMLWriteResultSet.java:127)
at org.apache.derby.impl.sql.execute.InsertResultSet.open(InsertResultSet.java:496)
at org.apache.derby.impl.sql.GenericPreparedStatement.execute(GenericPreparedStatement.java:370)
at org.apache.derby.impl.jdbc.EmbedStatement.executeStatement(EmbedStatement.java:1203)
at org.apache.derby.impl.jdbc.EmbedPreparedStatement.executeStatement(EmbedPreparedStatement.java:1653)
at org.apache.derby.impl.jdbc.EmbedPreparedStatement.executeUpdate(EmbedPreparedStatement.java:299)
at org.apache.derbyTesting.functionTests.tests.lang.StreamsTest.insertLongString(StreamsTest.java:267)
at org.apache.derbyTesting.functionTests.tests.lang.StreamsTest.testStreams(StreamsTest.java:123)
at java.lang.reflect.Method.invokeImpl(Native Method)
at java.lang.reflect.Method.invoke(Method.java:228)
at junit.framework.TestCase.runTest(TestCase.java:154)
at junit.framework.TestCase.runBare(TestCase.java:127)
at org.apache.derbyTesting.junit.BaseTestCase.runBare(BaseTestCase.java:99)
at junit.framework.TestResult$1.protect(TestResult.java:106)
at junit.framework.TestResult.runProtected(TestResult.java:124)
at junit.framework.TestResult.run(TestResult.java:109)
at junit.framework.TestCase.run(TestCase.java:118)
at junit.framework.TestSuite.runTest(TestSuite.java:208)
at junit.framework.TestSuite.run(TestSuite.java:203)
at junit.extensions.TestDecorator.basicRun(TestDecorator.java:22)
at junit.extensions.TestSetup$1.protect(TestSetup.java:19)
at junit.framework.TestResult.runProtected(TestResult.java:124)
at junit.extensions.TestSetup.run(TestSetup.java:23)
at org.apache.derbyTesting.junit.BaseTestSetup.run(BaseTestSetup.java:57)
at junit.extensions.TestDecorator.basicRun(TestDecorator.java:22)
at junit.extensions.TestSetup$1.protect(TestSetup.java:19)
at junit.framework.TestResult.runProtected(TestResult.java:124)
at junit.extensions.TestSetup.run(TestSetup.java:23)
at org.apache.derbyTesting.junit.BaseTestSetup.run(BaseTestSetup.java:57)
at junit.textui.TestRunner.doRun(TestRunner.java:116)
at junit.textui.TestRunner.start(TestRunner.java:172)
at junit.textui.TestRunner.main(TestRunner.java:138)
testStreams used 62 ms F
Time: 3.422
There was 1 failure:
1) testStreams(org.apache.derbyTesting.functionTests.tests.lang.StreamsTest)junit.framework.AssertionFailedError: FAILED!! level difference not expected since streams are materialized. expected:<45> but was:<46>
at org.apache.derbyTesting.functionTests.tests.lang.StreamsTest.testStreams(StreamsTest.java:125)
at java.lang.reflect.Method.invokeImpl(Native Method)
at org.apache.derbyTesting.junit.BaseTestCase.runBare(BaseTestCase.java:99)
at junit.extensions.TestDecorator.basicRun(TestDecorator.java:22)
at junit.extensions.TestSetup$1.protect(TestSetup.java:19)
at junit.extensions.TestSetup.run(TestSetup.java:23)
at org.apache.derbyTesting.junit.BaseTestSetup.run(BaseTestSetup.java:57)
at junit.extensions.TestDecorator.basicRun(TestDecorator.java:22)
at junit.extensions.TestSetup$1.protect(TestSetup.java:19)
at junit.extensions.TestSetup.run(TestSetup.java:23)
at org.apache.derbyTesting.junit.BaseTestSetup.run(BaseTestSetup.java:57)
> testStreams(org.apache.derbyTesting.functionTests.tests.lang.StreamsTest) failed on weme6.1 jvm/
> -------------------------------------------------------------------------------------------------
>
> Key: DERBY-2318
> URL: https://issues.apache.org/jira/browse/DERBY-2318
> Project: Derby
> Issue Type: Bug
> Components: Test
> Affects Versions: 10.3.1.4
> Environment: Java Version: J2ME Foundation Specification v1.1
> Java Vendor: IBM Corporation
> Java home: c:\jartest\weme6.1
> Reporter: Suresh Thalamati
> Assignee: Myrna van Lunteren
> Priority: Minor
> Fix For: 10.3.1.4
>
>
> Time: 1,021.188
> There was 1 failure:
> 1) testStreams(org.apache.derbyTesting.functionTests.tests.lang.StreamsTest)junit.framework.AssertionFailedError: FAILED!! level difference not expected since streams are materialized. expected:<48> but was:<49>
> at org.apache.derbyTesting.functionTests.tests.lang.StreamsTest.testStreams(StreamsTest.java:118)
> at java.lang.reflect.AccessibleObject.invokeV(AccessibleObject.java:205)
> at org.apache.derbyTesting.junit.BaseTestCase.runBare(BaseTestCase.java:76)
> at junit.extensions.TestDecorator.basicRun(TestDecorator.java:22)
> at junit.extensions.TestSetup$1.protect(TestSetup.java:19)
> at junit.extensions.TestSetup.run(TestSetup.java:23)
> at junit.extensions.TestDecorator.basicRun(TestDecorator.java:22)
> at junit.extensions.TestSetup$1.protect(TestSetup.java:19)
> at junit.extensions.TestSetup.run(TestSetup.java:23)
> FAILURES!!!
> Tests run: 1285, Failures: 1, Errors: 0
--
This message is automatically generated by JIRA.
-
You can reply to this email to add a comment to the issue online.
[jira] Commented: (DERBY-2318)
testStreams(org.apache.derbyTesting.functionTests.tests.lang.StreamsTest)
failed on weme6.1 jvm/
Posted by "Rajesh Kartha (JIRA)" <ji...@apache.org>.
[ https://issues.apache.org/jira/browse/DERBY-2318?page=com.atlassian.jira.plugin.system.issuetabpanels:comment-tabpanel#action_12474859 ]
Rajesh Kartha commented on DERBY-2318:
--------------------------------------
Observed the same failure that Suresh mentioned above on ibm15. The issue on ibm15 and weme 6.1 seems to be same, maybe for now we can disable this test for these two platforms.
> testStreams(org.apache.derbyTesting.functionTests.tests.lang.StreamsTest) failed on weme6.1 jvm/
> -------------------------------------------------------------------------------------------------
>
> Key: DERBY-2318
> URL: https://issues.apache.org/jira/browse/DERBY-2318
> Project: Derby
> Issue Type: Test
> Affects Versions: 10.3.0.0
> Environment: Java Version: J2ME Foundation Specification v1.1
> Java Vendor: IBM Corporation
> Java home: c:\jartest\weme6.1
> Reporter: Suresh Thalamati
> Assigned To: Myrna van Lunteren
> Priority: Minor
> Fix For: 10.3.0.0
>
>
> Time: 1,021.188
> There was 1 failure:
> 1) testStreams(org.apache.derbyTesting.functionTests.tests.lang.StreamsTest)junit.framework.AssertionFailedError: FAILED!! level difference not expected since streams are materialized. expected:<48> but was:<49>
> at org.apache.derbyTesting.functionTests.tests.lang.StreamsTest.testStreams(StreamsTest.java:118)
> at java.lang.reflect.AccessibleObject.invokeV(AccessibleObject.java:205)
> at org.apache.derbyTesting.junit.BaseTestCase.runBare(BaseTestCase.java:76)
> at junit.extensions.TestDecorator.basicRun(TestDecorator.java:22)
> at junit.extensions.TestSetup$1.protect(TestSetup.java:19)
> at junit.extensions.TestSetup.run(TestSetup.java:23)
> at junit.extensions.TestDecorator.basicRun(TestDecorator.java:22)
> at junit.extensions.TestSetup$1.protect(TestSetup.java:19)
> at junit.extensions.TestSetup.run(TestSetup.java:23)
> FAILURES!!!
> Tests run: 1285, Failures: 1, Errors: 0
--
This message is automatically generated by JIRA.
-
You can reply to this email to add a comment to the issue online.
[jira] Reopened: (DERBY-2318)
testStreams(org.apache.derbyTesting.functionTests.tests.lang.StreamsTest)
failed on weme6.1 jvm/
Posted by "Suresh Thalamati (JIRA)" <ji...@apache.org>.
[ https://issues.apache.org/jira/browse/DERBY-2318?page=com.atlassian.jira.plugin.system.issuetabpanels:all-tabpanel ]
Suresh Thalamati reopened DERBY-2318:
-------------------------------------
It is still failing on the ibm nightly result runs on weme6.1, with the same error.
> testStreams(org.apache.derbyTesting.functionTests.tests.lang.StreamsTest) failed on weme6.1 jvm/
> -------------------------------------------------------------------------------------------------
>
> Key: DERBY-2318
> URL: https://issues.apache.org/jira/browse/DERBY-2318
> Project: Derby
> Issue Type: Test
> Affects Versions: 10.3.0.0
> Environment: Java Version: J2ME Foundation Specification v1.1
> Java Vendor: IBM Corporation
> Java home: c:\jartest\weme6.1
> Reporter: Suresh Thalamati
> Assigned To: Daniel John Debrunner
> Priority: Minor
> Fix For: 10.3.0.0
>
>
> Time: 1,021.188
> There was 1 failure:
> 1) testStreams(org.apache.derbyTesting.functionTests.tests.lang.StreamsTest)junit.framework.AssertionFailedError: FAILED!! level difference not expected since streams are materialized. expected:<48> but was:<49>
> at org.apache.derbyTesting.functionTests.tests.lang.StreamsTest.testStreams(StreamsTest.java:118)
> at java.lang.reflect.AccessibleObject.invokeV(AccessibleObject.java:205)
> at org.apache.derbyTesting.junit.BaseTestCase.runBare(BaseTestCase.java:76)
> at junit.extensions.TestDecorator.basicRun(TestDecorator.java:22)
> at junit.extensions.TestSetup$1.protect(TestSetup.java:19)
> at junit.extensions.TestSetup.run(TestSetup.java:23)
> at junit.extensions.TestDecorator.basicRun(TestDecorator.java:22)
> at junit.extensions.TestSetup$1.protect(TestSetup.java:19)
> at junit.extensions.TestSetup.run(TestSetup.java:23)
> FAILURES!!!
> Tests run: 1285, Failures: 1, Errors: 0
--
This message is automatically generated by JIRA.
-
You can reply to this email to add a comment to the issue online.
[jira] Updated: (DERBY-2318)
testStreams(org.apache.derbyTesting.functionTests.tests.lang.StreamsTest)
failed on weme6.1 jvm/
Posted by "Myrna van Lunteren (JIRA)" <ji...@apache.org>.
[ https://issues.apache.org/jira/browse/DERBY-2318?page=com.atlassian.jira.plugin.system.issuetabpanels:all-tabpanel ]
Myrna van Lunteren updated DERBY-2318:
--------------------------------------
Component/s: Test
> testStreams(org.apache.derbyTesting.functionTests.tests.lang.StreamsTest) failed on weme6.1 jvm/
> -------------------------------------------------------------------------------------------------
>
> Key: DERBY-2318
> URL: https://issues.apache.org/jira/browse/DERBY-2318
> Project: Derby
> Issue Type: Test
> Components: Test
> Affects Versions: 10.3.0.0
> Environment: Java Version: J2ME Foundation Specification v1.1
> Java Vendor: IBM Corporation
> Java home: c:\jartest\weme6.1
> Reporter: Suresh Thalamati
> Assigned To: Myrna van Lunteren
> Priority: Minor
> Fix For: 10.3.0.0
>
>
> Time: 1,021.188
> There was 1 failure:
> 1) testStreams(org.apache.derbyTesting.functionTests.tests.lang.StreamsTest)junit.framework.AssertionFailedError: FAILED!! level difference not expected since streams are materialized. expected:<48> but was:<49>
> at org.apache.derbyTesting.functionTests.tests.lang.StreamsTest.testStreams(StreamsTest.java:118)
> at java.lang.reflect.AccessibleObject.invokeV(AccessibleObject.java:205)
> at org.apache.derbyTesting.junit.BaseTestCase.runBare(BaseTestCase.java:76)
> at junit.extensions.TestDecorator.basicRun(TestDecorator.java:22)
> at junit.extensions.TestSetup$1.protect(TestSetup.java:19)
> at junit.extensions.TestSetup.run(TestSetup.java:23)
> at junit.extensions.TestDecorator.basicRun(TestDecorator.java:22)
> at junit.extensions.TestSetup$1.protect(TestSetup.java:19)
> at junit.extensions.TestSetup.run(TestSetup.java:23)
> FAILURES!!!
> Tests run: 1285, Failures: 1, Errors: 0
--
This message is automatically generated by JIRA.
-
You can reply to this email to add a comment to the issue online.
[jira] Commented: (DERBY-2318)
testStreams(org.apache.derbyTesting.functionTests.tests.lang.StreamsTest)
failed on weme6.1 jvm/
Posted by "Myrna van Lunteren (JIRA)" <ji...@apache.org>.
[ https://issues.apache.org/jira/browse/DERBY-2318?page=com.atlassian.jira.plugin.system.issuetabpanels:comment-tabpanel#action_12473533 ]
Myrna van Lunteren commented on DERBY-2318:
-------------------------------------------
I'll take a look at this, see what I can see.
> testStreams(org.apache.derbyTesting.functionTests.tests.lang.StreamsTest) failed on weme6.1 jvm/
> -------------------------------------------------------------------------------------------------
>
> Key: DERBY-2318
> URL: https://issues.apache.org/jira/browse/DERBY-2318
> Project: Derby
> Issue Type: Test
> Affects Versions: 10.3.0.0
> Environment: Java Version: J2ME Foundation Specification v1.1
> Java Vendor: IBM Corporation
> Java home: c:\jartest\weme6.1
> Reporter: Suresh Thalamati
> Assigned To: Myrna van Lunteren
> Priority: Minor
> Fix For: 10.3.0.0
>
>
> Time: 1,021.188
> There was 1 failure:
> 1) testStreams(org.apache.derbyTesting.functionTests.tests.lang.StreamsTest)junit.framework.AssertionFailedError: FAILED!! level difference not expected since streams are materialized. expected:<48> but was:<49>
> at org.apache.derbyTesting.functionTests.tests.lang.StreamsTest.testStreams(StreamsTest.java:118)
> at java.lang.reflect.AccessibleObject.invokeV(AccessibleObject.java:205)
> at org.apache.derbyTesting.junit.BaseTestCase.runBare(BaseTestCase.java:76)
> at junit.extensions.TestDecorator.basicRun(TestDecorator.java:22)
> at junit.extensions.TestSetup$1.protect(TestSetup.java:19)
> at junit.extensions.TestSetup.run(TestSetup.java:23)
> at junit.extensions.TestDecorator.basicRun(TestDecorator.java:22)
> at junit.extensions.TestSetup$1.protect(TestSetup.java:19)
> at junit.extensions.TestSetup.run(TestSetup.java:23)
> FAILURES!!!
> Tests run: 1285, Failures: 1, Errors: 0
--
This message is automatically generated by JIRA.
-
You can reply to this email to add a comment to the issue online.
[jira] Commented: (DERBY-2318)
testStreams(org.apache.derbyTesting.functionTests.tests.lang.StreamsTest)
failed on weme6.1 jvm/
Posted by "Kathey Marsden (JIRA)" <ji...@apache.org>.
[ https://issues.apache.org/jira/browse/DERBY-2318?page=com.atlassian.jira.plugin.system.issuetabpanels:comment-tabpanel&focusedCommentId=12883219#action_12883219 ]
Kathey Marsden commented on DERBY-2318:
---------------------------------------
When I changed the test to generate the StackElements just ones the failure went away, so I just backported that fix.
> testStreams(org.apache.derbyTesting.functionTests.tests.lang.StreamsTest) failed on weme6.1 jvm/
> -------------------------------------------------------------------------------------------------
>
> Key: DERBY-2318
> URL: https://issues.apache.org/jira/browse/DERBY-2318
> Project: Derby
> Issue Type: Bug
> Components: Test
> Affects Versions: 10.3.1.4
> Environment: Java Version: J2ME Foundation Specification v1.1
> Java Vendor: IBM Corporation
> Java home: c:\jartest\weme6.1
> Reporter: Suresh Thalamati
> Assignee: Myrna van Lunteren
> Priority: Minor
> Fix For: 10.3.1.4
>
>
> Time: 1,021.188
> There was 1 failure:
> 1) testStreams(org.apache.derbyTesting.functionTests.tests.lang.StreamsTest)junit.framework.AssertionFailedError: FAILED!! level difference not expected since streams are materialized. expected:<48> but was:<49>
> at org.apache.derbyTesting.functionTests.tests.lang.StreamsTest.testStreams(StreamsTest.java:118)
> at java.lang.reflect.AccessibleObject.invokeV(AccessibleObject.java:205)
> at org.apache.derbyTesting.junit.BaseTestCase.runBare(BaseTestCase.java:76)
> at junit.extensions.TestDecorator.basicRun(TestDecorator.java:22)
> at junit.extensions.TestSetup$1.protect(TestSetup.java:19)
> at junit.extensions.TestSetup.run(TestSetup.java:23)
> at junit.extensions.TestDecorator.basicRun(TestDecorator.java:22)
> at junit.extensions.TestSetup$1.protect(TestSetup.java:19)
> at junit.extensions.TestSetup.run(TestSetup.java:23)
> FAILURES!!!
> Tests run: 1285, Failures: 1, Errors: 0
--
This message is automatically generated by JIRA.
-
You can reply to this email to add a comment to the issue online.
[jira] Commented: (DERBY-2318)
testStreams(org.apache.derbyTesting.functionTests.tests.lang.StreamsTest)
failed on weme6.1 jvm/
Posted by "Suresh Thalamati (JIRA)" <ji...@apache.org>.
[ https://issues.apache.org/jira/browse/DERBY-2318?page=com.atlassian.jira.plugin.system.issuetabpanels:comment-tabpanel#action_12473807 ]
Suresh Thalamati commented on DERBY-2318:
-----------------------------------------
This test also failed on one of the iibm15 jvm runs:
5) testStreams(org.apache.derbyTesting.functionTests.tests.lang.StreamsTest)junit.framework.AssertionFailedError: FAILED!! level difference not expected since streams are materialized. expected:<50> but was:<51>
at org.apache.derbyTesting.functionTests.tests.lang.StreamsTest.testStreams(StreamsTest.java:125)
at sun.reflect.NativeMethodAccessorImpl.invoke0(Native Method)
at sun.reflect.NativeMethodAccessorImpl.invoke(NativeMethodAccessorImpl.java:64)
at sun.reflect.DelegatingMethodAccessorImpl.invoke(DelegatingMethodAccessorImpl.java:43)
at org.apache.derbyTesting.junit.BaseTestCase.runBare(BaseTestCase.java:76)
at junit.extensions.TestDecorator.basicRun(TestDecorator.java:22)
at junit.extensions.TestSetup$1.protect(TestSetup.java:19)
at junit.extensions.TestSetup.run(TestSetup.java:23)
at junit.extensions.TestDecorator.basicRun(TestDecorator.java:22)
at junit.extensions.TestSetup$1.protect(TestSetup.java:19)
at junit.extensions.TestSetup.run(TestSetup.java:23)
> testStreams(org.apache.derbyTesting.functionTests.tests.lang.StreamsTest) failed on weme6.1 jvm/
> -------------------------------------------------------------------------------------------------
>
> Key: DERBY-2318
> URL: https://issues.apache.org/jira/browse/DERBY-2318
> Project: Derby
> Issue Type: Test
> Affects Versions: 10.3.0.0
> Environment: Java Version: J2ME Foundation Specification v1.1
> Java Vendor: IBM Corporation
> Java home: c:\jartest\weme6.1
> Reporter: Suresh Thalamati
> Assigned To: Myrna van Lunteren
> Priority: Minor
> Fix For: 10.3.0.0
>
>
> Time: 1,021.188
> There was 1 failure:
> 1) testStreams(org.apache.derbyTesting.functionTests.tests.lang.StreamsTest)junit.framework.AssertionFailedError: FAILED!! level difference not expected since streams are materialized. expected:<48> but was:<49>
> at org.apache.derbyTesting.functionTests.tests.lang.StreamsTest.testStreams(StreamsTest.java:118)
> at java.lang.reflect.AccessibleObject.invokeV(AccessibleObject.java:205)
> at org.apache.derbyTesting.junit.BaseTestCase.runBare(BaseTestCase.java:76)
> at junit.extensions.TestDecorator.basicRun(TestDecorator.java:22)
> at junit.extensions.TestSetup$1.protect(TestSetup.java:19)
> at junit.extensions.TestSetup.run(TestSetup.java:23)
> at junit.extensions.TestDecorator.basicRun(TestDecorator.java:22)
> at junit.extensions.TestSetup$1.protect(TestSetup.java:19)
> at junit.extensions.TestSetup.run(TestSetup.java:23)
> FAILURES!!!
> Tests run: 1285, Failures: 1, Errors: 0
--
This message is automatically generated by JIRA.
-
You can reply to this email to add a comment to the issue online.
[jira] Assigned: (DERBY-2318)
testStreams(org.apache.derbyTesting.functionTests.tests.lang.StreamsTest)
failed on weme6.1 jvm/
Posted by "Daniel John Debrunner (JIRA)" <ji...@apache.org>.
[ https://issues.apache.org/jira/browse/DERBY-2318?page=com.atlassian.jira.plugin.system.issuetabpanels:all-tabpanel ]
Daniel John Debrunner reassigned DERBY-2318:
--------------------------------------------
Assignee: Daniel John Debrunner
> testStreams(org.apache.derbyTesting.functionTests.tests.lang.StreamsTest) failed on weme6.1 jvm/
> -------------------------------------------------------------------------------------------------
>
> Key: DERBY-2318
> URL: https://issues.apache.org/jira/browse/DERBY-2318
> Project: Derby
> Issue Type: Test
> Affects Versions: 10.3.0.0
> Environment: Java Version: J2ME Foundation Specification v1.1
> Java Vendor: IBM Corporation
> Java home: c:\jartest\weme6.1
> Reporter: Suresh Thalamati
> Assigned To: Daniel John Debrunner
> Priority: Minor
>
> Time: 1,021.188
> There was 1 failure:
> 1) testStreams(org.apache.derbyTesting.functionTests.tests.lang.StreamsTest)junit.framework.AssertionFailedError: FAILED!! level difference not expected since streams are materialized. expected:<48> but was:<49>
> at org.apache.derbyTesting.functionTests.tests.lang.StreamsTest.testStreams(StreamsTest.java:118)
> at java.lang.reflect.AccessibleObject.invokeV(AccessibleObject.java:205)
> at org.apache.derbyTesting.junit.BaseTestCase.runBare(BaseTestCase.java:76)
> at junit.extensions.TestDecorator.basicRun(TestDecorator.java:22)
> at junit.extensions.TestSetup$1.protect(TestSetup.java:19)
> at junit.extensions.TestSetup.run(TestSetup.java:23)
> at junit.extensions.TestDecorator.basicRun(TestDecorator.java:22)
> at junit.extensions.TestSetup$1.protect(TestSetup.java:19)
> at junit.extensions.TestSetup.run(TestSetup.java:23)
> FAILURES!!!
> Tests run: 1285, Failures: 1, Errors: 0
--
This message is automatically generated by JIRA.
-
You can reply to this email to add a comment to the issue online.
[jira] Closed: (DERBY-2318)
testStreams(org.apache.derbyTesting.functionTests.tests.lang.StreamsTest)
failed on weme6.1 jvm/
Posted by "Myrna van Lunteren (JIRA)" <ji...@apache.org>.
[ https://issues.apache.org/jira/browse/DERBY-2318?page=com.atlassian.jira.plugin.system.issuetabpanels:all-tabpanel ]
Myrna van Lunteren closed DERBY-2318.
-------------------------------------
Resolution: Fixed
> testStreams(org.apache.derbyTesting.functionTests.tests.lang.StreamsTest) failed on weme6.1 jvm/
> -------------------------------------------------------------------------------------------------
>
> Key: DERBY-2318
> URL: https://issues.apache.org/jira/browse/DERBY-2318
> Project: Derby
> Issue Type: Test
> Components: Test
> Affects Versions: 10.3.0.0
> Environment: Java Version: J2ME Foundation Specification v1.1
> Java Vendor: IBM Corporation
> Java home: c:\jartest\weme6.1
> Reporter: Suresh Thalamati
> Assigned To: Myrna van Lunteren
> Priority: Minor
> Fix For: 10.3.0.0
>
>
> Time: 1,021.188
> There was 1 failure:
> 1) testStreams(org.apache.derbyTesting.functionTests.tests.lang.StreamsTest)junit.framework.AssertionFailedError: FAILED!! level difference not expected since streams are materialized. expected:<48> but was:<49>
> at org.apache.derbyTesting.functionTests.tests.lang.StreamsTest.testStreams(StreamsTest.java:118)
> at java.lang.reflect.AccessibleObject.invokeV(AccessibleObject.java:205)
> at org.apache.derbyTesting.junit.BaseTestCase.runBare(BaseTestCase.java:76)
> at junit.extensions.TestDecorator.basicRun(TestDecorator.java:22)
> at junit.extensions.TestSetup$1.protect(TestSetup.java:19)
> at junit.extensions.TestSetup.run(TestSetup.java:23)
> at junit.extensions.TestDecorator.basicRun(TestDecorator.java:22)
> at junit.extensions.TestSetup$1.protect(TestSetup.java:19)
> at junit.extensions.TestSetup.run(TestSetup.java:23)
> FAILURES!!!
> Tests run: 1285, Failures: 1, Errors: 0
--
This message is automatically generated by JIRA.
-
You can reply to this email to add a comment to the issue online.