You are viewing a plain text version of this content. The canonical link for it is here.
Posted to dev@zookeeper.apache.org by Apache Jenkins Server <je...@builds.apache.org> on 2016/05/18 10:18:51 UTC

ZooKeeper_branch35_openjdk7 - Build # 85 - Failure

See https://builds.apache.org/job/ZooKeeper_branch35_openjdk7/85/

###################################################################################
########################## LAST 60 LINES OF THE CONSOLE ###########################
[...truncated 1523 lines...]
[ivy:retrieve] downloading http://repo1.maven.org/maven2/log4j/log4j/1.2.17/log4j-1.2.17.jar ...
[ivy:retrieve] ................ (478kB)
[ivy:retrieve] .. (0kB)
[ivy:retrieve] 	[SUCCESSFUL ] log4j#log4j;1.2.17!log4j.jar(bundle) (12ms)
[ivy:retrieve] downloading http://repo1.maven.org/maven2/io/netty/netty/3.10.5.Final/netty-3.10.5.Final.jar ...
[ivy:retrieve] ................................ (1299kB)
[ivy:retrieve] .. (0kB)
[ivy:retrieve] 	[SUCCESSFUL ] io.netty#netty;3.10.5.Final!netty.jar (23ms)
[ivy:retrieve] downloading http://repo1.maven.org/maven2/net/java/dev/javacc/javacc/5.0/javacc-5.0.jar ...
[ivy:retrieve] ...... (291kB)
[ivy:retrieve] .. (0kB)
[ivy:retrieve] 	[SUCCESSFUL ] net.java.dev.javacc#javacc;5.0!javacc.jar (10ms)
[ivy:retrieve] :: resolution report :: resolve 4137ms :: artifacts dl 164ms
	---------------------------------------------------------------------
	|                  |            modules            ||   artifacts   |
	|       conf       | number| search|dwnlded|evicted|| number|dwnlded|
	---------------------------------------------------------------------
	|      default     |   12  |   12  |   12  |   0   ||   12  |   12  |
	---------------------------------------------------------------------
[ivy:retrieve] :: retrieving :: org.apache.zookeeper#zookeeper
[ivy:retrieve] 	confs: [default]
[ivy:retrieve] 	12 artifacts copied, 0 already retrieved (4167kB/29ms)

clover.setup:

clover.info:

clover:

generate_jute_parser:
    [mkdir] Created dir: /home/jenkins/jenkins-slave/workspace/ZooKeeper_branch35_openjdk7/branch-3.5/build/jute_compiler/org/apache/jute/compiler/generated
[ivy:artifactproperty] DEPRECATED: 'ivy.conf.file' is deprecated, use 'ivy.settings.file' instead
[ivy:artifactproperty] :: loading settings :: file = /home/jenkins/jenkins-slave/workspace/ZooKeeper_branch35_openjdk7/branch-3.5/ivysettings.xml
     [move] Moving 1 file to /home/jenkins/jenkins-slave/workspace/ZooKeeper_branch35_openjdk7/branch-3.5/build/lib
   [javacc] Java Compiler Compiler Version 5.0 (Parser Generator)
   [javacc] (type "javacc" with no arguments for help)
   [javacc] Reading from file /home/jenkins/jenkins-slave/workspace/ZooKeeper_branch35_openjdk7/branch-3.5/src/java/main/org/apache/jute/compiler/generated/rcc.jj . . .
   [javacc] File "TokenMgrError.java" does not exist.  Will create one.
   [javacc] File "ParseException.java" does not exist.  Will create one.
   [javacc] File "Token.java" does not exist.  Will create one.
   [javacc] File "SimpleCharStream.java" does not exist.  Will create one.
   [javacc] Parser generated successfully.

jute:

BUILD FAILED
/home/jenkins/jenkins-slave/workspace/ZooKeeper_branch35_openjdk7/branch-3.5/build.xml:1322: The following error occurred while executing this line:
/home/jenkins/jenkins-slave/workspace/ZooKeeper_branch35_openjdk7/branch-3.5/build.xml:272: Unable to find a javac compiler;
com.sun.tools.javac.Main is not on the classpath.
Perhaps JAVA_HOME does not point to the JDK.
It is currently set to "/usr/lib/jvm/java-7-openjdk-amd64/jre"

Total time: 7 seconds
Build step 'Invoke Ant' marked build as failure
Archiving artifacts
Recording test results
ERROR: Step ‘Publish JUnit test result report’ failed: No test report files were found. Configuration error?
Email was triggered for: Failure - Any
Sending email for trigger: Failure - Any



###################################################################################
############################## FAILED TESTS (if any) ##############################
No tests ran.

ZooKeeper_branch35_openjdk7 - Build # 88 - Still Failing

Posted by Apache Jenkins Server <je...@builds.apache.org>.
See https://builds.apache.org/job/ZooKeeper_branch35_openjdk7/88/

###################################################################################
########################## LAST 60 LINES OF THE CONSOLE ###########################
[...truncated 1475 lines...]
[ivy:retrieve] 	found jline#jline;2.11 in maven2
[ivy:retrieve] 	found org.mortbay.jetty#jetty;6.1.26 in maven2
[ivy:retrieve] 	found org.mortbay.jetty#jetty-util;6.1.26 in maven2
[ivy:retrieve] 	found org.mortbay.jetty#servlet-api;2.5-20081211 in maven2
[ivy:retrieve] 	found org.codehaus.jackson#jackson-mapper-asl;1.9.11 in maven2
[ivy:retrieve] 	found org.codehaus.jackson#jackson-core-asl;1.9.11 in maven2
[ivy:retrieve] 	found org.slf4j#slf4j-api;1.7.5 in maven2
[ivy:retrieve] 	found org.slf4j#slf4j-log4j12;1.7.5 in maven2
[ivy:retrieve] 	found commons-cli#commons-cli;1.2 in maven2
[ivy:retrieve] 	found log4j#log4j;1.2.17 in maven2
[ivy:retrieve] 	found io.netty#netty;3.10.5.Final in maven2
[ivy:retrieve] 	found net.java.dev.javacc#javacc;5.0 in maven2
[ivy:retrieve] :: resolution report :: resolve 438ms :: artifacts dl 16ms
	---------------------------------------------------------------------
	|                  |            modules            ||   artifacts   |
	|       conf       | number| search|dwnlded|evicted|| number|dwnlded|
	---------------------------------------------------------------------
	|      default     |   12  |   0   |   0   |   0   ||   12  |   0   |
	---------------------------------------------------------------------
[ivy:retrieve] :: retrieving :: org.apache.zookeeper#zookeeper
[ivy:retrieve] 	confs: [default]
[ivy:retrieve] 	12 artifacts copied, 0 already retrieved (4167kB/30ms)

clover.setup:

clover.info:

clover:

generate_jute_parser:
    [mkdir] Created dir: /home/jenkins/jenkins-slave/workspace/ZooKeeper_branch35_openjdk7/branch-3.5/build/jute_compiler/org/apache/jute/compiler/generated
[ivy:artifactproperty] DEPRECATED: 'ivy.conf.file' is deprecated, use 'ivy.settings.file' instead
[ivy:artifactproperty] :: loading settings :: file = /home/jenkins/jenkins-slave/workspace/ZooKeeper_branch35_openjdk7/branch-3.5/ivysettings.xml
     [move] Moving 1 file to /home/jenkins/jenkins-slave/workspace/ZooKeeper_branch35_openjdk7/branch-3.5/build/lib
   [javacc] Java Compiler Compiler Version 5.0 (Parser Generator)
   [javacc] (type "javacc" with no arguments for help)
   [javacc] Reading from file /home/jenkins/jenkins-slave/workspace/ZooKeeper_branch35_openjdk7/branch-3.5/src/java/main/org/apache/jute/compiler/generated/rcc.jj . . .
   [javacc] File "TokenMgrError.java" does not exist.  Will create one.
   [javacc] File "ParseException.java" does not exist.  Will create one.
   [javacc] File "Token.java" does not exist.  Will create one.
   [javacc] File "SimpleCharStream.java" does not exist.  Will create one.
   [javacc] Parser generated successfully.

jute:

BUILD FAILED
/home/jenkins/jenkins-slave/workspace/ZooKeeper_branch35_openjdk7/branch-3.5/build.xml:1322: The following error occurred while executing this line:
/home/jenkins/jenkins-slave/workspace/ZooKeeper_branch35_openjdk7/branch-3.5/build.xml:272: Unable to find a javac compiler;
com.sun.tools.javac.Main is not on the classpath.
Perhaps JAVA_HOME does not point to the JDK.
It is currently set to "/usr/lib/jvm/java-7-openjdk-amd64/jre"

Total time: 3 seconds
Build step 'Invoke Ant' marked build as failure
Archiving artifacts
Recording test results
ERROR: Step ‘Publish JUnit test result report’ failed: No test report files were found. Configuration error?
Email was triggered for: Failure - Any
Sending email for trigger: Failure - Any



###################################################################################
############################## FAILED TESTS (if any) ##############################
No tests ran.

ZooKeeper_branch35_openjdk7 - Build # 87 - Still Failing

Posted by Apache Jenkins Server <je...@builds.apache.org>.
See https://builds.apache.org/job/ZooKeeper_branch35_openjdk7/87/

###################################################################################
########################## LAST 60 LINES OF THE CONSOLE ###########################
[...truncated 1523 lines...]
[ivy:retrieve] downloading http://repo1.maven.org/maven2/log4j/log4j/1.2.17/log4j-1.2.17.jar ...
[ivy:retrieve] ......... (478kB)
[ivy:retrieve] .. (0kB)
[ivy:retrieve] 	[SUCCESSFUL ] log4j#log4j;1.2.17!log4j.jar(bundle) (36ms)
[ivy:retrieve] downloading http://repo1.maven.org/maven2/io/netty/netty/3.10.5.Final/netty-3.10.5.Final.jar ...
[ivy:retrieve] ........................ (1299kB)
[ivy:retrieve] .. (0kB)
[ivy:retrieve] 	[SUCCESSFUL ] io.netty#netty;3.10.5.Final!netty.jar (48ms)
[ivy:retrieve] downloading http://repo1.maven.org/maven2/net/java/dev/javacc/javacc/5.0/javacc-5.0.jar ...
[ivy:retrieve] ...... (291kB)
[ivy:retrieve] .. (0kB)
[ivy:retrieve] 	[SUCCESSFUL ] net.java.dev.javacc#javacc;5.0!javacc.jar (35ms)
[ivy:retrieve] :: resolution report :: resolve 5592ms :: artifacts dl 491ms
	---------------------------------------------------------------------
	|                  |            modules            ||   artifacts   |
	|       conf       | number| search|dwnlded|evicted|| number|dwnlded|
	---------------------------------------------------------------------
	|      default     |   12  |   12  |   12  |   0   ||   12  |   12  |
	---------------------------------------------------------------------
[ivy:retrieve] :: retrieving :: org.apache.zookeeper#zookeeper
[ivy:retrieve] 	confs: [default]
[ivy:retrieve] 	12 artifacts copied, 0 already retrieved (4167kB/39ms)

clover.setup:

clover.info:

clover:

generate_jute_parser:
    [mkdir] Created dir: /home/jenkins/jenkins-slave/workspace/ZooKeeper_branch35_openjdk7/branch-3.5/build/jute_compiler/org/apache/jute/compiler/generated
[ivy:artifactproperty] DEPRECATED: 'ivy.conf.file' is deprecated, use 'ivy.settings.file' instead
[ivy:artifactproperty] :: loading settings :: file = /home/jenkins/jenkins-slave/workspace/ZooKeeper_branch35_openjdk7/branch-3.5/ivysettings.xml
     [move] Moving 1 file to /home/jenkins/jenkins-slave/workspace/ZooKeeper_branch35_openjdk7/branch-3.5/build/lib
   [javacc] Java Compiler Compiler Version 5.0 (Parser Generator)
   [javacc] (type "javacc" with no arguments for help)
   [javacc] Reading from file /home/jenkins/jenkins-slave/workspace/ZooKeeper_branch35_openjdk7/branch-3.5/src/java/main/org/apache/jute/compiler/generated/rcc.jj . . .
   [javacc] File "TokenMgrError.java" does not exist.  Will create one.
   [javacc] File "ParseException.java" does not exist.  Will create one.
   [javacc] File "Token.java" does not exist.  Will create one.
   [javacc] File "SimpleCharStream.java" does not exist.  Will create one.
   [javacc] Parser generated successfully.

jute:

BUILD FAILED
/home/jenkins/jenkins-slave/workspace/ZooKeeper_branch35_openjdk7/branch-3.5/build.xml:1322: The following error occurred while executing this line:
/home/jenkins/jenkins-slave/workspace/ZooKeeper_branch35_openjdk7/branch-3.5/build.xml:272: Unable to find a javac compiler;
com.sun.tools.javac.Main is not on the classpath.
Perhaps JAVA_HOME does not point to the JDK.
It is currently set to "/usr/lib/jvm/java-7-openjdk-amd64/jre"

Total time: 8 seconds
Build step 'Invoke Ant' marked build as failure
Archiving artifacts
Recording test results
ERROR: Step ‘Publish JUnit test result report’ failed: No test report files were found. Configuration error?
Email was triggered for: Failure - Any
Sending email for trigger: Failure - Any



###################################################################################
############################## FAILED TESTS (if any) ##############################
No tests ran.

ZooKeeper_branch35_openjdk7 - Build # 86 - Still Failing

Posted by Apache Jenkins Server <je...@builds.apache.org>.
See https://builds.apache.org/job/ZooKeeper_branch35_openjdk7/86/

###################################################################################
########################## LAST 60 LINES OF THE CONSOLE ###########################
[...truncated 1523 lines...]
[ivy:retrieve] downloading http://repo1.maven.org/maven2/log4j/log4j/1.2.17/log4j-1.2.17.jar ...
[ivy:retrieve] ............... (478kB)
[ivy:retrieve] .. (0kB)
[ivy:retrieve] 	[SUCCESSFUL ] log4j#log4j;1.2.17!log4j.jar(bundle) (13ms)
[ivy:retrieve] downloading http://repo1.maven.org/maven2/io/netty/netty/3.10.5.Final/netty-3.10.5.Final.jar ...
[ivy:retrieve] ................................. (1299kB)
[ivy:retrieve] .. (0kB)
[ivy:retrieve] 	[SUCCESSFUL ] io.netty#netty;3.10.5.Final!netty.jar (27ms)
[ivy:retrieve] downloading http://repo1.maven.org/maven2/net/java/dev/javacc/javacc/5.0/javacc-5.0.jar ...
[ivy:retrieve] ............ (291kB)
[ivy:retrieve] .. (0kB)
[ivy:retrieve] 	[SUCCESSFUL ] net.java.dev.javacc#javacc;5.0!javacc.jar (12ms)
[ivy:retrieve] :: resolution report :: resolve 4186ms :: artifacts dl 189ms
	---------------------------------------------------------------------
	|                  |            modules            ||   artifacts   |
	|       conf       | number| search|dwnlded|evicted|| number|dwnlded|
	---------------------------------------------------------------------
	|      default     |   12  |   12  |   12  |   0   ||   12  |   12  |
	---------------------------------------------------------------------
[ivy:retrieve] :: retrieving :: org.apache.zookeeper#zookeeper
[ivy:retrieve] 	confs: [default]
[ivy:retrieve] 	12 artifacts copied, 0 already retrieved (4167kB/31ms)

clover.setup:

clover.info:

clover:

generate_jute_parser:
    [mkdir] Created dir: /home/jenkins/jenkins-slave/workspace/ZooKeeper_branch35_openjdk7/branch-3.5/build/jute_compiler/org/apache/jute/compiler/generated
[ivy:artifactproperty] DEPRECATED: 'ivy.conf.file' is deprecated, use 'ivy.settings.file' instead
[ivy:artifactproperty] :: loading settings :: file = /home/jenkins/jenkins-slave/workspace/ZooKeeper_branch35_openjdk7/branch-3.5/ivysettings.xml
     [move] Moving 1 file to /home/jenkins/jenkins-slave/workspace/ZooKeeper_branch35_openjdk7/branch-3.5/build/lib
   [javacc] Java Compiler Compiler Version 5.0 (Parser Generator)
   [javacc] (type "javacc" with no arguments for help)
   [javacc] Reading from file /home/jenkins/jenkins-slave/workspace/ZooKeeper_branch35_openjdk7/branch-3.5/src/java/main/org/apache/jute/compiler/generated/rcc.jj . . .
   [javacc] File "TokenMgrError.java" does not exist.  Will create one.
   [javacc] File "ParseException.java" does not exist.  Will create one.
   [javacc] File "Token.java" does not exist.  Will create one.
   [javacc] File "SimpleCharStream.java" does not exist.  Will create one.
   [javacc] Parser generated successfully.

jute:

BUILD FAILED
/home/jenkins/jenkins-slave/workspace/ZooKeeper_branch35_openjdk7/branch-3.5/build.xml:1322: The following error occurred while executing this line:
/home/jenkins/jenkins-slave/workspace/ZooKeeper_branch35_openjdk7/branch-3.5/build.xml:272: Unable to find a javac compiler;
com.sun.tools.javac.Main is not on the classpath.
Perhaps JAVA_HOME does not point to the JDK.
It is currently set to "/usr/lib/jvm/java-7-openjdk-amd64/jre"

Total time: 6 seconds
Build step 'Invoke Ant' marked build as failure
Archiving artifacts
Recording test results
ERROR: Step ‘Publish JUnit test result report’ failed: No test report files were found. Configuration error?
Email was triggered for: Failure - Any
Sending email for trigger: Failure - Any



###################################################################################
############################## FAILED TESTS (if any) ##############################
No tests ran.